You are viewing a plain text version of this content. The canonical link for it is here.
Posted to notifications@accumulo.apache.org by Apache Jenkins Server <je...@builds.apache.org> on 2013/09/08 00:51:31 UTC

Build failed in Jenkins: Accumulo-Trunk-Hadoop-2.0 #382

See <https://builds.apache.org/job/Accumulo-Trunk-Hadoop-2.0/382/>

------------------------------------------
Started by an SCM change
Building remotely on ubuntu3 in workspace <https://builds.apache.org/job/Accumulo-Trunk-Hadoop-2.0/ws/>
Checkout:Accumulo-Trunk-Hadoop-2.0 / <https://builds.apache.org/job/Accumulo-Trunk-Hadoop-2.0/ws/> - hudson.remoting.Channel@6b997d91:ubuntu3
Using strategy: Default
Last Built Revision: Revision f0fcd6d117918a0adb77ea1b295567860a410edb (origin/master)
Fetching changes from 1 remote Git repository
Fetching upstream changes from origin
Commencing build of Revision f0fcd6d117918a0adb77ea1b295567860a410edb (origin/master)
Checking out Revision f0fcd6d117918a0adb77ea1b295567860a410edb (origin/master)
Parsing POMs
Modules changed, recalculating dependency graph
maven3-agent.jar already up to date
maven3-interceptor.jar already up to date
maven3-interceptor-commons.jar already up to date
[Accumulo-Trunk-Hadoop-2.0] $ /home/hudson/tools/java/latest1.6/bin/java -cp /home/jenkins/jenkins-slave/maven3-agent.jar:/home/hudson/tools/maven/apache-maven-3.0.4/boot/plexus-classworlds-2.4.jar org.jvnet.hudson.maven3.agent.Maven3Main /home/hudson/tools/maven/apache-maven-3.0.4 /x1/jenkins/jenkins-slave/slave.jar /home/jenkins/jenkins-slave/maven3-interceptor.jar /home/jenkins/jenkins-slave/maven3-interceptor-commons.jar 37049
<===[JENKINS REMOTING CAPACITY]===>   channel started
log4j:WARN No appenders could be found for logger (org.apache.commons.beanutils.converters.BooleanConverter).
log4j:WARN Please initialize the log4j system properly.
Executing Maven:  -B -f <https://builds.apache.org/job/Accumulo-Trunk-Hadoop-2.0/ws/pom.xml> -Dmaven.repo.local=/home/jenkins/jenkins-slave/maven-repositories/1 clean verify -Dhadoop.profile=2.0 -Pnative
Sep 7, 2013 10:48:45 PM org.apache.maven.cli.event.ExecutionEventLogger projectDiscoveryStarted
INFO: Scanning for projects...
Sep 7, 2013 10:48:46 PM org.apache.maven.cli.event.ExecutionEventLogger sessionStarted
INFO: ------------------------------------------------------------------------
Sep 7, 2013 10:48:46 PM org.apache.maven.cli.event.ExecutionEventLogger sessionStarted
INFO: Reactor Build Order:
Sep 7, 2013 10:48:46 PM org.apache.maven.cli.event.ExecutionEventLogger sessionStarted
INFO: 
Sep 7, 2013 10:48:46 PM org.apache.maven.cli.event.ExecutionEventLogger sessionStarted
INFO: Apache Accumulo Project
Sep 7, 2013 10:48:46 PM org.apache.maven.cli.event.ExecutionEventLogger sessionStarted
INFO: Trace
Sep 7, 2013 10:48:46 PM org.apache.maven.cli.event.ExecutionEventLogger sessionStarted
INFO: Fate
Sep 7, 2013 10:48:46 PM org.apache.maven.cli.event.ExecutionEventLogger sessionStarted
INFO: Start
Sep 7, 2013 10:48:46 PM org.apache.maven.cli.event.ExecutionEventLogger sessionStarted
INFO: Core
Sep 7, 2013 10:48:46 PM org.apache.maven.cli.event.ExecutionEventLogger sessionStarted
INFO: Server
Sep 7, 2013 10:48:46 PM org.apache.maven.cli.event.ExecutionEventLogger sessionStarted
INFO: Simple Examples
Sep 7, 2013 10:48:46 PM org.apache.maven.cli.event.ExecutionEventLogger sessionStarted
INFO: MiniCluster
Sep 7, 2013 10:48:46 PM org.apache.maven.cli.event.ExecutionEventLogger sessionStarted
INFO: Accumulo Maven Plugin
Sep 7, 2013 10:48:46 PM org.apache.maven.cli.event.ExecutionEventLogger sessionStarted
INFO: Testing
Sep 7, 2013 10:48:46 PM org.apache.maven.cli.event.ExecutionEventLogger sessionStarted
INFO: Proxy
Sep 7, 2013 10:48:46 PM org.apache.maven.cli.event.ExecutionEventLogger sessionStarted
INFO: Assemblies
Sep 7, 2013 10:48:46 PM org.apache.maven.cli.event.ExecutionEventLogger sessionStarted
INFO: Documentation
Sep 7, 2013 10:48:50 PM org.apache.maven.cli.event.ExecutionEventLogger projectStarted
INFO:                                                                         
Sep 7, 2013 10:48:50 PM org.apache.maven.cli.event.ExecutionEventLogger projectStarted
INFO: ------------------------------------------------------------------------
Sep 7, 2013 10:48:50 PM org.apache.maven.cli.event.ExecutionEventLogger projectStarted
INFO: Building Apache Accumulo Project 1.6.0-SNAPSHOT
Sep 7, 2013 10:48:50 PM org.apache.maven.cli.event.ExecutionEventLogger projectStarted
INFO: ------------------------------------------------------------------------
Sep 7, 2013 10:48:50 PM org.apache.maven.cli.event.ExecutionEventLogger mojoStarted
INFO: 
Sep 7, 2013 10:48:50 PM org.apache.maven.cli.event.ExecutionEventLogger mojoStarted
INFO: --- maven-clean-plugin:2.5:clean (default-clean) @ accumulo-project ---
[INFO] Deleting <https://builds.apache.org/job/Accumulo-Trunk-Hadoop-2.0/ws/target>
[INFO] Deleting <https://builds.apache.org/job/Accumulo-Trunk-Hadoop-2.0/ws/> (includes = [**/*.pyc, **/*.so], excludes = [])
Sep 7, 2013 10:48:54 PM org.apache.maven.cli.event.ExecutionEventLogger mojoStarted
INFO: 
Sep 7, 2013 10:48:54 PM org.apache.maven.cli.event.ExecutionEventLogger mojoStarted
INFO: --- maven-sortpom-plugin:2.1.0:verify (verify-sorted-pom) @ accumulo-project ---
[INFO] Verifying file <https://builds.apache.org/job/Accumulo-Trunk-Hadoop-2.0/ws/pom.xml>
Sep 7, 2013 10:48:55 PM org.apache.maven.cli.event.ExecutionEventLogger mojoStarted
INFO: 
Sep 7, 2013 10:48:55 PM org.apache.maven.cli.event.ExecutionEventLogger mojoStarted
INFO: --- maven-enforcer-plugin:1.0.1:enforce (enforce-mvn) @ accumulo-project ---
Sep 7, 2013 10:48:55 PM org.apache.maven.cli.event.ExecutionEventLogger mojoStarted
INFO: 
Sep 7, 2013 10:48:55 PM org.apache.maven.cli.event.ExecutionEventLogger mojoStarted
INFO: --- maven-remote-resources-plugin:1.4:process (default) @ accumulo-project ---
Sep 7, 2013 10:48:55 PM org.apache.maven.cli.event.ExecutionEventLogger mojoStarted
INFO: 
Sep 7, 2013 10:48:55 PM org.apache.maven.cli.event.ExecutionEventLogger mojoStarted
INFO: --- maven-site-plugin:3.2:attach-descriptor (attach-descriptor) @ accumulo-project ---
Sep 7, 2013 10:48:56 PM org.apache.maven.cli.event.ExecutionEventLogger mojoStarted
INFO: 
Sep 7, 2013 10:48:56 PM org.apache.maven.cli.event.ExecutionEventLogger mojoStarted
INFO: --- maven-failsafe-plugin:2.12.4:integration-test (run-integration-tests) @ accumulo-project ---
[INFO] No tests to run.
[JENKINS] Recording test results
Sep 7, 2013 10:48:57 PM org.apache.maven.cli.event.ExecutionEventLogger mojoStarted
INFO: 
Sep 7, 2013 10:48:57 PM org.apache.maven.cli.event.ExecutionEventLogger mojoStarted
INFO: --- maven-failsafe-plugin:2.12.4:verify (run-integration-tests) @ accumulo-project ---
[INFO] No tests to run.
[JENKINS] Recording test resultsSep 7, 2013 10:48:57 PM org.apache.maven.cli.event.ExecutionEventLogger mojoStarted
INFO: 
Sep 7, 2013 10:48:57 PM org.apache.maven.cli.event.ExecutionEventLogger mojoStarted
INFO: --- apache-rat-plugin:0.10:check (default) @ accumulo-project ---

[INFO] 63 implicit excludes (use -debug for more details).
[INFO] No excludes explicitly specified.
[INFO] 134 resources included (use -debug for more details)
[INFO] Rat check: Summary of files. Unapproved: 4 unknown: 4 generated: 0 approved: 124 licence.
Sep 7, 2013 10:48:58 PM org.apache.maven.cli.event.ExecutionEventLogger logReactorSummary
INFO: ------------------------------------------------------------------------
Sep 7, 2013 10:48:58 PM org.apache.maven.cli.event.ExecutionEventLogger logReactorSummary
INFO: Reactor Summary:
Sep 7, 2013 10:48:58 PM org.apache.maven.cli.event.ExecutionEventLogger logReactorSummary
INFO: 
Sep 7, 2013 10:48:58 PM org.apache.maven.cli.event.ExecutionEventLogger logReactorSummary
INFO: Apache Accumulo Project ........................... FAILURE [12.006s]
Sep 7, 2013 10:48:58 PM org.apache.maven.cli.event.ExecutionEventLogger logReactorSummary
INFO: Trace ............................................. SKIPPED
Sep 7, 2013 10:48:58 PM org.apache.maven.cli.event.ExecutionEventLogger logReactorSummary
INFO: Fate .............................................. SKIPPED
Sep 7, 2013 10:48:58 PM org.apache.maven.cli.event.ExecutionEventLogger logReactorSummary
INFO: Start ............................................. SKIPPED
Sep 7, 2013 10:48:58 PM org.apache.maven.cli.event.ExecutionEventLogger logReactorSummary
INFO: Core .............................................. SKIPPED
Sep 7, 2013 10:48:58 PM org.apache.maven.cli.event.ExecutionEventLogger logReactorSummary
INFO: Server ............................................ SKIPPED
Sep 7, 2013 10:48:58 PM org.apache.maven.cli.event.ExecutionEventLogger logReactorSummary
INFO: Simple Examples ................................... SKIPPED
Sep 7, 2013 10:48:58 PM org.apache.maven.cli.event.ExecutionEventLogger logReactorSummary
INFO: MiniCluster ....................................... SKIPPED
Sep 7, 2013 10:48:58 PM org.apache.maven.cli.event.ExecutionEventLogger logReactorSummary
INFO: Accumulo Maven Plugin ............................. SKIPPED
Sep 7, 2013 10:48:58 PM org.apache.maven.cli.event.ExecutionEventLogger logReactorSummary
INFO: Testing ........................................... SKIPPED
Sep 7, 2013 10:48:58 PM org.apache.maven.cli.event.ExecutionEventLogger logReactorSummary
INFO: Proxy ............................................. SKIPPED
Sep 7, 2013 10:48:58 PM org.apache.maven.cli.event.ExecutionEventLogger logReactorSummary
INFO: Assemblies ........................................ SKIPPED
Sep 7, 2013 10:48:58 PM org.apache.maven.cli.event.ExecutionEventLogger logReactorSummary
INFO: Documentation ..................................... SKIPPED
Sep 7, 2013 10:48:58 PM org.apache.maven.cli.event.ExecutionEventLogger logResult
INFO: ------------------------------------------------------------------------
Sep 7, 2013 10:48:58 PM org.apache.maven.cli.event.ExecutionEventLogger logResult
INFO: BUILD FAILURE
Sep 7, 2013 10:48:58 PM org.apache.maven.cli.event.ExecutionEventLogger logStats
INFO: ------------------------------------------------------------------------
Sep 7, 2013 10:48:58 PM org.apache.maven.cli.event.ExecutionEventLogger logStats
INFO: Total time: 12.957s
Sep 7, 2013 10:48:58 PM org.apache.maven.cli.event.ExecutionEventLogger logStats
INFO: Finished at: Sat Sep 07 22:48:58 UTC 2013
Sep 7, 2013 10:48:58 PM org.apache.maven.cli.event.ExecutionEventLogger logStats
INFO: Final Memory: 18M/137M
Sep 7, 2013 10:48:58 PM org.apache.maven.cli.event.ExecutionEventLogger sessionEnded
INFO: ------------------------------------------------------------------------
[JENKINS] Archiving <https://builds.apache.org/job/Accumulo-Trunk-Hadoop-2.0/ws/pom.xml> to /home/hudson/hudson/jobs/Accumulo-Trunk-Hadoop-2.0/modules/org.apache.accumulo$accumulo-project/builds/2013-09-07_22-48-42/archive/org.apache.accumulo/accumulo-project/1.6.0-SNAPSHOT/accumulo-project-1.6.0-SNAPSHOT.pom
[JENKINS] Archiving <https://builds.apache.org/job/Accumulo-Trunk-Hadoop-2.0/ws/target/accumulo-project-1.6.0-SNAPSHOT-site.xml> to /home/hudson/hudson/jobs/Accumulo-Trunk-Hadoop-2.0/modules/org.apache.accumulo$accumulo-project/builds/2013-09-07_22-48-42/archive/org.apache.accumulo/accumulo-project/1.6.0-SNAPSHOT/accumulo-project-1.6.0-SNAPSHOT-site.xml
[JENKINS] Archiving <https://builds.apache.org/job/Accumulo-Trunk-Hadoop-2.0/ws/server/pom.xml> to /home/hudson/hudson/jobs/Accumulo-Trunk-Hadoop-2.0/modules/org.apache.accumulo$accumulo-server/builds/2013-09-07_22-48-42/archive/org.apache.accumulo/accumulo-server/1.6.0-SNAPSHOT/accumulo-server-1.6.0-SNAPSHOT.pom
[JENKINS] Archiving <https://builds.apache.org/job/Accumulo-Trunk-Hadoop-2.0/ws/minicluster/pom.xml> to /home/hudson/hudson/jobs/Accumulo-Trunk-Hadoop-2.0/modules/org.apache.accumulo$accumulo-minicluster/builds/2013-09-07_22-48-42/archive/org.apache.accumulo/accumulo-minicluster/1.6.0-SNAPSHOT/accumulo-minicluster-1.6.0-SNAPSHOT.pom
[JENKINS] Archiving <https://builds.apache.org/job/Accumulo-Trunk-Hadoop-2.0/ws/maven-plugin/pom.xml> to /home/hudson/hudson/jobs/Accumulo-Trunk-Hadoop-2.0/modules/org.apache.accumulo$accumulo-maven-plugin/builds/2013-09-07_22-48-42/archive/org.apache.accumulo/accumulo-maven-plugin/1.6.0-SNAPSHOT/accumulo-maven-plugin-1.6.0-SNAPSHOT.pom
[JENKINS] Archiving <https://builds.apache.org/job/Accumulo-Trunk-Hadoop-2.0/ws/examples/simple/pom.xml> to /home/hudson/hudson/jobs/Accumulo-Trunk-Hadoop-2.0/modules/org.apache.accumulo$accumulo-examples-simple/builds/2013-09-07_22-48-42/archive/org.apache.accumulo/accumulo-examples-simple/1.6.0-SNAPSHOT/accumulo-examples-simple-1.6.0-SNAPSHOT.pom
[JENKINS] Archiving <https://builds.apache.org/job/Accumulo-Trunk-Hadoop-2.0/ws/proxy/pom.xml> to /home/hudson/hudson/jobs/Accumulo-Trunk-Hadoop-2.0/modules/org.apache.accumulo$accumulo-proxy/builds/2013-09-07_22-48-42/archive/org.apache.accumulo/accumulo-proxy/1.6.0-SNAPSHOT/accumulo-proxy-1.6.0-SNAPSHOT.pom
[JENKINS] Archiving <https://builds.apache.org/job/Accumulo-Trunk-Hadoop-2.0/ws/assemble/pom.xml> to /home/hudson/hudson/jobs/Accumulo-Trunk-Hadoop-2.0/modules/org.apache.accumulo$accumulo/builds/2013-09-07_22-48-42/archive/org.apache.accumulo/accumulo/1.6.0-SNAPSHOT/accumulo-1.6.0-SNAPSHOT.pom
[JENKINS] Archiving <https://builds.apache.org/job/Accumulo-Trunk-Hadoop-2.0/ws/test/pom.xml> to /home/hudson/hudson/jobs/Accumulo-Trunk-Hadoop-2.0/modules/org.apache.accumulo$accumulo-test/builds/2013-09-07_22-48-42/archive/org.apache.accumulo/accumulo-test/1.6.0-SNAPSHOT/accumulo-test-1.6.0-SNAPSHOT.pom
[JENKINS] Archiving <https://builds.apache.org/job/Accumulo-Trunk-Hadoop-2.0/ws/start/pom.xml> to /home/hudson/hudson/jobs/Accumulo-Trunk-Hadoop-2.0/modules/org.apache.accumulo$accumulo-start/builds/2013-09-07_22-48-42/archive/org.apache.accumulo/accumulo-start/1.6.0-SNAPSHOT/accumulo-start-1.6.0-SNAPSHOT.pom
[JENKINS] Archiving <https://builds.apache.org/job/Accumulo-Trunk-Hadoop-2.0/ws/fate/pom.xml> to /home/hudson/hudson/jobs/Accumulo-Trunk-Hadoop-2.0/modules/org.apache.accumulo$accumulo-fate/builds/2013-09-07_22-48-42/archive/org.apache.accumulo/accumulo-fate/1.6.0-SNAPSHOT/accumulo-fate-1.6.0-SNAPSHOT.pom
[JENKINS] Archiving <https://builds.apache.org/job/Accumulo-Trunk-Hadoop-2.0/ws/core/pom.xml> to /home/hudson/hudson/jobs/Accumulo-Trunk-Hadoop-2.0/modules/org.apache.accumulo$accumulo-core/builds/2013-09-07_22-48-42/archive/org.apache.accumulo/accumulo-core/1.6.0-SNAPSHOT/accumulo-core-1.6.0-SNAPSHOT.pom
[JENKINS] Archiving <https://builds.apache.org/job/Accumulo-Trunk-Hadoop-2.0/ws/trace/pom.xml> to /home/hudson/hudson/jobs/Accumulo-Trunk-Hadoop-2.0/modules/org.apache.accumulo$accumulo-trace/builds/2013-09-07_22-48-42/archive/org.apache.accumulo/accumulo-trace/1.6.0-SNAPSHOT/accumulo-trace-1.6.0-SNAPSHOT.pom
[JENKINS] Archiving <https://builds.apache.org/job/Accumulo-Trunk-Hadoop-2.0/ws/docs/pom.xml> to /home/hudson/hudson/jobs/Accumulo-Trunk-Hadoop-2.0/modules/org.apache.accumulo$accumulo-docs/builds/2013-09-07_22-48-42/archive/org.apache.accumulo/accumulo-docs/1.6.0-SNAPSHOT/accumulo-docs-1.6.0-SNAPSHOT.pom
Waiting for Jenkins to finish collecting data
Sending e-mails to: notifications@accumulo.apache.org
channel stopped

Build failed in Jenkins: Accumulo-Trunk-Hadoop-2.0 #386

Posted by Apache Jenkins Server <je...@builds.apache.org>.
See <https://builds.apache.org/job/Accumulo-Trunk-Hadoop-2.0/386/>

------------------------------------------
[...truncated 508 lines...]
Running org.apache.accumulo.core.util.TextUtilTest
Tests run: 1, Failures: 0, Errors: 0, Skipped: 0, Time elapsed: 0 sec
Running org.apache.accumulo.core.util.TestStringUtil
Tests run: 1, Failures: 0, Errors: 0, Skipped: 0, Time elapsed: 0 sec
Running org.apache.accumulo.core.util.PartitionerTest
Tests run: 1, Failures: 0, Errors: 0, Skipped: 0, Time elapsed: 0.005 sec
Running org.apache.accumulo.core.util.AddressUtilTest
Tests run: 2, Failures: 0, Errors: 0, Skipped: 0, Time elapsed: 0.02 sec
Running org.apache.accumulo.core.util.MergeTest
Tests run: 1, Failures: 0, Errors: 0, Skipped: 0, Time elapsed: 0.006 sec
Running org.apache.accumulo.core.util.LocalityGroupUtilTest
Tests run: 2, Failures: 0, Errors: 0, Skipped: 0, Time elapsed: 0.021 sec
Running org.apache.accumulo.core.util.shell.ShellConfigTest
Tests run: 5, Failures: 0, Errors: 0, Skipped: 0, Time elapsed: 0.136 sec
Running org.apache.accumulo.core.util.shell.ShellTest
Tests run: 12, Failures: 0, Errors: 0, Skipped: 0, Time elapsed: 0.173 sec
Running org.apache.accumulo.core.util.shell.command.FormatterCommandTest
Tests run: 1, Failures: 0, Errors: 0, Skipped: 0, Time elapsed: 0.087 sec
Running org.apache.accumulo.core.util.shell.PasswordConverterTest
Tests run: 5, Failures: 0, Errors: 0, Skipped: 0, Time elapsed: 0.004 sec
Running org.apache.accumulo.core.util.TestVersion
Tests run: 1, Failures: 0, Errors: 0, Skipped: 0, Time elapsed: 0.002 sec
Running org.apache.accumulo.core.util.NumUtilTest
Tests run: 2, Failures: 0, Errors: 0, Skipped: 0, Time elapsed: 0.001 sec
Running org.apache.accumulo.core.metadata.MetadataServicerTest
Tests run: 2, Failures: 0, Errors: 0, Skipped: 0, Time elapsed: 0.016 sec
Running org.apache.accumulo.core.client.security.SecurityErrorCodeTest
Tests run: 1, Failures: 0, Errors: 0, Skipped: 0, Time elapsed: 0 sec
Running org.apache.accumulo.core.client.security.tokens.PasswordTokenTest
Tests run: 1, Failures: 0, Errors: 0, Skipped: 0, Time elapsed: 0.001 sec
Running org.apache.accumulo.core.client.IteratorSettingTest
Tests run: 9, Failures: 0, Errors: 0, Skipped: 0, Time elapsed: 0.002 sec
Running org.apache.accumulo.core.client.RowIteratorTest
Tests run: 2, Failures: 0, Errors: 0, Skipped: 0, Time elapsed: 0.002 sec
Running org.apache.accumulo.core.client.BatchWriterConfigTest
Tests run: 10, Failures: 0, Errors: 0, Skipped: 0, Time elapsed: 0.003 sec
Running org.apache.accumulo.core.client.impl.TabletLocatorImplTest
Tests run: 18, Failures: 0, Errors: 0, Skipped: 0, Time elapsed: 0.052 sec
Running org.apache.accumulo.core.client.impl.ScannerOptionsTest
Tests run: 2, Failures: 0, Errors: 0, Skipped: 0, Time elapsed: 0.001 sec
Running org.apache.accumulo.core.client.mock.TestBatchScanner821
Tests run: 1, Failures: 0, Errors: 0, Skipped: 0, Time elapsed: 0.015 sec
Running org.apache.accumulo.core.client.mock.MockConnectorTest
Tests run: 10, Failures: 0, Errors: 0, Skipped: 0, Time elapsed: 0.204 sec
Running org.apache.accumulo.core.client.mock.MockTableOperationsTest
Tests run: 6, Failures: 0, Errors: 0, Skipped: 0, Time elapsed: 0.283 sec
Running org.apache.accumulo.core.client.admin.FindMaxTest
Tests run: 1, Failures: 0, Errors: 0, Skipped: 0, Time elapsed: 1.376 sec
Running org.apache.accumulo.core.client.admin.TableOperationsHelperTest
Tests run: 1, Failures: 0, Errors: 0, Skipped: 0, Time elapsed: 0.002 sec
Running org.apache.accumulo.core.client.mapred.TokenFileTest
Tests run: 1, Failures: 0, Errors: 0, Skipped: 0, Time elapsed: 1.725 sec
Running org.apache.accumulo.core.client.mapred.AccumuloFileOutputFormatTest
Tests run: 4, Failures: 0, Errors: 0, Skipped: 0, Time elapsed: 3.393 sec
Running org.apache.accumulo.core.client.mapred.AccumuloOutputFormatTest
Tests run: 2, Failures: 0, Errors: 0, Skipped: 0, Time elapsed: 1.13 sec
Running org.apache.accumulo.core.client.mapred.AccumuloInputFormatTest
Tests run: 6, Failures: 0, Errors: 0, Skipped: 0, Time elapsed: 1.167 sec
Running org.apache.accumulo.core.client.mapred.AccumuloRowInputFormatTest
Tests run: 1, Failures: 0, Errors: 0, Skipped: 0, Time elapsed: 1.097 sec
Running org.apache.accumulo.core.client.lexicoder.PairLexicoderTest
Tests run: 1, Failures: 0, Errors: 0, Skipped: 0, Time elapsed: 0.004 sec
Running org.apache.accumulo.core.client.lexicoder.ULongLexicoderTest
Tests run: 2, Failures: 0, Errors: 0, Skipped: 0, Time elapsed: 0.001 sec
Running org.apache.accumulo.core.client.lexicoder.UUIDLexicoderTest
Tests run: 1, Failures: 0, Errors: 0, Skipped: 0, Time elapsed: 0.014 sec
Running org.apache.accumulo.core.client.lexicoder.LongLexicoderTest
Tests run: 1, Failures: 0, Errors: 0, Skipped: 0, Time elapsed: 0 sec
Running org.apache.accumulo.core.client.lexicoder.ReverseLexicoderTest
Tests run: 2, Failures: 0, Errors: 0, Skipped: 0, Time elapsed: 0.006 sec
Running org.apache.accumulo.core.client.lexicoder.BigIntegerLexicoderTest
Tests run: 1, Failures: 0, Errors: 0, Skipped: 0, Time elapsed: 0.002 sec
Running org.apache.accumulo.core.client.lexicoder.ListLexicoderTest
Tests run: 1, Failures: 0, Errors: 0, Skipped: 0, Time elapsed: 0.001 sec
Running org.apache.accumulo.core.client.lexicoder.UIntegerLexicoderTest
Tests run: 1, Failures: 0, Errors: 0, Skipped: 0, Time elapsed: 0.001 sec
Running org.apache.accumulo.core.client.lexicoder.DoubleLexicoderTest
Tests run: 1, Failures: 0, Errors: 0, Skipped: 0, Time elapsed: 0 sec
Running org.apache.accumulo.core.client.lexicoder.IntegerLexicoderTest
Tests run: 1, Failures: 0, Errors: 0, Skipped: 0, Time elapsed: 0.001 sec
Running org.apache.accumulo.core.client.TestThrift1474
Tests run: 1, Failures: 0, Errors: 0, Skipped: 0, Time elapsed: 0.053 sec
Running org.apache.accumulo.core.client.ClientSideIteratorTest
Tests run: 2, Failures: 0, Errors: 0, Skipped: 0, Time elapsed: 0.017 sec
Running org.apache.accumulo.core.client.mapreduce.TokenFileTest
Tests run: 1, Failures: 0, Errors: 0, Skipped: 0, Time elapsed: 1.143 sec
Running org.apache.accumulo.core.client.mapreduce.AccumuloFileOutputFormatTest
Tests run: 4, Failures: 0, Errors: 0, Skipped: 0, Time elapsed: 3.314 sec
Running org.apache.accumulo.core.client.mapreduce.AccumuloOutputFormatTest
Tests run: 2, Failures: 0, Errors: 0, Skipped: 0, Time elapsed: 1.111 sec
Running org.apache.accumulo.core.client.mapreduce.AccumuloInputFormatTest
Tests run: 6, Failures: 0, Errors: 0, Skipped: 0, Time elapsed: 1.148 sec
Running org.apache.accumulo.core.client.mapreduce.AccumuloRowInputFormatTest
Tests run: 1, Failures: 0, Errors: 0, Skipped: 0, Time elapsed: 1.091 sec
Running org.apache.accumulo.core.client.mapreduce.lib.util.ConfiguratorBaseTest
Tests run: 6, Failures: 0, Errors: 0, Skipped: 0, Time elapsed: 0.058 sec
Running org.apache.accumulo.core.client.mapreduce.lib.partition.RangePartitionerTest
Tests run: 2, Failures: 0, Errors: 0, Skipped: 0, Time elapsed: 0.676 sec
Running org.apache.accumulo.core.iterators.system.VisibilityFilterTest
Tests run: 1, Failures: 0, Errors: 0, Skipped: 0, Time elapsed: 0 sec
Running org.apache.accumulo.core.iterators.system.SourceSwitchingIteratorTest
Tests run: 5, Failures: 0, Errors: 0, Skipped: 0, Time elapsed: 0.003 sec
Running org.apache.accumulo.core.iterators.system.DeletingIteratorTest
Tests run: 4, Failures: 0, Errors: 0, Skipped: 0, Time elapsed: 0.002 sec
Running org.apache.accumulo.core.iterators.system.ColumnFilterTest
Tests run: 3, Failures: 0, Errors: 0, Skipped: 0, Time elapsed: 0.003 sec
Running org.apache.accumulo.core.iterators.system.ColumnFamilySkippingIteratorTest
Tests run: 3, Failures: 0, Errors: 0, Skipped: 0, Time elapsed: 0.593 sec
Running org.apache.accumulo.core.iterators.system.MultiIteratorTest
Tests run: 7, Failures: 0, Errors: 0, Skipped: 0, Time elapsed: 0.199 sec
Running org.apache.accumulo.core.iterators.system.TimeSettingIteratorTest
Tests run: 1, Failures: 0, Errors: 0, Skipped: 0, Time elapsed: 0 sec
Running org.apache.accumulo.core.iterators.FirstEntryInRowTest
Tests run: 2, Failures: 0, Errors: 0, Skipped: 0, Time elapsed: 0.015 sec
Running org.apache.accumulo.core.iterators.aggregation.NumSummationTest
Tests run: 5, Failures: 0, Errors: 0, Skipped: 0, Time elapsed: 0.002 sec
Running org.apache.accumulo.core.iterators.aggregation.conf.AggregatorConfigurationTest
Tests run: 2, Failures: 0, Errors: 0, Skipped: 0, Time elapsed: 0.004 sec
Running org.apache.accumulo.core.iterators.user.VisibilityFilterTest
Tests run: 9, Failures: 0, Errors: 0, Skipped: 0, Time elapsed: 0.074 sec
Running org.apache.accumulo.core.iterators.user.GrepIteratorTest
Tests run: 1, Failures: 0, Errors: 0, Skipped: 0, Time elapsed: 0.001 sec
Running org.apache.accumulo.core.iterators.user.BigDecimalCombinerTest
Tests run: 1, Failures: 0, Errors: 0, Skipped: 0, Time elapsed: 0.002 sec
Running org.apache.accumulo.core.iterators.user.LargeRowFilterTest
Tests run: 5, Failures: 0, Errors: 0, Skipped: 0, Time elapsed: 0.067 sec
Running org.apache.accumulo.core.iterators.user.FilterTest
Tests run: 11, Failures: 0, Errors: 0, Skipped: 0, Time elapsed: 0.062 sec
Running org.apache.accumulo.core.iterators.user.TransformingIteratorTest
Tests run: 16, Failures: 0, Errors: 0, Skipped: 0, Time elapsed: 0.112 sec
Running org.apache.accumulo.core.iterators.user.CombinerTest
Tests run: 14, Failures: 0, Errors: 0, Skipped: 0, Time elapsed: 0.009 sec
Running org.apache.accumulo.core.iterators.user.WholeColumnFamilyIteratorTest
Tests run: 3, Failures: 0, Errors: 0, Skipped: 0, Time elapsed: 0.002 sec
Running org.apache.accumulo.core.iterators.user.RegExFilterTest
Tests run: 1, Failures: 0, Errors: 0, Skipped: 0, Time elapsed: 0.003 sec
Running org.apache.accumulo.core.iterators.user.IndexedDocIteratorTest
Tests run: 5, Failures: 0, Errors: 0, Skipped: 0, Time elapsed: 0.965 sec
Running org.apache.accumulo.core.iterators.user.RowDeletingIteratorTest
Tests run: 4, Failures: 0, Errors: 0, Skipped: 0, Time elapsed: 0.002 sec
Running org.apache.accumulo.core.iterators.user.WholeRowIteratorTest
Tests run: 3, Failures: 0, Errors: 0, Skipped: 0, Time elapsed: 0.001 sec
Running org.apache.accumulo.core.iterators.user.IntersectingIteratorTest
Tests run: 6, Failures: 0, Errors: 0, Skipped: 0, Time elapsed: 0.789 sec
Running org.apache.accumulo.core.iterators.user.RowFilterTest
Tests run: 1, Failures: 0, Errors: 0, Skipped: 0, Time elapsed: 0.011 sec
Running org.apache.accumulo.core.iterators.user.VersioningIteratorTest
Tests run: 6, Failures: 0, Errors: 0, Skipped: 0, Time elapsed: 0.003 sec
Running org.apache.accumulo.core.iterators.AggregatingIteratorTest
Tests run: 7, Failures: 0, Errors: 0, Skipped: 0, Time elapsed: 0.003 sec
Running org.apache.accumulo.core.iterators.IterUtilTest
Tests run: 5, Failures: 0, Errors: 0, Skipped: 0, Time elapsed: 0.002 sec
Running org.apache.accumulo.core.iterators.FirstEntryInRowIteratorTest
Tests run: 1, Failures: 0, Errors: 0, Skipped: 0, Time elapsed: 0.001 sec
Running org.apache.accumulo.core.conf.PropertyTest
Tests run: 5, Failures: 0, Errors: 0, Skipped: 0, Time elapsed: 0.014 sec
Running org.apache.accumulo.core.file.FileOperationsTest
Tests run: 1, Failures: 0, Errors: 0, Skipped: 0, Time elapsed: 0.025 sec
Running org.apache.accumulo.core.file.blockfile.cache.TestCachedBlockQueue
Tests run: 2, Failures: 0, Errors: 0, Skipped: 0, Time elapsed: 0.001 sec
Running org.apache.accumulo.core.file.blockfile.cache.TestLruBlockCache
Tests run: 7, Failures: 0, Errors: 0, Skipped: 0, Time elapsed: 1.029 sec
Running org.apache.accumulo.core.file.rfile.RFileTest
Tests run: 40, Failures: 0, Errors: 0, Skipped: 0, Time elapsed: 4.548 sec
Running org.apache.accumulo.core.file.rfile.RelativeKeyTest
Tests run: 6, Failures: 0, Errors: 0, Skipped: 0, Time elapsed: 0.009 sec
Running org.apache.accumulo.core.file.rfile.BlockIndexTest
Tests run: 2, Failures: 0, Errors: 0, Skipped: 0, Time elapsed: 0.029 sec
Running org.apache.accumulo.core.file.rfile.MultiLevelIndexTest
Tests run: 1, Failures: 0, Errors: 0, Skipped: 0, Time elapsed: 0.757 sec

Results :

Tests run: 452, Failures: 0, Errors: 0, Skipped: 0

[JENKINS] Recording test results
Sep 9, 2013 5:50:59 PM org.apache.maven.cli.event.ExecutionEventLogger mojoStarted
INFO: 
Sep 9, 2013 5:50:59 PM org.apache.maven.cli.event.ExecutionEventLogger mojoStarted
INFO: --- maven-jar-plugin:2.4:jar (default-jar) @ accumulo-core ---
[INFO] Building jar: <https://builds.apache.org/job/Accumulo-Trunk-Hadoop-2.0/ws/core/target/accumulo-core-1.6.0-SNAPSHOT.jar>
Sep 9, 2013 5:51:01 PM org.apache.maven.cli.event.ExecutionEventLogger logReactorSummary
INFO: ------------------------------------------------------------------------
Sep 9, 2013 5:51:01 PM org.apache.maven.cli.event.ExecutionEventLogger logReactorSummary
INFO: Reactor Summary:
Sep 9, 2013 5:51:01 PM org.apache.maven.cli.event.ExecutionEventLogger logReactorSummary
INFO: 
Sep 9, 2013 5:51:01 PM org.apache.maven.cli.event.ExecutionEventLogger logReactorSummary
INFO: Apache Accumulo Project ........................... SUCCESS [35.473s]
Sep 9, 2013 5:51:01 PM org.apache.maven.cli.event.ExecutionEventLogger logReactorSummary
INFO: Trace ............................................. SUCCESS [8.367s]
Sep 9, 2013 5:51:01 PM org.apache.maven.cli.event.ExecutionEventLogger logReactorSummary
INFO: Fate .............................................. SUCCESS [4.307s]
Sep 9, 2013 5:51:01 PM org.apache.maven.cli.event.ExecutionEventLogger logReactorSummary
INFO: Start ............................................. SUCCESS [40.906s]
Sep 9, 2013 5:51:01 PM org.apache.maven.cli.event.ExecutionEventLogger logReactorSummary
INFO: Core .............................................. FAILURE [51.797s]
Sep 9, 2013 5:51:01 PM org.apache.maven.cli.event.ExecutionEventLogger logReactorSummary
INFO: Server ............................................ SKIPPED
Sep 9, 2013 5:51:01 PM org.apache.maven.cli.event.ExecutionEventLogger logReactorSummary
INFO: Simple Examples ................................... SKIPPED
Sep 9, 2013 5:51:01 PM org.apache.maven.cli.event.ExecutionEventLogger logReactorSummary
INFO: MiniCluster ....................................... SKIPPED
Sep 9, 2013 5:51:01 PM org.apache.maven.cli.event.ExecutionEventLogger logReactorSummary
INFO: Accumulo Maven Plugin ............................. SKIPPED
Sep 9, 2013 5:51:01 PM org.apache.maven.cli.event.ExecutionEventLogger logReactorSummary
INFO: Testing ........................................... SKIPPED
Sep 9, 2013 5:51:01 PM org.apache.maven.cli.event.ExecutionEventLogger logReactorSummary
INFO: Proxy ............................................. SKIPPED
Sep 9, 2013 5:51:01 PM org.apache.maven.cli.event.ExecutionEventLogger logReactorSummary
INFO: Assemblies ........................................ SKIPPED
Sep 9, 2013 5:51:01 PM org.apache.maven.cli.event.ExecutionEventLogger logReactorSummary
INFO: Documentation ..................................... SKIPPED
Sep 9, 2013 5:51:01 PM org.apache.maven.cli.event.ExecutionEventLogger logResult
INFO: ------------------------------------------------------------------------
Sep 9, 2013 5:51:01 PM org.apache.maven.cli.event.ExecutionEventLogger logResult
INFO: BUILD FAILURE
Sep 9, 2013 5:51:01 PM org.apache.maven.cli.event.ExecutionEventLogger logStats
INFO: ------------------------------------------------------------------------
Sep 9, 2013 5:51:01 PM org.apache.maven.cli.event.ExecutionEventLogger logStats
INFO: Total time: 2:25.014s
Sep 9, 2013 5:51:01 PM org.apache.maven.cli.event.ExecutionEventLogger logStats
INFO: Finished at: Mon Sep 09 17:51:01 UTC 2013
Sep 9, 2013 5:51:01 PM org.apache.maven.cli.event.ExecutionEventLogger logStats
INFO: Final Memory: 33M/214M
Sep 9, 2013 5:51:01 PM org.apache.maven.cli.event.ExecutionEventLogger sessionEnded
INFO: ------------------------------------------------------------------------
[JENKINS] Archiving <https://builds.apache.org/job/Accumulo-Trunk-Hadoop-2.0/ws/pom.xml> to /home/hudson/hudson/jobs/Accumulo-Trunk-Hadoop-2.0/modules/org.apache.accumulo$accumulo-project/builds/2013-09-09_17-48-25/archive/org.apache.accumulo/accumulo-project/1.6.0-SNAPSHOT/accumulo-project-1.6.0-SNAPSHOT.pom
[JENKINS] Archiving <https://builds.apache.org/job/Accumulo-Trunk-Hadoop-2.0/ws/target/accumulo-project-1.6.0-SNAPSHOT-site.xml> to /home/hudson/hudson/jobs/Accumulo-Trunk-Hadoop-2.0/modules/org.apache.accumulo$accumulo-project/builds/2013-09-09_17-48-25/archive/org.apache.accumulo/accumulo-project/1.6.0-SNAPSHOT/accumulo-project-1.6.0-SNAPSHOT-site.xml
[JENKINS] Archiving <https://builds.apache.org/job/Accumulo-Trunk-Hadoop-2.0/ws/server/pom.xml> to /home/hudson/hudson/jobs/Accumulo-Trunk-Hadoop-2.0/modules/org.apache.accumulo$accumulo-server/builds/2013-09-09_17-48-25/archive/org.apache.accumulo/accumulo-server/1.6.0-SNAPSHOT/accumulo-server-1.6.0-SNAPSHOT.pom
[JENKINS] Archiving <https://builds.apache.org/job/Accumulo-Trunk-Hadoop-2.0/ws/minicluster/pom.xml> to /home/hudson/hudson/jobs/Accumulo-Trunk-Hadoop-2.0/modules/org.apache.accumulo$accumulo-minicluster/builds/2013-09-09_17-48-25/archive/org.apache.accumulo/accumulo-minicluster/1.6.0-SNAPSHOT/accumulo-minicluster-1.6.0-SNAPSHOT.pom
[JENKINS] Archiving <https://builds.apache.org/job/Accumulo-Trunk-Hadoop-2.0/ws/maven-plugin/pom.xml> to /home/hudson/hudson/jobs/Accumulo-Trunk-Hadoop-2.0/modules/org.apache.accumulo$accumulo-maven-plugin/builds/2013-09-09_17-48-25/archive/org.apache.accumulo/accumulo-maven-plugin/1.6.0-SNAPSHOT/accumulo-maven-plugin-1.6.0-SNAPSHOT.pom
[JENKINS] Archiving <https://builds.apache.org/job/Accumulo-Trunk-Hadoop-2.0/ws/examples/simple/pom.xml> to /home/hudson/hudson/jobs/Accumulo-Trunk-Hadoop-2.0/modules/org.apache.accumulo$accumulo-examples-simple/builds/2013-09-09_17-48-25/archive/org.apache.accumulo/accumulo-examples-simple/1.6.0-SNAPSHOT/accumulo-examples-simple-1.6.0-SNAPSHOT.pom
[JENKINS] Archiving <https://builds.apache.org/job/Accumulo-Trunk-Hadoop-2.0/ws/proxy/pom.xml> to /home/hudson/hudson/jobs/Accumulo-Trunk-Hadoop-2.0/modules/org.apache.accumulo$accumulo-proxy/builds/2013-09-09_17-48-25/archive/org.apache.accumulo/accumulo-proxy/1.6.0-SNAPSHOT/accumulo-proxy-1.6.0-SNAPSHOT.pom
[JENKINS] Archiving <https://builds.apache.org/job/Accumulo-Trunk-Hadoop-2.0/ws/assemble/pom.xml> to /home/hudson/hudson/jobs/Accumulo-Trunk-Hadoop-2.0/modules/org.apache.accumulo$accumulo/builds/2013-09-09_17-48-25/archive/org.apache.accumulo/accumulo/1.6.0-SNAPSHOT/accumulo-1.6.0-SNAPSHOT.pom
[JENKINS] Archiving <https://builds.apache.org/job/Accumulo-Trunk-Hadoop-2.0/ws/test/pom.xml> to /home/hudson/hudson/jobs/Accumulo-Trunk-Hadoop-2.0/modules/org.apache.accumulo$accumulo-test/builds/2013-09-09_17-48-25/archive/org.apache.accumulo/accumulo-test/1.6.0-SNAPSHOT/accumulo-test-1.6.0-SNAPSHOT.pom
[JENKINS] Archiving <https://builds.apache.org/job/Accumulo-Trunk-Hadoop-2.0/ws/start/pom.xml> to /home/hudson/hudson/jobs/Accumulo-Trunk-Hadoop-2.0/modules/org.apache.accumulo$accumulo-start/builds/2013-09-09_17-48-25/archive/org.apache.accumulo/accumulo-start/1.6.0-SNAPSHOT/accumulo-start-1.6.0-SNAPSHOT.pom
[JENKINS] Archiving <https://builds.apache.org/job/Accumulo-Trunk-Hadoop-2.0/ws/start/target/accumulo-start-1.6.0-SNAPSHOT.jar> to /home/hudson/hudson/jobs/Accumulo-Trunk-Hadoop-2.0/modules/org.apache.accumulo$accumulo-start/builds/2013-09-09_17-48-25/archive/org.apache.accumulo/accumulo-start/1.6.0-SNAPSHOT/accumulo-start-1.6.0-SNAPSHOT.jar
[JENKINS] Archiving <https://builds.apache.org/job/Accumulo-Trunk-Hadoop-2.0/ws/fate/pom.xml> to /home/hudson/hudson/jobs/Accumulo-Trunk-Hadoop-2.0/modules/org.apache.accumulo$accumulo-fate/builds/2013-09-09_17-48-25/archive/org.apache.accumulo/accumulo-fate/1.6.0-SNAPSHOT/accumulo-fate-1.6.0-SNAPSHOT.pom
[JENKINS] Archiving <https://builds.apache.org/job/Accumulo-Trunk-Hadoop-2.0/ws/fate/target/accumulo-fate-1.6.0-SNAPSHOT.jar> to /home/hudson/hudson/jobs/Accumulo-Trunk-Hadoop-2.0/modules/org.apache.accumulo$accumulo-fate/builds/2013-09-09_17-48-25/archive/org.apache.accumulo/accumulo-fate/1.6.0-SNAPSHOT/accumulo-fate-1.6.0-SNAPSHOT.jar
[JENKINS] Archiving <https://builds.apache.org/job/Accumulo-Trunk-Hadoop-2.0/ws/core/pom.xml> to /home/hudson/hudson/jobs/Accumulo-Trunk-Hadoop-2.0/modules/org.apache.accumulo$accumulo-core/builds/2013-09-09_17-48-25/archive/org.apache.accumulo/accumulo-core/1.6.0-SNAPSHOT/accumulo-core-1.6.0-SNAPSHOT.pom
[JENKINS] Archiving <https://builds.apache.org/job/Accumulo-Trunk-Hadoop-2.0/ws/core/target/accumulo-core-1.6.0-SNAPSHOT.jar> to /home/hudson/hudson/jobs/Accumulo-Trunk-Hadoop-2.0/modules/org.apache.accumulo$accumulo-core/builds/2013-09-09_17-48-25/archive/org.apache.accumulo/accumulo-core/1.6.0-SNAPSHOT/accumulo-core-1.6.0-SNAPSHOT.jar
[JENKINS] Archiving <https://builds.apache.org/job/Accumulo-Trunk-Hadoop-2.0/ws/trace/pom.xml> to /home/hudson/hudson/jobs/Accumulo-Trunk-Hadoop-2.0/modules/org.apache.accumulo$accumulo-trace/builds/2013-09-09_17-48-25/archive/org.apache.accumulo/accumulo-trace/1.6.0-SNAPSHOT/accumulo-trace-1.6.0-SNAPSHOT.pom
[JENKINS] Archiving <https://builds.apache.org/job/Accumulo-Trunk-Hadoop-2.0/ws/trace/target/accumulo-trace-1.6.0-SNAPSHOT.jar> to /home/hudson/hudson/jobs/Accumulo-Trunk-Hadoop-2.0/modules/org.apache.accumulo$accumulo-trace/builds/2013-09-09_17-48-25/archive/org.apache.accumulo/accumulo-trace/1.6.0-SNAPSHOT/accumulo-trace-1.6.0-SNAPSHOT.jar
[JENKINS] Archiving <https://builds.apache.org/job/Accumulo-Trunk-Hadoop-2.0/ws/docs/pom.xml> to /home/hudson/hudson/jobs/Accumulo-Trunk-Hadoop-2.0/modules/org.apache.accumulo$accumulo-docs/builds/2013-09-09_17-48-25/archive/org.apache.accumulo/accumulo-docs/1.6.0-SNAPSHOT/accumulo-docs-1.6.0-SNAPSHOT.pom
Waiting for Jenkins to finish collecting data
Sending e-mails to: notifications@accumulo.apache.org
Sending e-mails to: notifications@accumulo.apache.org
channel stopped

Build failed in Jenkins: Accumulo-Trunk-Hadoop-2.0 #385

Posted by Apache Jenkins Server <je...@builds.apache.org>.
See <https://builds.apache.org/job/Accumulo-Trunk-Hadoop-2.0/385/changes>

Changes:

[jvines] ACCUMULO-1618 - adding trash variable checks to dispersed WAL cleanup code

------------------------------------------
Started by an SCM change
Building remotely on ubuntu1 in workspace <https://builds.apache.org/job/Accumulo-Trunk-Hadoop-2.0/ws/>
Checkout:Accumulo-Trunk-Hadoop-2.0 / <https://builds.apache.org/job/Accumulo-Trunk-Hadoop-2.0/ws/> - hudson.remoting.Channel@5dc71417:ubuntu1
Using strategy: Default
Last Built Revision: Revision a028e763b0ef1785039d3b0dcb7e04dee18f4f5b (origin/master)
Fetching changes from 1 remote Git repository
Fetching upstream changes from origin
Commencing build of Revision 2a2f42464c46e9e56ee9ce3fbd0da70ecd974661 (origin/master)
Checking out Revision 2a2f42464c46e9e56ee9ce3fbd0da70ecd974661 (origin/master)
Parsing POMs
Modules changed, recalculating dependency graph
maven3-agent.jar already up to date
maven3-interceptor.jar already up to date
maven3-interceptor-commons.jar already up to date
[Accumulo-Trunk-Hadoop-2.0] $ /home/hudson/tools/java/latest1.6/bin/java -cp /home/jenkins/jenkins-slave/maven3-agent.jar:/home/hudson/tools/maven/apache-maven-3.0.4/boot/plexus-classworlds-2.4.jar org.jvnet.hudson.maven3.agent.Maven3Main /home/hudson/tools/maven/apache-maven-3.0.4 /home/jenkins/jenkins-slave/slave.jar /home/jenkins/jenkins-slave/maven3-interceptor.jar /home/jenkins/jenkins-slave/maven3-interceptor-commons.jar 38102
<===[JENKINS REMOTING CAPACITY]===>channel started
   log4j:WARN No appenders could be found for logger (org.apache.commons.beanutils.converters.BooleanConverter).
log4j:WARN Please initialize the log4j system properly.
Executing Maven:  -B -f <https://builds.apache.org/job/Accumulo-Trunk-Hadoop-2.0/ws/pom.xml> -Dmaven.repo.local=/home/jenkins/jenkins-slave/maven-repositories/1 clean verify -Dhadoop.profile=2.0 -Pnative
Sep 9, 2013 4:41:11 PM org.apache.maven.cli.event.ExecutionEventLogger projectDiscoveryStarted
INFO: Scanning for projects...
Sep 9, 2013 4:41:12 PM org.apache.maven.cli.event.ExecutionEventLogger sessionStarted
INFO: ------------------------------------------------------------------------
Sep 9, 2013 4:41:12 PM org.apache.maven.cli.event.ExecutionEventLogger sessionStarted
INFO: Reactor Build Order:
Sep 9, 2013 4:41:12 PM org.apache.maven.cli.event.ExecutionEventLogger sessionStarted
INFO: 
Sep 9, 2013 4:41:12 PM org.apache.maven.cli.event.ExecutionEventLogger sessionStarted
INFO: Apache Accumulo Project
Sep 9, 2013 4:41:12 PM org.apache.maven.cli.event.ExecutionEventLogger sessionStarted
INFO: Trace
Sep 9, 2013 4:41:12 PM org.apache.maven.cli.event.ExecutionEventLogger sessionStarted
INFO: Fate
Sep 9, 2013 4:41:12 PM org.apache.maven.cli.event.ExecutionEventLogger sessionStarted
INFO: Start
Sep 9, 2013 4:41:12 PM org.apache.maven.cli.event.ExecutionEventLogger sessionStarted
INFO: Core
Sep 9, 2013 4:41:12 PM org.apache.maven.cli.event.ExecutionEventLogger sessionStarted
INFO: Server
Sep 9, 2013 4:41:12 PM org.apache.maven.cli.event.ExecutionEventLogger sessionStarted
INFO: Simple Examples
Sep 9, 2013 4:41:12 PM org.apache.maven.cli.event.ExecutionEventLogger sessionStarted
INFO: MiniCluster
Sep 9, 2013 4:41:12 PM org.apache.maven.cli.event.ExecutionEventLogger sessionStarted
INFO: Accumulo Maven Plugin
Sep 9, 2013 4:41:12 PM org.apache.maven.cli.event.ExecutionEventLogger sessionStarted
INFO: Testing
Sep 9, 2013 4:41:12 PM org.apache.maven.cli.event.ExecutionEventLogger sessionStarted
INFO: Proxy
Sep 9, 2013 4:41:12 PM org.apache.maven.cli.event.ExecutionEventLogger sessionStarted
INFO: Assemblies
Sep 9, 2013 4:41:12 PM org.apache.maven.cli.event.ExecutionEventLogger sessionStarted
INFO: Documentation
Sep 9, 2013 4:41:16 PM org.apache.maven.cli.event.ExecutionEventLogger projectStarted
INFO:                                                                         
Sep 9, 2013 4:41:16 PM org.apache.maven.cli.event.ExecutionEventLogger projectStarted
INFO: ------------------------------------------------------------------------
Sep 9, 2013 4:41:16 PM org.apache.maven.cli.event.ExecutionEventLogger projectStarted
INFO: Building Apache Accumulo Project 1.6.0-SNAPSHOT
Sep 9, 2013 4:41:16 PM org.apache.maven.cli.event.ExecutionEventLogger projectStarted
INFO: ------------------------------------------------------------------------
Sep 9, 2013 4:41:17 PM org.apache.maven.cli.event.ExecutionEventLogger mojoStarted
INFO: 
Sep 9, 2013 4:41:17 PM org.apache.maven.cli.event.ExecutionEventLogger mojoStarted
INFO: --- maven-clean-plugin:2.5:clean (default-clean) @ accumulo-project ---
[INFO] Deleting <https://builds.apache.org/job/Accumulo-Trunk-Hadoop-2.0/ws/target>
[INFO] Deleting <https://builds.apache.org/job/Accumulo-Trunk-Hadoop-2.0/ws/> (includes = [**/*.pyc, **/*.so], excludes = [])
Sep 9, 2013 4:41:40 PM org.apache.maven.cli.event.ExecutionEventLogger mojoStarted
INFO: 
Sep 9, 2013 4:41:40 PM org.apache.maven.cli.event.ExecutionEventLogger mojoStarted
INFO: --- maven-sortpom-plugin:2.1.0:verify (verify-sorted-pom) @ accumulo-project ---
[INFO] Verifying file <https://builds.apache.org/job/Accumulo-Trunk-Hadoop-2.0/ws/pom.xml>
Sep 9, 2013 4:41:41 PM org.apache.maven.cli.event.ExecutionEventLogger mojoStarted
INFO: 
Sep 9, 2013 4:41:41 PM org.apache.maven.cli.event.ExecutionEventLogger mojoStarted
INFO: --- maven-enforcer-plugin:1.0.1:enforce (enforce-mvn) @ accumulo-project ---
Sep 9, 2013 4:41:41 PM org.apache.maven.cli.event.ExecutionEventLogger mojoStarted
INFO: 
Sep 9, 2013 4:41:41 PM org.apache.maven.cli.event.ExecutionEventLogger mojoStarted
INFO: --- maven-remote-resources-plugin:1.4:process (default) @ accumulo-project ---
Sep 9, 2013 4:41:42 PM org.apache.maven.cli.event.ExecutionEventLogger mojoStarted
INFO: 
Sep 9, 2013 4:41:42 PM org.apache.maven.cli.event.ExecutionEventLogger mojoStarted
INFO: --- maven-site-plugin:3.2:attach-descriptor (attach-descriptor) @ accumulo-project ---
Sep 9, 2013 4:41:42 PM org.apache.maven.cli.event.ExecutionEventLogger mojoStarted
INFO: 
Sep 9, 2013 4:41:42 PM org.apache.maven.cli.event.ExecutionEventLogger mojoStarted
INFO: --- maven-failsafe-plugin:2.12.4:integration-test (run-integration-tests) @ accumulo-project ---
[INFO] No tests to run.
[JENKINS] Recording test results
Sep 9, 2013 4:41:47 PM org.apache.maven.cli.event.ExecutionEventLogger mojoStarted
INFO: 
Sep 9, 2013 4:41:47 PM org.apache.maven.cli.event.ExecutionEventLogger mojoStarted
INFO: --- maven-failsafe-plugin:2.12.4:verify (run-integration-tests) @ accumulo-project ---
[INFO] No tests to run.
Sep 9, 2013 4:41:47 PM org.apache.maven.cli.event.ExecutionEventLogger mojoStarted
[JENKINS] Recording test resultsINFO: 
Sep 9, 2013 4:41:47 PM org.apache.maven.cli.event.ExecutionEventLogger mojoStarted
INFO: --- apache-rat-plugin:0.10:check (default) @ accumulo-project ---

[INFO] 63 implicit excludes (use -debug for more details).
[INFO] No excludes explicitly specified.
[INFO] 134 resources included (use -debug for more details)
[INFO] Rat check: Summary of files. Unapproved: 4 unknown: 4 generated: 0 approved: 124 licence.
Sep 9, 2013 4:41:49 PM org.apache.maven.cli.event.ExecutionEventLogger logReactorSummary
INFO: ------------------------------------------------------------------------
Sep 9, 2013 4:41:49 PM org.apache.maven.cli.event.ExecutionEventLogger logReactorSummary
INFO: Reactor Summary:
Sep 9, 2013 4:41:49 PM org.apache.maven.cli.event.ExecutionEventLogger logReactorSummary
INFO: 
Sep 9, 2013 4:41:49 PM org.apache.maven.cli.event.ExecutionEventLogger logReactorSummary
INFO: Apache Accumulo Project ........................... FAILURE [35.043s]
Sep 9, 2013 4:41:49 PM org.apache.maven.cli.event.ExecutionEventLogger logReactorSummary
INFO: Trace ............................................. SKIPPED
Sep 9, 2013 4:41:49 PM org.apache.maven.cli.event.ExecutionEventLogger logReactorSummary
INFO: Fate .............................................. SKIPPED
Sep 9, 2013 4:41:49 PM org.apache.maven.cli.event.ExecutionEventLogger logReactorSummary
INFO: Start ............................................. SKIPPED
Sep 9, 2013 4:41:49 PM org.apache.maven.cli.event.ExecutionEventLogger logReactorSummary
INFO: Core .............................................. SKIPPED
Sep 9, 2013 4:41:49 PM org.apache.maven.cli.event.ExecutionEventLogger logReactorSummary
INFO: Server ............................................ SKIPPED
Sep 9, 2013 4:41:49 PM org.apache.maven.cli.event.ExecutionEventLogger logReactorSummary
INFO: Simple Examples ................................... SKIPPED
Sep 9, 2013 4:41:49 PM org.apache.maven.cli.event.ExecutionEventLogger logReactorSummary
INFO: MiniCluster ....................................... SKIPPED
Sep 9, 2013 4:41:49 PM org.apache.maven.cli.event.ExecutionEventLogger logReactorSummary
INFO: Accumulo Maven Plugin ............................. SKIPPED
Sep 9, 2013 4:41:49 PM org.apache.maven.cli.event.ExecutionEventLogger logReactorSummary
INFO: Testing ........................................... SKIPPED
Sep 9, 2013 4:41:49 PM org.apache.maven.cli.event.ExecutionEventLogger logReactorSummary
INFO: Proxy ............................................. SKIPPED
Sep 9, 2013 4:41:49 PM org.apache.maven.cli.event.ExecutionEventLogger logReactorSummary
INFO: Assemblies ........................................ SKIPPED
Sep 9, 2013 4:41:49 PM org.apache.maven.cli.event.ExecutionEventLogger logReactorSummary
INFO: Documentation ..................................... SKIPPED
Sep 9, 2013 4:41:49 PM org.apache.maven.cli.event.ExecutionEventLogger logResult
INFO: ------------------------------------------------------------------------
Sep 9, 2013 4:41:49 PM org.apache.maven.cli.event.ExecutionEventLogger logResult
INFO: BUILD FAILURE
Sep 9, 2013 4:41:49 PM org.apache.maven.cli.event.ExecutionEventLogger logStats
INFO: ------------------------------------------------------------------------
Sep 9, 2013 4:41:49 PM org.apache.maven.cli.event.ExecutionEventLogger logStats
INFO: Total time: 37.345s
Sep 9, 2013 4:41:49 PM org.apache.maven.cli.event.ExecutionEventLogger logStats
INFO: Finished at: Mon Sep 09 16:41:49 UTC 2013
Sep 9, 2013 4:41:49 PM org.apache.maven.cli.event.ExecutionEventLogger logStats
INFO: Final Memory: 18M/125M
Sep 9, 2013 4:41:49 PM org.apache.maven.cli.event.ExecutionEventLogger sessionEnded
INFO: ------------------------------------------------------------------------
[JENKINS] Archiving <https://builds.apache.org/job/Accumulo-Trunk-Hadoop-2.0/ws/pom.xml> to /home/hudson/hudson/jobs/Accumulo-Trunk-Hadoop-2.0/modules/org.apache.accumulo$accumulo-project/builds/2013-09-09_16-40-59/archive/org.apache.accumulo/accumulo-project/1.6.0-SNAPSHOT/accumulo-project-1.6.0-SNAPSHOT.pom
[JENKINS] Archiving <https://builds.apache.org/job/Accumulo-Trunk-Hadoop-2.0/ws/target/accumulo-project-1.6.0-SNAPSHOT-site.xml> to /home/hudson/hudson/jobs/Accumulo-Trunk-Hadoop-2.0/modules/org.apache.accumulo$accumulo-project/builds/2013-09-09_16-40-59/archive/org.apache.accumulo/accumulo-project/1.6.0-SNAPSHOT/accumulo-project-1.6.0-SNAPSHOT-site.xml
[JENKINS] Archiving <https://builds.apache.org/job/Accumulo-Trunk-Hadoop-2.0/ws/server/pom.xml> to /home/hudson/hudson/jobs/Accumulo-Trunk-Hadoop-2.0/modules/org.apache.accumulo$accumulo-server/builds/2013-09-09_16-40-59/archive/org.apache.accumulo/accumulo-server/1.6.0-SNAPSHOT/accumulo-server-1.6.0-SNAPSHOT.pom
[JENKINS] Archiving <https://builds.apache.org/job/Accumulo-Trunk-Hadoop-2.0/ws/minicluster/pom.xml> to /home/hudson/hudson/jobs/Accumulo-Trunk-Hadoop-2.0/modules/org.apache.accumulo$accumulo-minicluster/builds/2013-09-09_16-40-59/archive/org.apache.accumulo/accumulo-minicluster/1.6.0-SNAPSHOT/accumulo-minicluster-1.6.0-SNAPSHOT.pom
[JENKINS] Archiving <https://builds.apache.org/job/Accumulo-Trunk-Hadoop-2.0/ws/maven-plugin/pom.xml> to /home/hudson/hudson/jobs/Accumulo-Trunk-Hadoop-2.0/modules/org.apache.accumulo$accumulo-maven-plugin/builds/2013-09-09_16-40-59/archive/org.apache.accumulo/accumulo-maven-plugin/1.6.0-SNAPSHOT/accumulo-maven-plugin-1.6.0-SNAPSHOT.pom
[JENKINS] Archiving <https://builds.apache.org/job/Accumulo-Trunk-Hadoop-2.0/ws/examples/simple/pom.xml> to /home/hudson/hudson/jobs/Accumulo-Trunk-Hadoop-2.0/modules/org.apache.accumulo$accumulo-examples-simple/builds/2013-09-09_16-40-59/archive/org.apache.accumulo/accumulo-examples-simple/1.6.0-SNAPSHOT/accumulo-examples-simple-1.6.0-SNAPSHOT.pom
[JENKINS] Archiving <https://builds.apache.org/job/Accumulo-Trunk-Hadoop-2.0/ws/proxy/pom.xml> to /home/hudson/hudson/jobs/Accumulo-Trunk-Hadoop-2.0/modules/org.apache.accumulo$accumulo-proxy/builds/2013-09-09_16-40-59/archive/org.apache.accumulo/accumulo-proxy/1.6.0-SNAPSHOT/accumulo-proxy-1.6.0-SNAPSHOT.pom
[JENKINS] Archiving <https://builds.apache.org/job/Accumulo-Trunk-Hadoop-2.0/ws/assemble/pom.xml> to /home/hudson/hudson/jobs/Accumulo-Trunk-Hadoop-2.0/modules/org.apache.accumulo$accumulo/builds/2013-09-09_16-40-59/archive/org.apache.accumulo/accumulo/1.6.0-SNAPSHOT/accumulo-1.6.0-SNAPSHOT.pom
[JENKINS] Archiving <https://builds.apache.org/job/Accumulo-Trunk-Hadoop-2.0/ws/test/pom.xml> to /home/hudson/hudson/jobs/Accumulo-Trunk-Hadoop-2.0/modules/org.apache.accumulo$accumulo-test/builds/2013-09-09_16-40-59/archive/org.apache.accumulo/accumulo-test/1.6.0-SNAPSHOT/accumulo-test-1.6.0-SNAPSHOT.pom
[JENKINS] Archiving <https://builds.apache.org/job/Accumulo-Trunk-Hadoop-2.0/ws/start/pom.xml> to /home/hudson/hudson/jobs/Accumulo-Trunk-Hadoop-2.0/modules/org.apache.accumulo$accumulo-start/builds/2013-09-09_16-40-59/archive/org.apache.accumulo/accumulo-start/1.6.0-SNAPSHOT/accumulo-start-1.6.0-SNAPSHOT.pom
[JENKINS] Archiving <https://builds.apache.org/job/Accumulo-Trunk-Hadoop-2.0/ws/fate/pom.xml> to /home/hudson/hudson/jobs/Accumulo-Trunk-Hadoop-2.0/modules/org.apache.accumulo$accumulo-fate/builds/2013-09-09_16-40-59/archive/org.apache.accumulo/accumulo-fate/1.6.0-SNAPSHOT/accumulo-fate-1.6.0-SNAPSHOT.pom
[JENKINS] Archiving <https://builds.apache.org/job/Accumulo-Trunk-Hadoop-2.0/ws/core/pom.xml> to /home/hudson/hudson/jobs/Accumulo-Trunk-Hadoop-2.0/modules/org.apache.accumulo$accumulo-core/builds/2013-09-09_16-40-59/archive/org.apache.accumulo/accumulo-core/1.6.0-SNAPSHOT/accumulo-core-1.6.0-SNAPSHOT.pom
[JENKINS] Archiving <https://builds.apache.org/job/Accumulo-Trunk-Hadoop-2.0/ws/trace/pom.xml> to /home/hudson/hudson/jobs/Accumulo-Trunk-Hadoop-2.0/modules/org.apache.accumulo$accumulo-trace/builds/2013-09-09_16-40-59/archive/org.apache.accumulo/accumulo-trace/1.6.0-SNAPSHOT/accumulo-trace-1.6.0-SNAPSHOT.pom
[JENKINS] Archiving <https://builds.apache.org/job/Accumulo-Trunk-Hadoop-2.0/ws/docs/pom.xml> to /home/hudson/hudson/jobs/Accumulo-Trunk-Hadoop-2.0/modules/org.apache.accumulo$accumulo-docs/builds/2013-09-09_16-40-59/archive/org.apache.accumulo/accumulo-docs/1.6.0-SNAPSHOT/accumulo-docs-1.6.0-SNAPSHOT.pom
Waiting for Jenkins to finish collecting data
Sending e-mails to: notifications@accumulo.apache.org
channel stopped

Build failed in Jenkins: Accumulo-Trunk-Hadoop-2.0 #384

Posted by Apache Jenkins Server <je...@builds.apache.org>.
See <https://builds.apache.org/job/Accumulo-Trunk-Hadoop-2.0/384/changes>

Changes:

[elserj] ACCUMULO-1689 Add in option to run GC to the config. Set the GC delay to 30s to

------------------------------------------
Started by an SCM change
Building remotely on ubuntu5 in workspace <https://builds.apache.org/job/Accumulo-Trunk-Hadoop-2.0/ws/>
Checkout:Accumulo-Trunk-Hadoop-2.0 / <https://builds.apache.org/job/Accumulo-Trunk-Hadoop-2.0/ws/> - hudson.remoting.Channel@42ebad02:ubuntu5
Using strategy: Default
Last Built Revision: Revision f0fcd6d117918a0adb77ea1b295567860a410edb (origin/master)
Fetching changes from 1 remote Git repository
Fetching upstream changes from origin
Commencing build of Revision a028e763b0ef1785039d3b0dcb7e04dee18f4f5b (origin/master)
Checking out Revision a028e763b0ef1785039d3b0dcb7e04dee18f4f5b (origin/master)
Parsing POMs
Modules changed, recalculating dependency graph
maven3-agent.jar already up to date
maven3-interceptor.jar already up to date
maven3-interceptor-commons.jar already up to date
[Accumulo-Trunk-Hadoop-2.0] $ /home/hudson/tools/java/latest1.6/bin/java -cp /home/jenkins/jenkins-slave/maven3-agent.jar:/home/hudson/tools/maven/apache-maven-3.0.4/boot/plexus-classworlds-2.4.jar org.jvnet.hudson.maven3.agent.Maven3Main /home/hudson/tools/maven/apache-maven-3.0.4 /home/jenkins/jenkins-slave/slave.jar /home/jenkins/jenkins-slave/maven3-interceptor.jar /home/jenkins/jenkins-slave/maven3-interceptor-commons.jar 52076
<===[JENKINS REMOTING CAPACITY]===>channel started
   log4j:WARN No appenders could be found for logger (org.apache.commons.beanutils.converters.BooleanConverter).
log4j:WARN Please initialize the log4j system properly.
Executing Maven:  -B -f <https://builds.apache.org/job/Accumulo-Trunk-Hadoop-2.0/ws/pom.xml> -Dmaven.repo.local=/home/jenkins/jenkins-slave/maven-repositories/1 clean verify -Dhadoop.profile=2.0 -Pnative
Sep 9, 2013 3:41:02 AM org.apache.maven.cli.event.ExecutionEventLogger projectDiscoveryStarted
INFO: Scanning for projects...
Sep 9, 2013 3:41:03 AM org.apache.maven.cli.event.ExecutionEventLogger sessionStarted
INFO: ------------------------------------------------------------------------
Sep 9, 2013 3:41:03 AM org.apache.maven.cli.event.ExecutionEventLogger sessionStarted
INFO: Reactor Build Order:
Sep 9, 2013 3:41:03 AM org.apache.maven.cli.event.ExecutionEventLogger sessionStarted
INFO: 
Sep 9, 2013 3:41:03 AM org.apache.maven.cli.event.ExecutionEventLogger sessionStarted
INFO: Apache Accumulo Project
Sep 9, 2013 3:41:03 AM org.apache.maven.cli.event.ExecutionEventLogger sessionStarted
INFO: Trace
Sep 9, 2013 3:41:03 AM org.apache.maven.cli.event.ExecutionEventLogger sessionStarted
INFO: Fate
Sep 9, 2013 3:41:03 AM org.apache.maven.cli.event.ExecutionEventLogger sessionStarted
INFO: Start
Sep 9, 2013 3:41:03 AM org.apache.maven.cli.event.ExecutionEventLogger sessionStarted
INFO: Core
Sep 9, 2013 3:41:03 AM org.apache.maven.cli.event.ExecutionEventLogger sessionStarted
INFO: Server
Sep 9, 2013 3:41:03 AM org.apache.maven.cli.event.ExecutionEventLogger sessionStarted
INFO: Simple Examples
Sep 9, 2013 3:41:03 AM org.apache.maven.cli.event.ExecutionEventLogger sessionStarted
INFO: MiniCluster
Sep 9, 2013 3:41:03 AM org.apache.maven.cli.event.ExecutionEventLogger sessionStarted
INFO: Accumulo Maven Plugin
Sep 9, 2013 3:41:03 AM org.apache.maven.cli.event.ExecutionEventLogger sessionStarted
INFO: Testing
Sep 9, 2013 3:41:03 AM org.apache.maven.cli.event.ExecutionEventLogger sessionStarted
INFO: Proxy
Sep 9, 2013 3:41:03 AM org.apache.maven.cli.event.ExecutionEventLogger sessionStarted
INFO: Assemblies
Sep 9, 2013 3:41:03 AM org.apache.maven.cli.event.ExecutionEventLogger sessionStarted
INFO: Documentation
Sep 9, 2013 3:41:07 AM org.apache.maven.cli.event.ExecutionEventLogger projectStarted
INFO:                                                                         
Sep 9, 2013 3:41:07 AM org.apache.maven.cli.event.ExecutionEventLogger projectStarted
INFO: ------------------------------------------------------------------------
Sep 9, 2013 3:41:07 AM org.apache.maven.cli.event.ExecutionEventLogger projectStarted
INFO: Building Apache Accumulo Project 1.6.0-SNAPSHOT
Sep 9, 2013 3:41:08 AM org.apache.maven.cli.event.ExecutionEventLogger projectStarted
INFO: ------------------------------------------------------------------------
Downloading: http://repo.maven.apache.org/maven2/org/apache/rat/apache-rat-plugin/0.10/apache-rat-plugin-0.10.pom
Downloaded: http://repo.maven.apache.org/maven2/org/apache/rat/apache-rat-plugin/0.10/apache-rat-plugin-0.10.pom (0 B at 0.0 KB/sec)
Downloading: http://repo.maven.apache.org/maven2/org/apache/rat/apache-rat-project/0.10/apache-rat-project-0.10.pom
Downloaded: http://repo.maven.apache.org/maven2/org/apache/rat/apache-rat-project/0.10/apache-rat-project-0.10.pom (0 B at 0.0 KB/sec)
Downloading: http://repo.maven.apache.org/maven2/org/apache/rat/apache-rat-plugin/0.10/apache-rat-plugin-0.10.jar
Downloaded: http://repo.maven.apache.org/maven2/org/apache/rat/apache-rat-plugin/0.10/apache-rat-plugin-0.10.jar (0 B at 0.0 KB/sec)
Sep 9, 2013 3:41:09 AM org.apache.maven.cli.event.ExecutionEventLogger mojoStarted
INFO: 
Sep 9, 2013 3:41:09 AM org.apache.maven.cli.event.ExecutionEventLogger mojoStarted
INFO: --- maven-clean-plugin:2.5:clean (default-clean) @ accumulo-project ---
[INFO] Deleting <https://builds.apache.org/job/Accumulo-Trunk-Hadoop-2.0/ws/target>
[INFO] Deleting <https://builds.apache.org/job/Accumulo-Trunk-Hadoop-2.0/ws/> (includes = [**/*.pyc, **/*.so], excludes = [])
Sep 9, 2013 3:41:28 AM org.apache.maven.cli.event.ExecutionEventLogger mojoStarted
INFO: 
Sep 9, 2013 3:41:28 AM org.apache.maven.cli.event.ExecutionEventLogger mojoStarted
INFO: --- maven-sortpom-plugin:2.1.0:verify (verify-sorted-pom) @ accumulo-project ---
[INFO] Verifying file <https://builds.apache.org/job/Accumulo-Trunk-Hadoop-2.0/ws/pom.xml>
Sep 9, 2013 3:41:29 AM org.apache.maven.cli.event.ExecutionEventLogger mojoStarted
INFO: 
Sep 9, 2013 3:41:29 AM org.apache.maven.cli.event.ExecutionEventLogger mojoStarted
INFO: --- maven-enforcer-plugin:1.0.1:enforce (enforce-mvn) @ accumulo-project ---
Sep 9, 2013 3:41:29 AM org.apache.maven.cli.event.ExecutionEventLogger mojoStarted
INFO: 
Sep 9, 2013 3:41:29 AM org.apache.maven.cli.event.ExecutionEventLogger mojoStarted
INFO: --- maven-remote-resources-plugin:1.4:process (default) @ accumulo-project ---
Sep 9, 2013 3:41:30 AM org.apache.maven.cli.event.ExecutionEventLogger mojoStarted
INFO: 
Sep 9, 2013 3:41:30 AM org.apache.maven.cli.event.ExecutionEventLogger mojoStarted
INFO: --- maven-site-plugin:3.2:attach-descriptor (attach-descriptor) @ accumulo-project ---
Sep 9, 2013 3:41:31 AM org.apache.maven.cli.event.ExecutionEventLogger mojoStarted
INFO: 
Sep 9, 2013 3:41:31 AM org.apache.maven.cli.event.ExecutionEventLogger mojoStarted
INFO: --- maven-failsafe-plugin:2.12.4:integration-test (run-integration-tests) @ accumulo-project ---
[INFO] No tests to run.
[JENKINS] Recording test results
Sep 9, 2013 3:41:34 AM org.apache.maven.cli.event.ExecutionEventLogger mojoStarted
INFO: 
Sep 9, 2013 3:41:34 AM org.apache.maven.cli.event.ExecutionEventLogger mojoStarted
INFO: --- maven-failsafe-plugin:2.12.4:verify (run-integration-tests) @ accumulo-project ---
[INFO] No tests to run.
[JENKINS] Recording test resultsSep 9, 2013 3:41:34 AM org.apache.maven.cli.event.ExecutionEventLogger mojoStarted
INFO: 
Sep 9, 2013 3:41:34 AM org.apache.maven.cli.event.ExecutionEventLogger mojoStarted
INFO: --- apache-rat-plugin:0.10:check (default) @ accumulo-project ---

Downloading: http://repo.maven.apache.org/maven2/org/apache/rat/apache-rat-core/0.10/apache-rat-core-0.10.pom
Downloaded: http://repo.maven.apache.org/maven2/org/apache/rat/apache-rat-core/0.10/apache-rat-core-0.10.pom (0 B at 0.0 KB/sec)
Downloading: http://repo.maven.apache.org/maven2/org/apache/rat/apache-rat-core/0.10/apache-rat-core-0.10.jar
Downloaded: http://repo.maven.apache.org/maven2/org/apache/rat/apache-rat-core/0.10/apache-rat-core-0.10.jar (0 B at 0.0 KB/sec)
[INFO] 63 implicit excludes (use -debug for more details).
[INFO] No excludes explicitly specified.
[INFO] 134 resources included (use -debug for more details)
[INFO] Rat check: Summary of files. Unapproved: 4 unknown: 4 generated: 0 approved: 124 licence.
Sep 9, 2013 3:41:36 AM org.apache.maven.cli.event.ExecutionEventLogger logReactorSummary
INFO: ------------------------------------------------------------------------
Sep 9, 2013 3:41:36 AM org.apache.maven.cli.event.ExecutionEventLogger logReactorSummary
INFO: Reactor Summary:
Sep 9, 2013 3:41:36 AM org.apache.maven.cli.event.ExecutionEventLogger logReactorSummary
INFO: 
Sep 9, 2013 3:41:36 AM org.apache.maven.cli.event.ExecutionEventLogger logReactorSummary
INFO: Apache Accumulo Project ........................... FAILURE [32.835s]
Sep 9, 2013 3:41:36 AM org.apache.maven.cli.event.ExecutionEventLogger logReactorSummary
INFO: Trace ............................................. SKIPPED
Sep 9, 2013 3:41:36 AM org.apache.maven.cli.event.ExecutionEventLogger logReactorSummary
INFO: Fate .............................................. SKIPPED
Sep 9, 2013 3:41:36 AM org.apache.maven.cli.event.ExecutionEventLogger logReactorSummary
INFO: Start ............................................. SKIPPED
Sep 9, 2013 3:41:36 AM org.apache.maven.cli.event.ExecutionEventLogger logReactorSummary
INFO: Core .............................................. SKIPPED
Sep 9, 2013 3:41:36 AM org.apache.maven.cli.event.ExecutionEventLogger logReactorSummary
INFO: Server ............................................ SKIPPED
Sep 9, 2013 3:41:36 AM org.apache.maven.cli.event.ExecutionEventLogger logReactorSummary
INFO: Simple Examples ................................... SKIPPED
Sep 9, 2013 3:41:36 AM org.apache.maven.cli.event.ExecutionEventLogger logReactorSummary
INFO: MiniCluster ....................................... SKIPPED
Sep 9, 2013 3:41:36 AM org.apache.maven.cli.event.ExecutionEventLogger logReactorSummary
INFO: Accumulo Maven Plugin ............................. SKIPPED
Sep 9, 2013 3:41:36 AM org.apache.maven.cli.event.ExecutionEventLogger logReactorSummary
INFO: Testing ........................................... SKIPPED
Sep 9, 2013 3:41:36 AM org.apache.maven.cli.event.ExecutionEventLogger logReactorSummary
INFO: Proxy ............................................. SKIPPED
Sep 9, 2013 3:41:36 AM org.apache.maven.cli.event.ExecutionEventLogger logReactorSummary
INFO: Assemblies ........................................ SKIPPED
Sep 9, 2013 3:41:36 AM org.apache.maven.cli.event.ExecutionEventLogger logReactorSummary
INFO: Documentation ..................................... SKIPPED
Sep 9, 2013 3:41:36 AM org.apache.maven.cli.event.ExecutionEventLogger logResult
INFO: ------------------------------------------------------------------------
Sep 9, 2013 3:41:36 AM org.apache.maven.cli.event.ExecutionEventLogger logResult
INFO: BUILD FAILURE
Sep 9, 2013 3:41:36 AM org.apache.maven.cli.event.ExecutionEventLogger logStats
INFO: ------------------------------------------------------------------------
Sep 9, 2013 3:41:36 AM org.apache.maven.cli.event.ExecutionEventLogger logStats
INFO: Total time: 34.777s
Sep 9, 2013 3:41:36 AM org.apache.maven.cli.event.ExecutionEventLogger logStats
INFO: Finished at: Mon Sep 09 03:41:36 UTC 2013
Sep 9, 2013 3:41:37 AM org.apache.maven.cli.event.ExecutionEventLogger logStats
INFO: Final Memory: 18M/105M
Sep 9, 2013 3:41:37 AM org.apache.maven.cli.event.ExecutionEventLogger sessionEnded
INFO: ------------------------------------------------------------------------
[JENKINS] Archiving <https://builds.apache.org/job/Accumulo-Trunk-Hadoop-2.0/ws/pom.xml> to /home/hudson/hudson/jobs/Accumulo-Trunk-Hadoop-2.0/modules/org.apache.accumulo$accumulo-project/builds/2013-09-09_03-40-52/archive/org.apache.accumulo/accumulo-project/1.6.0-SNAPSHOT/accumulo-project-1.6.0-SNAPSHOT.pom
[JENKINS] Archiving <https://builds.apache.org/job/Accumulo-Trunk-Hadoop-2.0/ws/target/accumulo-project-1.6.0-SNAPSHOT-site.xml> to /home/hudson/hudson/jobs/Accumulo-Trunk-Hadoop-2.0/modules/org.apache.accumulo$accumulo-project/builds/2013-09-09_03-40-52/archive/org.apache.accumulo/accumulo-project/1.6.0-SNAPSHOT/accumulo-project-1.6.0-SNAPSHOT-site.xml
[JENKINS] Archiving <https://builds.apache.org/job/Accumulo-Trunk-Hadoop-2.0/ws/server/pom.xml> to /home/hudson/hudson/jobs/Accumulo-Trunk-Hadoop-2.0/modules/org.apache.accumulo$accumulo-server/builds/2013-09-09_03-40-52/archive/org.apache.accumulo/accumulo-server/1.6.0-SNAPSHOT/accumulo-server-1.6.0-SNAPSHOT.pom
[JENKINS] Archiving <https://builds.apache.org/job/Accumulo-Trunk-Hadoop-2.0/ws/minicluster/pom.xml> to /home/hudson/hudson/jobs/Accumulo-Trunk-Hadoop-2.0/modules/org.apache.accumulo$accumulo-minicluster/builds/2013-09-09_03-40-52/archive/org.apache.accumulo/accumulo-minicluster/1.6.0-SNAPSHOT/accumulo-minicluster-1.6.0-SNAPSHOT.pom
[JENKINS] Archiving <https://builds.apache.org/job/Accumulo-Trunk-Hadoop-2.0/ws/maven-plugin/pom.xml> to /home/hudson/hudson/jobs/Accumulo-Trunk-Hadoop-2.0/modules/org.apache.accumulo$accumulo-maven-plugin/builds/2013-09-09_03-40-52/archive/org.apache.accumulo/accumulo-maven-plugin/1.6.0-SNAPSHOT/accumulo-maven-plugin-1.6.0-SNAPSHOT.pom
[JENKINS] Archiving <https://builds.apache.org/job/Accumulo-Trunk-Hadoop-2.0/ws/examples/simple/pom.xml> to /home/hudson/hudson/jobs/Accumulo-Trunk-Hadoop-2.0/modules/org.apache.accumulo$accumulo-examples-simple/builds/2013-09-09_03-40-52/archive/org.apache.accumulo/accumulo-examples-simple/1.6.0-SNAPSHOT/accumulo-examples-simple-1.6.0-SNAPSHOT.pom
[JENKINS] Archiving <https://builds.apache.org/job/Accumulo-Trunk-Hadoop-2.0/ws/proxy/pom.xml> to /home/hudson/hudson/jobs/Accumulo-Trunk-Hadoop-2.0/modules/org.apache.accumulo$accumulo-proxy/builds/2013-09-09_03-40-52/archive/org.apache.accumulo/accumulo-proxy/1.6.0-SNAPSHOT/accumulo-proxy-1.6.0-SNAPSHOT.pom
[JENKINS] Archiving <https://builds.apache.org/job/Accumulo-Trunk-Hadoop-2.0/ws/assemble/pom.xml> to /home/hudson/hudson/jobs/Accumulo-Trunk-Hadoop-2.0/modules/org.apache.accumulo$accumulo/builds/2013-09-09_03-40-52/archive/org.apache.accumulo/accumulo/1.6.0-SNAPSHOT/accumulo-1.6.0-SNAPSHOT.pom
[JENKINS] Archiving <https://builds.apache.org/job/Accumulo-Trunk-Hadoop-2.0/ws/test/pom.xml> to /home/hudson/hudson/jobs/Accumulo-Trunk-Hadoop-2.0/modules/org.apache.accumulo$accumulo-test/builds/2013-09-09_03-40-52/archive/org.apache.accumulo/accumulo-test/1.6.0-SNAPSHOT/accumulo-test-1.6.0-SNAPSHOT.pom
[JENKINS] Archiving <https://builds.apache.org/job/Accumulo-Trunk-Hadoop-2.0/ws/start/pom.xml> to /home/hudson/hudson/jobs/Accumulo-Trunk-Hadoop-2.0/modules/org.apache.accumulo$accumulo-start/builds/2013-09-09_03-40-52/archive/org.apache.accumulo/accumulo-start/1.6.0-SNAPSHOT/accumulo-start-1.6.0-SNAPSHOT.pom
[JENKINS] Archiving <https://builds.apache.org/job/Accumulo-Trunk-Hadoop-2.0/ws/fate/pom.xml> to /home/hudson/hudson/jobs/Accumulo-Trunk-Hadoop-2.0/modules/org.apache.accumulo$accumulo-fate/builds/2013-09-09_03-40-52/archive/org.apache.accumulo/accumulo-fate/1.6.0-SNAPSHOT/accumulo-fate-1.6.0-SNAPSHOT.pom
[JENKINS] Archiving <https://builds.apache.org/job/Accumulo-Trunk-Hadoop-2.0/ws/core/pom.xml> to /home/hudson/hudson/jobs/Accumulo-Trunk-Hadoop-2.0/modules/org.apache.accumulo$accumulo-core/builds/2013-09-09_03-40-52/archive/org.apache.accumulo/accumulo-core/1.6.0-SNAPSHOT/accumulo-core-1.6.0-SNAPSHOT.pom
[JENKINS] Archiving <https://builds.apache.org/job/Accumulo-Trunk-Hadoop-2.0/ws/trace/pom.xml> to /home/hudson/hudson/jobs/Accumulo-Trunk-Hadoop-2.0/modules/org.apache.accumulo$accumulo-trace/builds/2013-09-09_03-40-52/archive/org.apache.accumulo/accumulo-trace/1.6.0-SNAPSHOT/accumulo-trace-1.6.0-SNAPSHOT.pom
[JENKINS] Archiving <https://builds.apache.org/job/Accumulo-Trunk-Hadoop-2.0/ws/docs/pom.xml> to /home/hudson/hudson/jobs/Accumulo-Trunk-Hadoop-2.0/modules/org.apache.accumulo$accumulo-docs/builds/2013-09-09_03-40-52/archive/org.apache.accumulo/accumulo-docs/1.6.0-SNAPSHOT/accumulo-docs-1.6.0-SNAPSHOT.pom
Waiting for Jenkins to finish collecting data
Sending e-mails to: notifications@accumulo.apache.org
channel stopped

Build failed in Jenkins: Accumulo-Trunk-Hadoop-2.0 #383

Posted by Apache Jenkins Server <je...@builds.apache.org>.
See <https://builds.apache.org/job/Accumulo-Trunk-Hadoop-2.0/383/>

------------------------------------------
Started by an SCM change
Building remotely on ubuntu1 in workspace <https://builds.apache.org/job/Accumulo-Trunk-Hadoop-2.0/ws/>
Checkout:Accumulo-Trunk-Hadoop-2.0 / <https://builds.apache.org/job/Accumulo-Trunk-Hadoop-2.0/ws/> - hudson.remoting.Channel@30eef3d7:ubuntu1
Using strategy: Default
Last Built Revision: Revision f0fcd6d117918a0adb77ea1b295567860a410edb (origin/master)
Fetching changes from 1 remote Git repository
Fetching upstream changes from origin
Commencing build of Revision f0fcd6d117918a0adb77ea1b295567860a410edb (origin/master)
Checking out Revision f0fcd6d117918a0adb77ea1b295567860a410edb (origin/master)
Parsing POMs
Modules changed, recalculating dependency graph
maven3-agent.jar already up to date
maven3-interceptor.jar already up to date
maven3-interceptor-commons.jar already up to date
[Accumulo-Trunk-Hadoop-2.0] $ /home/hudson/tools/java/latest1.6/bin/java -cp /home/jenkins/jenkins-slave/maven3-agent.jar:/home/hudson/tools/maven/apache-maven-3.0.4/boot/plexus-classworlds-2.4.jar org.jvnet.hudson.maven3.agent.Maven3Main /home/hudson/tools/maven/apache-maven-3.0.4 /home/jenkins/jenkins-slave/slave.jar /home/jenkins/jenkins-slave/maven3-interceptor.jar /home/jenkins/jenkins-slave/maven3-interceptor-commons.jar 54446
<===[JENKINS REMOTING CAPACITY]===>channel started
   log4j:WARN No appenders could be found for logger (org.apache.commons.beanutils.converters.BooleanConverter).
log4j:WARN Please initialize the log4j system properly.
Executing Maven:  -B -f <https://builds.apache.org/job/Accumulo-Trunk-Hadoop-2.0/ws/pom.xml> -Dmaven.repo.local=/home/jenkins/jenkins-slave/maven-repositories/1 clean verify -Dhadoop.profile=2.0 -Pnative
Sep 8, 2013 4:40:43 AM org.apache.maven.cli.event.ExecutionEventLogger projectDiscoveryStarted
INFO: Scanning for projects...
Sep 8, 2013 4:40:44 AM org.apache.maven.cli.event.ExecutionEventLogger sessionStarted
INFO: ------------------------------------------------------------------------
Sep 8, 2013 4:40:44 AM org.apache.maven.cli.event.ExecutionEventLogger sessionStarted
INFO: Reactor Build Order:
Sep 8, 2013 4:40:44 AM org.apache.maven.cli.event.ExecutionEventLogger sessionStarted
INFO: 
Sep 8, 2013 4:40:44 AM org.apache.maven.cli.event.ExecutionEventLogger sessionStarted
INFO: Apache Accumulo Project
Sep 8, 2013 4:40:44 AM org.apache.maven.cli.event.ExecutionEventLogger sessionStarted
INFO: Trace
Sep 8, 2013 4:40:44 AM org.apache.maven.cli.event.ExecutionEventLogger sessionStarted
INFO: Fate
Sep 8, 2013 4:40:44 AM org.apache.maven.cli.event.ExecutionEventLogger sessionStarted
INFO: Start
Sep 8, 2013 4:40:44 AM org.apache.maven.cli.event.ExecutionEventLogger sessionStarted
INFO: Core
Sep 8, 2013 4:40:44 AM org.apache.maven.cli.event.ExecutionEventLogger sessionStarted
INFO: Server
Sep 8, 2013 4:40:44 AM org.apache.maven.cli.event.ExecutionEventLogger sessionStarted
INFO: Simple Examples
Sep 8, 2013 4:40:44 AM org.apache.maven.cli.event.ExecutionEventLogger sessionStarted
INFO: MiniCluster
Sep 8, 2013 4:40:44 AM org.apache.maven.cli.event.ExecutionEventLogger sessionStarted
INFO: Accumulo Maven Plugin
Sep 8, 2013 4:40:44 AM org.apache.maven.cli.event.ExecutionEventLogger sessionStarted
INFO: Testing
Sep 8, 2013 4:40:44 AM org.apache.maven.cli.event.ExecutionEventLogger sessionStarted
INFO: Proxy
Sep 8, 2013 4:40:44 AM org.apache.maven.cli.event.ExecutionEventLogger sessionStarted
INFO: Assemblies
Sep 8, 2013 4:40:44 AM org.apache.maven.cli.event.ExecutionEventLogger sessionStarted
INFO: Documentation
Sep 8, 2013 4:40:49 AM org.apache.maven.cli.event.ExecutionEventLogger projectStarted
INFO:                                                                         
Sep 8, 2013 4:40:49 AM org.apache.maven.cli.event.ExecutionEventLogger projectStarted
INFO: ------------------------------------------------------------------------
Sep 8, 2013 4:40:49 AM org.apache.maven.cli.event.ExecutionEventLogger projectStarted
INFO: Building Apache Accumulo Project 1.6.0-SNAPSHOT
Sep 8, 2013 4:40:49 AM org.apache.maven.cli.event.ExecutionEventLogger projectStarted
INFO: ------------------------------------------------------------------------
Sep 8, 2013 4:40:49 AM org.apache.maven.cli.event.ExecutionEventLogger mojoStarted
INFO: 
Sep 8, 2013 4:40:49 AM org.apache.maven.cli.event.ExecutionEventLogger mojoStarted
INFO: --- maven-clean-plugin:2.5:clean (default-clean) @ accumulo-project ---
[INFO] Deleting <https://builds.apache.org/job/Accumulo-Trunk-Hadoop-2.0/ws/target>
[INFO] Deleting <https://builds.apache.org/job/Accumulo-Trunk-Hadoop-2.0/ws/> (includes = [**/*.pyc, **/*.so], excludes = [])
Sep 8, 2013 4:41:05 AM org.apache.maven.cli.event.ExecutionEventLogger mojoStarted
INFO: 
Sep 8, 2013 4:41:05 AM org.apache.maven.cli.event.ExecutionEventLogger mojoStarted
INFO: --- maven-sortpom-plugin:2.1.0:verify (verify-sorted-pom) @ accumulo-project ---
[INFO] Verifying file <https://builds.apache.org/job/Accumulo-Trunk-Hadoop-2.0/ws/pom.xml>
Sep 8, 2013 4:41:06 AM org.apache.maven.cli.event.ExecutionEventLogger mojoStarted
INFO: 
Sep 8, 2013 4:41:06 AM org.apache.maven.cli.event.ExecutionEventLogger mojoStarted
INFO: --- maven-enforcer-plugin:1.0.1:enforce (enforce-mvn) @ accumulo-project ---
Sep 8, 2013 4:41:06 AM org.apache.maven.cli.event.ExecutionEventLogger mojoStarted
INFO: 
Sep 8, 2013 4:41:06 AM org.apache.maven.cli.event.ExecutionEventLogger mojoStarted
INFO: --- maven-remote-resources-plugin:1.4:process (default) @ accumulo-project ---
Sep 8, 2013 4:41:07 AM org.apache.maven.cli.event.ExecutionEventLogger mojoStarted
INFO: 
Sep 8, 2013 4:41:07 AM org.apache.maven.cli.event.ExecutionEventLogger mojoStarted
INFO: --- maven-site-plugin:3.2:attach-descriptor (attach-descriptor) @ accumulo-project ---
Sep 8, 2013 4:41:07 AM org.apache.maven.cli.event.ExecutionEventLogger mojoStarted
INFO: 
Sep 8, 2013 4:41:07 AM org.apache.maven.cli.event.ExecutionEventLogger mojoStarted
INFO: --- maven-failsafe-plugin:2.12.4:integration-test (run-integration-tests) @ accumulo-project ---
[INFO] No tests to run.
[JENKINS] Recording test results
Sep 8, 2013 4:41:11 AM org.apache.maven.cli.event.ExecutionEventLogger mojoStarted
INFO: 
Sep 8, 2013 4:41:11 AM org.apache.maven.cli.event.ExecutionEventLogger mojoStarted
INFO: --- maven-failsafe-plugin:2.12.4:verify (run-integration-tests) @ accumulo-project ---
[INFO] No tests to run.
[JENKINS] Recording test resultsSep 8, 2013 4:41:11 AM org.apache.maven.cli.event.ExecutionEventLogger mojoStarted
INFO: 
Sep 8, 2013 4:41:11 AM org.apache.maven.cli.event.ExecutionEventLogger mojoStarted
INFO: --- apache-rat-plugin:0.10:check (default) @ accumulo-project ---

[INFO] 63 implicit excludes (use -debug for more details).
[INFO] No excludes explicitly specified.
[INFO] 134 resources included (use -debug for more details)
[INFO] Rat check: Summary of files. Unapproved: 4 unknown: 4 generated: 0 approved: 124 licence.
Sep 8, 2013 4:41:13 AM org.apache.maven.cli.event.ExecutionEventLogger logReactorSummary
INFO: ------------------------------------------------------------------------
Sep 8, 2013 4:41:13 AM org.apache.maven.cli.event.ExecutionEventLogger logReactorSummary
INFO: Reactor Summary:
Sep 8, 2013 4:41:13 AM org.apache.maven.cli.event.ExecutionEventLogger logReactorSummary
INFO: 
Sep 8, 2013 4:41:13 AM org.apache.maven.cli.event.ExecutionEventLogger logReactorSummary
INFO: Apache Accumulo Project ........................... FAILURE [27.895s]
Sep 8, 2013 4:41:13 AM org.apache.maven.cli.event.ExecutionEventLogger logReactorSummary
INFO: Trace ............................................. SKIPPED
Sep 8, 2013 4:41:13 AM org.apache.maven.cli.event.ExecutionEventLogger logReactorSummary
INFO: Fate .............................................. SKIPPED
Sep 8, 2013 4:41:13 AM org.apache.maven.cli.event.ExecutionEventLogger logReactorSummary
INFO: Start ............................................. SKIPPED
Sep 8, 2013 4:41:13 AM org.apache.maven.cli.event.ExecutionEventLogger logReactorSummary
INFO: Core .............................................. SKIPPED
Sep 8, 2013 4:41:13 AM org.apache.maven.cli.event.ExecutionEventLogger logReactorSummary
INFO: Server ............................................ SKIPPED
Sep 8, 2013 4:41:13 AM org.apache.maven.cli.event.ExecutionEventLogger logReactorSummary
INFO: Simple Examples ................................... SKIPPED
Sep 8, 2013 4:41:13 AM org.apache.maven.cli.event.ExecutionEventLogger logReactorSummary
INFO: MiniCluster ....................................... SKIPPED
Sep 8, 2013 4:41:13 AM org.apache.maven.cli.event.ExecutionEventLogger logReactorSummary
INFO: Accumulo Maven Plugin ............................. SKIPPED
Sep 8, 2013 4:41:13 AM org.apache.maven.cli.event.ExecutionEventLogger logReactorSummary
INFO: Testing ........................................... SKIPPED
Sep 8, 2013 4:41:13 AM org.apache.maven.cli.event.ExecutionEventLogger logReactorSummary
INFO: Proxy ............................................. SKIPPED
Sep 8, 2013 4:41:13 AM org.apache.maven.cli.event.ExecutionEventLogger logReactorSummary
INFO: Assemblies ........................................ SKIPPED
Sep 8, 2013 4:41:13 AM org.apache.maven.cli.event.ExecutionEventLogger logReactorSummary
INFO: Documentation ..................................... SKIPPED
Sep 8, 2013 4:41:13 AM org.apache.maven.cli.event.ExecutionEventLogger logResult
INFO: ------------------------------------------------------------------------
Sep 8, 2013 4:41:13 AM org.apache.maven.cli.event.ExecutionEventLogger logResult
INFO: BUILD FAILURE
Sep 8, 2013 4:41:13 AM org.apache.maven.cli.event.ExecutionEventLogger logStats
INFO: ------------------------------------------------------------------------
Sep 8, 2013 4:41:13 AM org.apache.maven.cli.event.ExecutionEventLogger logStats
INFO: Total time: 30.203s
Sep 8, 2013 4:41:13 AM org.apache.maven.cli.event.ExecutionEventLogger logStats
INFO: Finished at: Sun Sep 08 04:41:13 UTC 2013
Sep 8, 2013 4:41:13 AM org.apache.maven.cli.event.ExecutionEventLogger logStats
INFO: Final Memory: 17M/105M
Sep 8, 2013 4:41:13 AM org.apache.maven.cli.event.ExecutionEventLogger sessionEnded
INFO: ------------------------------------------------------------------------
[JENKINS] Archiving <https://builds.apache.org/job/Accumulo-Trunk-Hadoop-2.0/ws/pom.xml> to /home/hudson/hudson/jobs/Accumulo-Trunk-Hadoop-2.0/modules/org.apache.accumulo$accumulo-project/builds/2013-09-08_04-40-34/archive/org.apache.accumulo/accumulo-project/1.6.0-SNAPSHOT/accumulo-project-1.6.0-SNAPSHOT.pom
[JENKINS] Archiving <https://builds.apache.org/job/Accumulo-Trunk-Hadoop-2.0/ws/target/accumulo-project-1.6.0-SNAPSHOT-site.xml> to /home/hudson/hudson/jobs/Accumulo-Trunk-Hadoop-2.0/modules/org.apache.accumulo$accumulo-project/builds/2013-09-08_04-40-34/archive/org.apache.accumulo/accumulo-project/1.6.0-SNAPSHOT/accumulo-project-1.6.0-SNAPSHOT-site.xml
[JENKINS] Archiving <https://builds.apache.org/job/Accumulo-Trunk-Hadoop-2.0/ws/server/pom.xml> to /home/hudson/hudson/jobs/Accumulo-Trunk-Hadoop-2.0/modules/org.apache.accumulo$accumulo-server/builds/2013-09-08_04-40-34/archive/org.apache.accumulo/accumulo-server/1.6.0-SNAPSHOT/accumulo-server-1.6.0-SNAPSHOT.pom
[JENKINS] Archiving <https://builds.apache.org/job/Accumulo-Trunk-Hadoop-2.0/ws/minicluster/pom.xml> to /home/hudson/hudson/jobs/Accumulo-Trunk-Hadoop-2.0/modules/org.apache.accumulo$accumulo-minicluster/builds/2013-09-08_04-40-34/archive/org.apache.accumulo/accumulo-minicluster/1.6.0-SNAPSHOT/accumulo-minicluster-1.6.0-SNAPSHOT.pom
[JENKINS] Archiving <https://builds.apache.org/job/Accumulo-Trunk-Hadoop-2.0/ws/maven-plugin/pom.xml> to /home/hudson/hudson/jobs/Accumulo-Trunk-Hadoop-2.0/modules/org.apache.accumulo$accumulo-maven-plugin/builds/2013-09-08_04-40-34/archive/org.apache.accumulo/accumulo-maven-plugin/1.6.0-SNAPSHOT/accumulo-maven-plugin-1.6.0-SNAPSHOT.pom
[JENKINS] Archiving <https://builds.apache.org/job/Accumulo-Trunk-Hadoop-2.0/ws/examples/simple/pom.xml> to /home/hudson/hudson/jobs/Accumulo-Trunk-Hadoop-2.0/modules/org.apache.accumulo$accumulo-examples-simple/builds/2013-09-08_04-40-34/archive/org.apache.accumulo/accumulo-examples-simple/1.6.0-SNAPSHOT/accumulo-examples-simple-1.6.0-SNAPSHOT.pom
[JENKINS] Archiving <https://builds.apache.org/job/Accumulo-Trunk-Hadoop-2.0/ws/proxy/pom.xml> to /home/hudson/hudson/jobs/Accumulo-Trunk-Hadoop-2.0/modules/org.apache.accumulo$accumulo-proxy/builds/2013-09-08_04-40-34/archive/org.apache.accumulo/accumulo-proxy/1.6.0-SNAPSHOT/accumulo-proxy-1.6.0-SNAPSHOT.pom
[JENKINS] Archiving <https://builds.apache.org/job/Accumulo-Trunk-Hadoop-2.0/ws/assemble/pom.xml> to /home/hudson/hudson/jobs/Accumulo-Trunk-Hadoop-2.0/modules/org.apache.accumulo$accumulo/builds/2013-09-08_04-40-34/archive/org.apache.accumulo/accumulo/1.6.0-SNAPSHOT/accumulo-1.6.0-SNAPSHOT.pom
[JENKINS] Archiving <https://builds.apache.org/job/Accumulo-Trunk-Hadoop-2.0/ws/test/pom.xml> to /home/hudson/hudson/jobs/Accumulo-Trunk-Hadoop-2.0/modules/org.apache.accumulo$accumulo-test/builds/2013-09-08_04-40-34/archive/org.apache.accumulo/accumulo-test/1.6.0-SNAPSHOT/accumulo-test-1.6.0-SNAPSHOT.pom
[JENKINS] Archiving <https://builds.apache.org/job/Accumulo-Trunk-Hadoop-2.0/ws/start/pom.xml> to /home/hudson/hudson/jobs/Accumulo-Trunk-Hadoop-2.0/modules/org.apache.accumulo$accumulo-start/builds/2013-09-08_04-40-34/archive/org.apache.accumulo/accumulo-start/1.6.0-SNAPSHOT/accumulo-start-1.6.0-SNAPSHOT.pom
[JENKINS] Archiving <https://builds.apache.org/job/Accumulo-Trunk-Hadoop-2.0/ws/fate/pom.xml> to /home/hudson/hudson/jobs/Accumulo-Trunk-Hadoop-2.0/modules/org.apache.accumulo$accumulo-fate/builds/2013-09-08_04-40-34/archive/org.apache.accumulo/accumulo-fate/1.6.0-SNAPSHOT/accumulo-fate-1.6.0-SNAPSHOT.pom
[JENKINS] Archiving <https://builds.apache.org/job/Accumulo-Trunk-Hadoop-2.0/ws/core/pom.xml> to /home/hudson/hudson/jobs/Accumulo-Trunk-Hadoop-2.0/modules/org.apache.accumulo$accumulo-core/builds/2013-09-08_04-40-34/archive/org.apache.accumulo/accumulo-core/1.6.0-SNAPSHOT/accumulo-core-1.6.0-SNAPSHOT.pom
[JENKINS] Archiving <https://builds.apache.org/job/Accumulo-Trunk-Hadoop-2.0/ws/trace/pom.xml> to /home/hudson/hudson/jobs/Accumulo-Trunk-Hadoop-2.0/modules/org.apache.accumulo$accumulo-trace/builds/2013-09-08_04-40-34/archive/org.apache.accumulo/accumulo-trace/1.6.0-SNAPSHOT/accumulo-trace-1.6.0-SNAPSHOT.pom
[JENKINS] Archiving <https://builds.apache.org/job/Accumulo-Trunk-Hadoop-2.0/ws/docs/pom.xml> to /home/hudson/hudson/jobs/Accumulo-Trunk-Hadoop-2.0/modules/org.apache.accumulo$accumulo-docs/builds/2013-09-08_04-40-34/archive/org.apache.accumulo/accumulo-docs/1.6.0-SNAPSHOT/accumulo-docs-1.6.0-SNAPSHOT.pom
Waiting for Jenkins to finish collecting data
Sending e-mails to: notifications@accumulo.apache.org
channel stopped