You are viewing a plain text version of this content. The canonical link for it is here.
Posted to dev@hbase.apache.org by Apache Hudson Server <hu...@hudson.zones.apache.org> on 2010/02/25 20:49:52 UTC
Build failed in Hudson: HBase-Patch #1128
See <http://hudson.zones.apache.org/hudson/job/HBase-Patch/1128/changes>
Changes:
[larsgeorge] HBASE-2264 Adjust the contrib apps to the Maven project layout (Lars Francke via Lars George)
------------------------------------------
[...truncated 4695 lines...]
10/02/25 19:49:43 INFO FSNamesystem.audit: ugi=hudson,hudson ip=/127.0.0.1 cmd=listStatus src=/user/hudson/TestTableResource/435595596/test dst=null perm=null
10/02/25 19:49:43 INFO regionserver.HRegion: region TestTableResource,,1267127383064/435595596 available; sequence id is 0
10/02/25 19:49:43 INFO master.ServerManager: Processing MSG_REPORT_OPEN: TestTableResource,,1267127383064 from vesta.apache.org,35643,1267127322348; 1 of 1
10/02/25 19:49:43 INFO master.RegionServerOperation: TestTableResource,,1267127383064 open on 67.195.138.9:35643
10/02/25 19:49:43 INFO master.RegionServerOperation: Updated row TestTableResource,,1267127383064 in region .META.,,1 with startcode=1267127322348, server=67.195.138.9:35643
10/02/25 19:49:44 INFO datanode.DataNode: Changing meta file offset of block blk_-4800065543497763901_1007 from 21375 to 21371
10/02/25 19:49:44 INFO datanode.DataNode: Changing meta file offset of block blk_-4800065543497763901_1007 from 21375 to 21371
10/02/25 19:49:48 DEBUG wire.header: >> "GET / HTTP/1.1[\r][\n]"
10/02/25 19:49:48 DEBUG wire.header: >> "Accept: text/plain[\r][\n]"
10/02/25 19:49:48 DEBUG wire.header: >> "User-Agent: Jakarta Commons-HttpClient/3.0.1[\r][\n]"
10/02/25 19:49:48 DEBUG wire.header: >> "Host: localhost:38080[\r][\n]"
10/02/25 19:49:48 DEBUG wire.header: >> "[\r][\n]"
10/02/25 19:49:48 DEBUG wire.header: << "HTTP/1.1 200 OK[\r][\n]"
10/02/25 19:49:48 DEBUG wire.header: << "Content-Length: 78[\r][\n]"
10/02/25 19:49:48 DEBUG wire.header: << "Cache-Control: no-cache[\r][\n]"
10/02/25 19:49:48 DEBUG wire.header: << "Content-Type: text/plain[\r][\n]"
10/02/25 19:49:48 DEBUG wire.header: >> "GET / HTTP/1.1[\r][\n]"
10/02/25 19:49:48 DEBUG wire.header: >> "Accept: text/xml[\r][\n]"
10/02/25 19:49:48 DEBUG wire.header: >> "User-Agent: Jakarta Commons-HttpClient/3.0.1[\r][\n]"
10/02/25 19:49:48 DEBUG wire.header: >> "Host: localhost:38080[\r][\n]"
10/02/25 19:49:48 DEBUG wire.header: >> "[\r][\n]"
10/02/25 19:49:48 DEBUG wire.header: << "HTTP/1.1 200 OK[\r][\n]"
10/02/25 19:49:48 DEBUG wire.header: << "Cache-Control: no-cache[\r][\n]"
10/02/25 19:49:48 DEBUG wire.header: << "Content-Type: text/xml[\r][\n]"
10/02/25 19:49:48 DEBUG wire.header: << "Content-Length: 216[\r][\n]"
10/02/25 19:49:48 DEBUG wire.header: >> "GET / HTTP/1.1[\r][\n]"
10/02/25 19:49:48 DEBUG wire.header: >> "Accept: application/json[\r][\n]"
10/02/25 19:49:48 DEBUG wire.header: >> "User-Agent: Jakarta Commons-HttpClient/3.0.1[\r][\n]"
10/02/25 19:49:48 DEBUG wire.header: >> "Host: localhost:38080[\r][\n]"
10/02/25 19:49:48 DEBUG wire.header: >> "[\r][\n]"
10/02/25 19:49:48 DEBUG wire.header: << "HTTP/1.1 200 OK[\r][\n]"
10/02/25 19:49:48 DEBUG wire.header: << "Cache-Control: no-cache[\r][\n]"
10/02/25 19:49:48 DEBUG wire.header: << "Content-Type: application/json[\r][\n]"
10/02/25 19:49:48 DEBUG wire.header: << "Transfer-Encoding: chunked[\r][\n]"
10/02/25 19:49:48 WARN httpclient.HttpMethodBase: Going to buffer response body of large or unknown size. Using getResponseBodyAsStream instead is recommended.
10/02/25 19:49:48 DEBUG wire.header: >> "GET / HTTP/1.1[\r][\n]"
10/02/25 19:49:48 DEBUG wire.header: >> "Accept: application/x-protobuf[\r][\n]"
10/02/25 19:49:48 DEBUG wire.header: >> "User-Agent: Jakarta Commons-HttpClient/3.0.1[\r][\n]"
10/02/25 19:49:48 DEBUG wire.header: >> "Host: localhost:38080[\r][\n]"
10/02/25 19:49:48 DEBUG wire.header: >> "[\r][\n]"
10/02/25 19:49:48 DEBUG wire.header: << "HTTP/1.1 200 OK[\r][\n]"
10/02/25 19:49:48 DEBUG wire.header: << "Content-Length: 82[\r][\n]"
10/02/25 19:49:48 DEBUG wire.header: << "Cache-Control: no-cache[\r][\n]"
10/02/25 19:49:48 DEBUG wire.header: << "Content-Type: application/x-protobuf[\r][\n]"
Tests run: 4, Failures: 0, Errors: 0, Skipped: 0, Time elapsed: 5.534 sec
Results :
Failed tests:
warning(junit.framework.TestSuite$1)
Tests run: 76, Failures: 1, Errors: 0, Skipped: 0
10/02/25 19:49:48 INFO regionserver.HRegionServer: Starting shutdown thread
10/02/25 19:49:48 INFO zookeeper.ZooKeeper: Closing session: 0x12706ac835e0002
10/02/25 19:49:48 INFO zookeeper.ClientCnxn: Closing ClientCnxn for session: 0x12706ac835e0002
10/02/25 19:49:48 INFO server.PrepRequestProcessor: Processed session termination request for id: 0x12706ac835e0002
10/02/25 19:49:48 INFO DataNode.clienttrace: src: /127.0.0.1:58528, dest: /127.0.0.1:51845, bytes: 2734926, op: HDFS_WRITE, cliID: DFSClient_-282561821, offset: 0, srvID: DS-974706824-67.195.138.9-51845-1267127320423, blockid: blk_-4800065543497763901_1007, duration: 64034930680
10/02/25 19:49:48 INFO hdfs.StateChange: BLOCK* NameSystem.addStoredBlock: blockMap updated: 127.0.0.1:51845 is added to blk_-4800065543497763901_1007{blockUCState=UNDER_CONSTRUCTION, primaryNodeIndex=-1, replicas=[ReplicaUnderConstruction[127.0.0.1:58364|RBW], ReplicaUnderConstruction[127.0.0.1:51845|RBW]]} size 0
10/02/25 19:49:48 INFO datanode.DataNode: PacketResponder 0 for block blk_-4800065543497763901_1007 terminating
10/02/25 19:49:48 INFO DataNode.clienttrace: src: /127.0.0.1:43681, dest: /127.0.0.1:58364, bytes: 2734926, op: HDFS_WRITE, cliID: DFSClient_-282561821, offset: 0, srvID: DS-899609567-67.195.138.9-58364-1267127321028, blockid: blk_-4800065543497763901_1007, duration: 64035914724
10/02/25 19:49:48 INFO datanode.DataNode: PacketResponder 1 for block blk_-4800065543497763901_1007 terminating
10/02/25 19:49:48 INFO hdfs.StateChange: BLOCK* NameSystem.addStoredBlock: blockMap updated: 127.0.0.1:58364 is added to blk_-4800065543497763901_1007{blockUCState=UNDER_CONSTRUCTION, primaryNodeIndex=-1, replicas=[ReplicaUnderConstruction[127.0.0.1:58364|RBW], ReplicaUnderConstruction[127.0.0.1:51845|RBW]]} size 0
10/02/25 19:49:48 INFO hdfs.StateChange: DIR* NameSystem.completeFile: file /user/hudson/.logs/vesta.apache.org,35643,1267127322348/hlog.dat.1267127322452 is closed by DFSClient_-282561821
10/02/25 19:49:48 INFO server.NIOServerCnxn: closing session:0x12706ac835e0002 NIOServerCnxn: java.nio.channels.SocketChannel[connected local=/127.0.0.1:21810 remote=/127.0.0.1:59756]
10/02/25 19:49:48 INFO zookeeper.ClientCnxn: Exception while closing send thread for session 0x12706ac835e0002 : Read error rc = -1 java.nio.DirectByteBuffer[pos=0 lim=4 cap=4]
10/02/25 19:49:48 INFO master.HMaster: Cluster shutdown requested. Starting to quiesce servers
10/02/25 19:49:48 INFO master.ZKMasterAddressWatcher: Cluster shutdown while waiting, shutting down this master.
10/02/25 19:49:48 INFO zookeeper.ClientCnxn: Disconnecting ClientCnxn for session: 0x12706ac835e0002
10/02/25 19:49:48 INFO zookeeper.ZooKeeper: Session: 0x12706ac835e0002 closed
10/02/25 19:49:48 INFO zookeeper.ClientCnxn: EventThread shut down
10/02/25 19:49:48 INFO regionserver.HRegionServer: worker thread exiting
10/02/25 19:49:48 INFO master.RootScanner: RegionManager.rootScanner exiting
10/02/25 19:49:48 INFO master.MetaScanner: RegionManager.metaScanner exiting
10/02/25 19:49:48 INFO ipc.HBaseServer: Stopping server on 35643
10/02/25 19:49:48 INFO ipc.HBaseServer: Stopping IPC Server listener on 35643
10/02/25 19:49:48 INFO ipc.HBaseServer: Stopping IPC Server Responder
10/02/25 19:49:48 INFO ipc.HBaseServer: IPC Server handler 3 on 35643: exiting
10/02/25 19:49:48 INFO ipc.HBaseServer: IPC Server handler 1 on 35643: exiting
10/02/25 19:49:48 INFO regionserver.MemStoreFlusher: RegionServer:0.cacheFlusher exiting
10/02/25 19:49:48 INFO regionserver.LogRoller: LogRoller exiting.
10/02/25 19:49:48 INFO regionserver.CompactSplitThread: RegionServer:0.compactor exiting
10/02/25 19:49:48 INFO ipc.HBaseServer: IPC Server handler 4 on 35643: exiting
10/02/25 19:49:48 INFO ipc.HBaseServer: IPC Server handler 0 on 35643: exiting
10/02/25 19:49:48 INFO regionserver.HRegionServer$MajorCompactionChecker: RegionServer:0.majorCompactionChecker exiting
10/02/25 19:49:48 INFO ipc.HBaseServer: IPC Server handler 2 on 35643: exiting
10/02/25 19:49:48 ERROR regionserver.HRegionServer: Error closing TestHTableAuthenticator,,1267127334626
org.apache.hadoop.hbase.DroppedSnapshotException: region: TestHTableAuthenticator,,1267127334626
at org.apache.hadoop.hbase.regionserver.HRegion.internalFlushcache(HRegion.java:948)
at org.apache.hadoop.hbase.regionserver.HRegion.close(HRegion.java:483)
at org.apache.hadoop.hbase.regionserver.HRegionServer.closeAllRegions(HRegionServer.java:1544)
at org.apache.hadoop.hbase.regionserver.HRegionServer.run(HRegionServer.java:626)
at java.lang.Thread.run(Thread.java:619)
Caused by: java.io.IOException: Filesystem closed
at org.apache.hadoop.hdfs.DFSClient.checkOpen(DFSClient.java:294)
at org.apache.hadoop.hdfs.DFSClient.getFileInfo(DFSClient.java:719)
at org.apache.hadoop.hdfs.DistributedFileSystem.getFileStatus(DistributedFileSystem.java:540)
at org.apache.hadoop.fs.FileSystem.exists(FileSystem.java:985)
at org.apache.hadoop.hbase.regionserver.StoreFile.getWriter(StoreFile.java:389)
at org.apache.hadoop.hbase.regionserver.Store.getWriter(Store.java:587)
at org.apache.hadoop.hbase.regionserver.Store.getWriter(Store.java:578)
at org.apache.hadoop.hbase.regionserver.Store.internalFlushCache(Store.java:542)
at org.apache.hadoop.hbase.regionserver.Store.flushCache(Store.java:511)
at org.apache.hadoop.hbase.regionserver.HRegion.internalFlushcache(HRegion.java:933)
... 4 more
10/02/25 19:49:48 FATAL regionserver.HRegionServer: Shutting down HRegionServer: file system not available
java.io.IOException: File system is not available
at org.apache.hadoop.hbase.util.FSUtils.checkFileSystemAvailable(FSUtils.java:128)
at org.apache.hadoop.hbase.regionserver.HRegionServer.checkFileSystem(HRegionServer.java:871)
at org.apache.hadoop.hbase.regionserver.HRegionServer.cleanup(HRegionServer.java:819)
at org.apache.hadoop.hbase.regionserver.HRegionServer.closeAllRegions(HRegionServer.java:1546)
at org.apache.hadoop.hbase.regionserver.HRegionServer.run(HRegionServer.java:626)
at java.lang.Thread.run(Thread.java:619)
Caused by: java.io.IOException: Filesystem closed
at org.apache.hadoop.hdfs.DFSClient.checkOpen(DFSClient.java:294)
at org.apache.hadoop.hdfs.DFSClient.getFileInfo(DFSClient.java:719)
at org.apache.hadoop.hdfs.DistributedFileSystem.getFileStatus(DistributedFileSystem.java:540)
at org.apache.hadoop.fs.FileSystem.exists(FileSystem.java:985)
at org.apache.hadoop.hbase.util.FSUtils.checkFileSystemAvailable(FSUtils.java:117)
... 5 more
10/02/25 19:49:48 INFO regionserver.HRegionServer: Dump of metrics: request=0.0, regions=6, stores=9, storefiles=1, storefileIndexSize=0, memstoreSize=2, compactionQueueSize=0, usedHeap=41, maxHeap=986, blockCacheSize=970944, blockCacheFree=205834464, blockCacheCount=1, blockCacheHitRatio=92
10/02/25 19:49:48 INFO regionserver.HRegion: Closed TestScannerResource,,1267127361038
10/02/25 19:49:48 INFO regionserver.HRegion: Closed TestTableResource,,1267127383064
10/02/25 19:49:48 INFO regionserver.HRegion: Closed .META.,,1
10/02/25 19:49:48 INFO regionserver.HRegion: Closed TestRowResource,,1267127327417
10/02/25 19:49:48 ERROR regionserver.HRegionServer: Error closing -ROOT-,,0
java.io.IOException: Filesystem closed
at org.apache.hadoop.hdfs.DFSClient.checkOpen(DFSClient.java:294)
at org.apache.hadoop.hdfs.DFSClient.access$900(DFSClient.java:128)
at org.apache.hadoop.hdfs.DFSClient$DFSInputStream.close(DFSClient.java:1973)
at java.io.FilterInputStream.close(FilterInputStream.java:155)
at org.apache.hadoop.hbase.io.hfile.HFile$Reader.close(HFile.java:1094)
at org.apache.hadoop.hbase.regionserver.StoreFile.close(StoreFile.java:317)
at org.apache.hadoop.hbase.regionserver.Store.close(Store.java:480)
at org.apache.hadoop.hbase.regionserver.HRegion.close(HRegion.java:488)
at org.apache.hadoop.hbase.regionserver.HRegionServer.closeAllRegions(HRegionServer.java:1544)
at org.apache.hadoop.hbase.regionserver.HRegionServer.run(HRegionServer.java:626)
at java.lang.Thread.run(Thread.java:619)
10/02/25 19:49:48 INFO wal.HLog: RegionServer:0.logSyncer exiting
10/02/25 19:49:48 ERROR regionserver.HRegionServer: Close and delete failed
java.io.IOException: Filesystem closed
at org.apache.hadoop.hdfs.DFSClient.checkOpen(DFSClient.java:294)
at org.apache.hadoop.hdfs.DFSClient.listPaths(DFSClient.java:710)
at org.apache.hadoop.hdfs.DistributedFileSystem.listStatus(DistributedFileSystem.java:289)
at org.apache.hadoop.hbase.regionserver.wal.HLog.closeAndDelete(HLog.java:586)
at org.apache.hadoop.hbase.regionserver.HRegionServer.run(HRegionServer.java:629)
at java.lang.Thread.run(Thread.java:619)
10/02/25 19:49:48 INFO regionserver.HRegionServer: telling master that region server is shutting down at: 67.195.138.9:35643
10/02/25 19:49:48 INFO master.ServerManager: Removing server's info vesta.apache.org,35643,1267127322348
10/02/25 19:49:48 INFO master.RegionManager: Offlined ROOT server: 67.195.138.9:35643
10/02/25 19:49:48 INFO master.RegionManager: -ROOT- region unset (but not set to be reassigned)
10/02/25 19:49:48 INFO master.RegionManager: Offlining META region: {server: 67.195.138.9:35643, regionname: .META.,,1, startKey: <>}
10/02/25 19:49:48 INFO master.RegionManager: META region removed from onlineMetaRegions
10/02/25 19:49:48 INFO master.ServerManager: Region server vesta.apache.org,35643,1267127322348: MSG_REPORT_EXITING
10/02/25 19:49:48 INFO master.ServerManager: Processing MSG_REPORT_CLOSE: TestHTableAuthenticator,,1267127334626 from vesta.apache.org,35643,1267127322348
10/02/25 19:49:48 INFO master.ServerManager: Processing MSG_REPORT_CLOSE: TestScannerResource,,1267127361038 from vesta.apache.org,35643,1267127322348
10/02/25 19:49:48 INFO master.ServerManager: Processing MSG_REPORT_CLOSE: TestTableResource,,1267127383064 from vesta.apache.org,35643,1267127322348
10/02/25 19:49:48 INFO master.ServerManager: Processing MSG_REPORT_CLOSE: .META.,,1 from vesta.apache.org,35643,1267127322348
10/02/25 19:49:48 INFO master.ServerManager: Processing MSG_REPORT_CLOSE: TestRowResource,,1267127327417 from vesta.apache.org,35643,1267127322348
10/02/25 19:49:48 INFO master.ServerManager: Processing MSG_REPORT_CLOSE: -ROOT-,,0 from vesta.apache.org,35643,1267127322348
10/02/25 19:49:48 INFO regionserver.HRegionServer: stopping server at: 67.195.138.9:35643
10/02/25 19:49:48 INFO zookeeper.ZooKeeper: Closing session: 0x12706ac835e0001
10/02/25 19:49:48 INFO zookeeper.ClientCnxn: Closing ClientCnxn for session: 0x12706ac835e0001
10/02/25 19:49:48 INFO server.PrepRequestProcessor: Processed session termination request for id: 0x12706ac835e0001
10/02/25 19:49:48 INFO master.ServerManager: vesta.apache.org,35643,1267127322348 znode expired
10/02/25 19:49:48 INFO server.NIOServerCnxn: closing session:0x12706ac835e0001 NIOServerCnxn: java.nio.channels.SocketChannel[connected local=/127.0.0.1:21810 remote=/127.0.0.1:59755]
10/02/25 19:49:48 INFO zookeeper.ClientCnxn: Exception while closing send thread for session 0x12706ac835e0001 : Read error rc = -1 java.nio.DirectByteBuffer[pos=0 lim=4 cap=4]
10/02/25 19:49:48 INFO zookeeper.ClientCnxn: Disconnecting ClientCnxn for session: 0x12706ac835e0001
10/02/25 19:49:48 INFO zookeeper.ZooKeeper: Session: 0x12706ac835e0001 closed
10/02/25 19:49:48 INFO zookeeper.ClientCnxn: EventThread shut down
10/02/25 19:49:48 INFO regionserver.HRegionServer: RegionServer:0 exiting
10/02/25 19:49:48 INFO regionserver.HRegionServer: Shutdown thread complete
10/02/25 19:49:49 FATAL master.HMaster: Shutting down HBase cluster: file system not available
java.io.IOException: File system is not available
at org.apache.hadoop.hbase.util.FSUtils.checkFileSystemAvailable(FSUtils.java:128)
at org.apache.hadoop.hbase.master.HMaster.checkFileSystem(HMaster.java:303)
at org.apache.hadoop.hbase.master.ServerManager.letRegionServersShutdown(ServerManager.java:777)
at org.apache.hadoop.hbase.master.HMaster.run(HMaster.java:454)
Caused by: java.io.IOException: Filesystem closed
at org.apache.hadoop.hdfs.DFSClient.checkOpen(DFSClient.java:294)
at org.apache.hadoop.hdfs.DFSClient.getFileInfo(DFSClient.java:719)
at org.apache.hadoop.hdfs.DistributedFileSystem.getFileStatus(DistributedFileSystem.java:540)
at org.apache.hadoop.fs.FileSystem.exists(FileSystem.java:985)
at org.apache.hadoop.hbase.util.FSUtils.checkFileSystemAvailable(FSUtils.java:117)
... 3 more
10/02/25 19:49:49 INFO ipc.HBaseServer: Stopping server on 60000
10/02/25 19:49:49 INFO ipc.HBaseServer: IPC Server handler 0 on 60000: exiting
10/02/25 19:49:49 INFO ipc.HBaseServer: IPC Server handler 1 on 60000: exiting
10/02/25 19:49:49 INFO ipc.HBaseServer: IPC Server handler 2 on 60000: exiting
10/02/25 19:49:49 INFO ipc.HBaseServer: IPC Server handler 4 on 60000: exiting
10/02/25 19:49:49 INFO ipc.HBaseServer: IPC Server handler 3 on 60000: exiting
10/02/25 19:49:49 INFO ipc.HBaseServer: Stopping IPC Server listener on 60000
10/02/25 19:49:49 INFO ipc.HBaseServer: Stopping IPC Server Responder
10/02/25 19:49:49 INFO zookeeper.ZooKeeper: Closing session: 0x12706ac835e0000
10/02/25 19:49:49 INFO zookeeper.ClientCnxn: Closing ClientCnxn for session: 0x12706ac835e0000
10/02/25 19:49:49 INFO server.PrepRequestProcessor: Processed session termination request for id: 0x12706ac835e0000
10/02/25 19:49:49 INFO server.NIOServerCnxn: closing session:0x12706ac835e0000 NIOServerCnxn: java.nio.channels.SocketChannel[connected local=/127.0.0.1:21810 remote=/127.0.0.1:59754]
10/02/25 19:49:49 INFO zookeeper.ClientCnxn: Exception while closing send thread for session 0x12706ac835e0000 : Read error rc = -1 java.nio.DirectByteBuffer[pos=0 lim=4 cap=4]
10/02/25 19:49:49 INFO zookeeper.ClientCnxn: Disconnecting ClientCnxn for session: 0x12706ac835e0000
10/02/25 19:49:49 INFO zookeeper.ZooKeeper: Session: 0x12706ac835e0000 closed
10/02/25 19:49:49 INFO zookeeper.ClientCnxn: EventThread shut down
10/02/25 19:49:49 INFO zookeeper.ZooKeeper: Closing session: 0x12706ac835e0000
10/02/25 19:49:49 INFO zookeeper.ClientCnxn: Closing ClientCnxn for session: 0x12706ac835e0000
10/02/25 19:49:49 INFO zookeeper.ClientCnxn: Disconnecting ClientCnxn for session: 0x12706ac835e0000
10/02/25 19:49:49 INFO zookeeper.ZooKeeper: Session: 0x12706ac835e0000 closed
10/02/25 19:49:49 INFO master.HMaster: HMaster main thread exiting
10/02/25 19:49:49 INFO hbase.LocalHBaseCluster: Shutdown 1 region server(s)
10/02/25 19:49:50 INFO server.NIOServerCnxn: NIOServerCnxn factory exited run method
10/02/25 19:49:50 INFO server.PrepRequestProcessor: PrepRequestProcessor exited loop!
10/02/25 19:49:50 INFO server.SyncRequestProcessor: SyncRequestProcessor exited!
10/02/25 19:49:50 INFO server.FinalRequestProcessor: shutdown of request processor complete
10/02/25 19:49:50 WARN stargate.MiniClusterTestCase: java.lang.IllegalStateException: Shutdown in progress
at java.lang.ApplicationShutdownHooks.add(ApplicationShutdownHooks.java:39)
at java.lang.Runtime.addShutdownHook(Runtime.java:192)
at org.apache.hadoop.fs.FileSystem$Cache.getInternal(FileSystem.java:1782)
at org.apache.hadoop.fs.FileSystem$Cache.get(FileSystem.java:1768)
at org.apache.hadoop.fs.FileSystem.get(FileSystem.java:195)
at org.apache.hadoop.fs.FileSystem.get(FileSystem.java:103)
at org.apache.hadoop.hdfs.MiniDFSCluster.getFileSystem(MiniDFSCluster.java:810)
at org.apache.hadoop.hbase.stargate.MiniClusterTestCase.stopDFS(MiniClusterTestCase.java:95)
at org.apache.hadoop.hbase.stargate.MiniClusterTestCase.stopMiniCluster(MiniClusterTestCase.java:206)
at org.apache.hadoop.hbase.stargate.MiniClusterTestCase$MiniClusterShutdownThread.run(MiniClusterTestCase.java:211)
10/02/25 19:49:50 ERROR server.NIOServerCnxn: Thread Thread[Thread-140,5,main] died
java.lang.IllegalStateException: Shutdown in progress
at java.lang.ApplicationShutdownHooks.add(ApplicationShutdownHooks.java:39)
at java.lang.Runtime.addShutdownHook(Runtime.java:192)
at org.apache.hadoop.fs.FileSystem$Cache.getInternal(FileSystem.java:1782)
at org.apache.hadoop.fs.FileSystem$Cache.get(FileSystem.java:1768)
at org.apache.hadoop.fs.FileSystem.get(FileSystem.java:195)
at org.apache.hadoop.fs.FileSystem.get(FileSystem.java:103)
at org.apache.hadoop.hbase.stargate.MiniClusterTestCase$MiniClusterShutdownThread.run(MiniClusterTestCase.java:216)
[INFO] ------------------------------------------------------------------------
[ERROR] BUILD FAILURE
[INFO] ------------------------------------------------------------------------
[INFO] There are test failures.
Please refer to <http://hudson.zones.apache.org/hudson/job/HBase-Patch/ws/trunk/contrib/stargate/target/surefire-reports> for the individual test results.
[INFO] ------------------------------------------------------------------------
[INFO] For more information, run Maven with the -e switch
[INFO] ------------------------------------------------------------------------
[INFO] Total time: 33 minutes 46 seconds
[INFO] Finished at: Thu Feb 25 19:49:50 UTC 2010
[INFO] Final Memory: 63M/106M
[INFO] ------------------------------------------------------------------------
[locks-and-latches] Releasing all the locks
[locks-and-latches] All the locks released
Archiving artifacts
Recording test results
Hudson build is back to normal : HBase-Patch #1140
Posted by Apache Hudson Server <hu...@hudson.zones.apache.org>.
See <http://hudson.zones.apache.org/hudson/job/HBase-Patch/1140/>
Build failed in Hudson: HBase-Patch #1139
Posted by Apache Hudson Server <hu...@hudson.zones.apache.org>.
See <http://hudson.zones.apache.org/hudson/job/HBase-Patch/1139/changes>
Changes:
[jdcryans] HBASE-2284 fsWriteLatency metric may be incorrectly reported
(missing a fix for replication)
------------------------------------------
[...truncated 1968 lines...]
[INFO] hbase-0.21.0-SNAPSHOT/contrib/mdc_replication/hbase-contrib-mdc_replication-0.21.0-SNAPSHOT.jar already added, skipping
[INFO] hbase-0.21.0-SNAPSHOT/contrib/mdc_replication/hbase-contrib-mdc_replication-0.21.0-SNAPSHOT.jar already added, skipping
[INFO] hbase-0.21.0-SNAPSHOT/contrib/mdc_replication/hbase-contrib-mdc_replication-0.21.0-SNAPSHOT.jar already added, skipping
[INFO] hbase-0.21.0-SNAPSHOT/contrib/transactional/hbase-contrib-transactional-0.21.0-SNAPSHOT.jar already added, skipping
[INFO] hbase-0.21.0-SNAPSHOT/contrib/transactional/hbase-contrib-transactional-0.21.0-SNAPSHOT.jar already added, skipping
[INFO] hbase-0.21.0-SNAPSHOT/contrib/transactional/hbase-contrib-transactional-0.21.0-SNAPSHOT.jar already added, skipping
[INFO] hbase-0.21.0-SNAPSHOT/contrib/transactional/hbase-contrib-transactional-0.21.0-SNAPSHOT.jar already added, skipping
[INFO] hbase-0.21.0-SNAPSHOT/contrib/transactional/hbase-contrib-transactional-0.21.0-SNAPSHOT.jar already added, skipping
[INFO] hbase-0.21.0-SNAPSHOT/contrib/transactional/hbase-contrib-transactional-0.21.0-SNAPSHOT.jar already added, skipping
[INFO] hbase-0.21.0-SNAPSHOT/contrib/transactional/hbase-contrib-transactional-0.21.0-SNAPSHOT.jar already added, skipping
[INFO] hbase-0.21.0-SNAPSHOT/contrib/transactional/hbase-contrib-transactional-0.21.0-SNAPSHOT.jar already added, skipping
[INFO] hbase-0.21.0-SNAPSHOT/contrib/transactional/hbase-contrib-transactional-0.21.0-SNAPSHOT.jar already added, skipping
[INFO] hbase-0.21.0-SNAPSHOT/contrib/transactional/hbase-contrib-transactional-0.21.0-SNAPSHOT.jar already added, skipping
[INFO] hbase-0.21.0-SNAPSHOT/contrib/transactional/hbase-contrib-transactional-0.21.0-SNAPSHOT.jar already added, skipping
[INFO] hbase-0.21.0-SNAPSHOT/contrib/transactional/hbase-contrib-transactional-0.21.0-SNAPSHOT.jar already added, skipping
[INFO] hbase-0.21.0-SNAPSHOT/contrib/transactional/hbase-contrib-transactional-0.21.0-SNAPSHOT.jar already added, skipping
[INFO] hbase-0.21.0-SNAPSHOT/contrib/transactional/hbase-contrib-transactional-0.21.0-SNAPSHOT.jar already added, skipping
[INFO] hbase-0.21.0-SNAPSHOT/contrib/transactional/hbase-contrib-transactional-0.21.0-SNAPSHOT.jar already added, skipping
[INFO] hbase-0.21.0-SNAPSHOT/contrib/transactional/hbase-contrib-transactional-0.21.0-SNAPSHOT.jar already added, skipping
[INFO] hbase-0.21.0-SNAPSHOT/contrib/transactional/hbase-contrib-transactional-0.21.0-SNAPSHOT.jar already added, skipping
[INFO] hbase-0.21.0-SNAPSHOT/contrib/transactional/hbase-contrib-transactional-0.21.0-SNAPSHOT.jar already added, skipping
[INFO] hbase-0.21.0-SNAPSHOT/contrib/transactional/hbase-contrib-transactional-0.21.0-SNAPSHOT.jar already added, skipping
[INFO] hbase-0.21.0-SNAPSHOT/contrib/transactional/hbase-contrib-transactional-0.21.0-SNAPSHOT.jar already added, skipping
[INFO] hbase-0.21.0-SNAPSHOT/contrib/transactional/hbase-contrib-transactional-0.21.0-SNAPSHOT.jar already added, skipping
[INFO] hbase-0.21.0-SNAPSHOT/contrib/transactional/hbase-contrib-transactional-0.21.0-SNAPSHOT.jar already added, skipping
[INFO] hbase-0.21.0-SNAPSHOT/contrib/transactional/hbase-contrib-transactional-0.21.0-SNAPSHOT.jar already added, skipping
[INFO] hbase-0.21.0-SNAPSHOT/contrib/transactional/hbase-contrib-transactional-0.21.0-SNAPSHOT.jar already added, skipping
[INFO] hbase-0.21.0-SNAPSHOT/contrib/transactional/hbase-contrib-transactional-0.21.0-SNAPSHOT.jar already added, skipping
[INFO] hbase-0.21.0-SNAPSHOT/contrib/transactional/hbase-contrib-transactional-0.21.0-SNAPSHOT.jar already added, skipping
[INFO] hbase-0.21.0-SNAPSHOT/contrib/transactional/hbase-contrib-transactional-0.21.0-SNAPSHOT.jar already added, skipping
[INFO] hbase-0.21.0-SNAPSHOT/contrib/transactional/hbase-contrib-transactional-0.21.0-SNAPSHOT.jar already added, skipping
[INFO] hbase-0.21.0-SNAPSHOT/contrib/transactional/hbase-contrib-transactional-0.21.0-SNAPSHOT.jar already added, skipping
[INFO] hbase-0.21.0-SNAPSHOT/contrib/transactional/hbase-contrib-transactional-0.21.0-SNAPSHOT.jar already added, skipping
[INFO] hbase-0.21.0-SNAPSHOT/contrib/transactional/hbase-contrib-transactional-0.21.0-SNAPSHOT.jar already added, skipping
[INFO] hbase-0.21.0-SNAPSHOT/contrib/transactional/hbase-contrib-transactional-0.21.0-SNAPSHOT.jar already added, skipping
[INFO] hbase-0.21.0-SNAPSHOT/contrib/transactional/hbase-contrib-transactional-0.21.0-SNAPSHOT.jar already added, skipping
[INFO] hbase-0.21.0-SNAPSHOT/contrib/transactional/hbase-contrib-transactional-0.21.0-SNAPSHOT.jar already added, skipping
[INFO] hbase-0.21.0-SNAPSHOT/contrib/transactional/hbase-contrib-transactional-0.21.0-SNAPSHOT.jar already added, skipping
[INFO] hbase-0.21.0-SNAPSHOT/contrib/transactional/hbase-contrib-transactional-0.21.0-SNAPSHOT.jar already added, skipping
[INFO] hbase-0.21.0-SNAPSHOT/contrib/transactional/hbase-contrib-transactional-0.21.0-SNAPSHOT.jar already added, skipping
[INFO] hbase-0.21.0-SNAPSHOT/contrib/transactional/hbase-contrib-transactional-0.21.0-SNAPSHOT.jar already added, skipping
[INFO] hbase-0.21.0-SNAPSHOT/contrib/transactional/hbase-contrib-transactional-0.21.0-SNAPSHOT.jar already added, skipping
[INFO] hbase-0.21.0-SNAPSHOT/contrib/transactional/hbase-contrib-transactional-0.21.0-SNAPSHOT.jar already added, skipping
[INFO] hbase-0.21.0-SNAPSHOT/contrib/transactional/hbase-contrib-transactional-0.21.0-SNAPSHOT.jar already added, skipping
[INFO] hbase-0.21.0-SNAPSHOT/contrib/transactional/hbase-contrib-transactional-0.21.0-SNAPSHOT.jar already added, skipping
[INFO] hbase-0.21.0-SNAPSHOT/contrib/transactional/hbase-contrib-transactional-0.21.0-SNAPSHOT.jar already added, skipping
[INFO] Building tar : <http://hudson.zones.apache.org/hudson/job/HBase-Patch/1139/artifact/trunk/target/hbase-0.21.0-SNAPSHOT-bin.tar.gz>
[INFO] hbase-0.21.0-SNAPSHOT/hbase-0.21.0-SNAPSHOT.jar already added, skipping
[INFO] hbase-0.21.0-SNAPSHOT/hbase-0.21.0-SNAPSHOT.jar already added, skipping
[INFO] hbase-0.21.0-SNAPSHOT/hbase-0.21.0-SNAPSHOT.jar already added, skipping
[INFO] hbase-0.21.0-SNAPSHOT/hbase-0.21.0-SNAPSHOT.jar already added, skipping
[INFO] hbase-0.21.0-SNAPSHOT/hbase-0.21.0-SNAPSHOT.jar already added, skipping
[INFO] hbase-0.21.0-SNAPSHOT/hbase-0.21.0-SNAPSHOT.jar already added, skipping
[INFO] hbase-0.21.0-SNAPSHOT/hbase-0.21.0-SNAPSHOT.jar already added, skipping
[INFO] hbase-0.21.0-SNAPSHOT/hbase-0.21.0-SNAPSHOT.jar already added, skipping
[INFO] hbase-0.21.0-SNAPSHOT/hbase-0.21.0-SNAPSHOT.jar already added, skipping
[INFO] hbase-0.21.0-SNAPSHOT/hbase-0.21.0-SNAPSHOT.jar already added, skipping
[INFO] hbase-0.21.0-SNAPSHOT/hbase-0.21.0-SNAPSHOT.jar already added, skipping
[INFO] hbase-0.21.0-SNAPSHOT/hbase-0.21.0-SNAPSHOT.jar already added, skipping
[INFO] hbase-0.21.0-SNAPSHOT/hbase-0.21.0-SNAPSHOT.jar already added, skipping
[INFO] hbase-0.21.0-SNAPSHOT/hbase-0.21.0-SNAPSHOT.jar already added, skipping
[INFO] hbase-0.21.0-SNAPSHOT/hbase-0.21.0-SNAPSHOT.jar already added, skipping
[INFO] hbase-0.21.0-SNAPSHOT/hbase-0.21.0-SNAPSHOT.jar already added, skipping
[INFO] hbase-0.21.0-SNAPSHOT/hbase-0.21.0-SNAPSHOT.jar already added, skipping
[INFO] hbase-0.21.0-SNAPSHOT/hbase-0.21.0-SNAPSHOT.jar already added, skipping
[INFO] hbase-0.21.0-SNAPSHOT/hbase-0.21.0-SNAPSHOT.jar already added, skipping
[INFO] hbase-0.21.0-SNAPSHOT/hbase-0.21.0-SNAPSHOT.jar already added, skipping
[INFO] hbase-0.21.0-SNAPSHOT/hbase-0.21.0-SNAPSHOT.jar already added, skipping
[INFO] hbase-0.21.0-SNAPSHOT/hbase-0.21.0-SNAPSHOT.jar already added, skipping
[INFO] hbase-0.21.0-SNAPSHOT/hbase-0.21.0-SNAPSHOT.jar already added, skipping
[INFO] hbase-0.21.0-SNAPSHOT/hbase-0.21.0-SNAPSHOT.jar already added, skipping
[INFO] hbase-0.21.0-SNAPSHOT/hbase-0.21.0-SNAPSHOT.jar already added, skipping
[INFO] hbase-0.21.0-SNAPSHOT/hbase-0.21.0-SNAPSHOT.jar already added, skipping
[INFO] hbase-0.21.0-SNAPSHOT/hbase-0.21.0-SNAPSHOT.jar already added, skipping
[INFO] hbase-0.21.0-SNAPSHOT/hbase-0.21.0-SNAPSHOT.jar already added, skipping
[INFO] hbase-0.21.0-SNAPSHOT/hbase-0.21.0-SNAPSHOT.jar already added, skipping
[INFO] hbase-0.21.0-SNAPSHOT/hbase-0.21.0-SNAPSHOT.jar already added, skipping
[INFO] hbase-0.21.0-SNAPSHOT/hbase-0.21.0-SNAPSHOT.jar already added, skipping
[INFO] hbase-0.21.0-SNAPSHOT/hbase-0.21.0-SNAPSHOT.jar already added, skipping
[INFO] hbase-0.21.0-SNAPSHOT/hbase-0.21.0-SNAPSHOT.jar already added, skipping
[INFO] hbase-0.21.0-SNAPSHOT/hbase-0.21.0-SNAPSHOT.jar already added, skipping
[INFO] hbase-0.21.0-SNAPSHOT/hbase-0.21.0-SNAPSHOT.jar already added, skipping
[INFO] hbase-0.21.0-SNAPSHOT/hbase-0.21.0-SNAPSHOT.jar already added, skipping
[INFO] hbase-0.21.0-SNAPSHOT/hbase-0.21.0-SNAPSHOT.jar already added, skipping
[INFO] hbase-0.21.0-SNAPSHOT/hbase-0.21.0-SNAPSHOT.jar already added, skipping
[INFO] hbase-0.21.0-SNAPSHOT/hbase-0.21.0-SNAPSHOT.jar already added, skipping
[INFO] hbase-0.21.0-SNAPSHOT/hbase-0.21.0-SNAPSHOT.jar already added, skipping
[INFO] hbase-0.21.0-SNAPSHOT/hbase-0.21.0-SNAPSHOT.jar already added, skipping
[INFO] hbase-0.21.0-SNAPSHOT/hbase-0.21.0-SNAPSHOT.jar already added, skipping
[INFO] hbase-0.21.0-SNAPSHOT/contrib/mdc_replication/hbase-contrib-mdc_replication-0.21.0-SNAPSHOT.jar already added, skipping
[INFO] hbase-0.21.0-SNAPSHOT/contrib/mdc_replication/hbase-contrib-mdc_replication-0.21.0-SNAPSHOT.jar already added, skipping
[INFO] hbase-0.21.0-SNAPSHOT/contrib/mdc_replication/hbase-contrib-mdc_replication-0.21.0-SNAPSHOT.jar already added, skipping
[INFO] hbase-0.21.0-SNAPSHOT/contrib/mdc_replication/hbase-contrib-mdc_replication-0.21.0-SNAPSHOT.jar already added, skipping
[INFO] hbase-0.21.0-SNAPSHOT/contrib/mdc_replication/hbase-contrib-mdc_replication-0.21.0-SNAPSHOT.jar already added, skipping
[INFO] hbase-0.21.0-SNAPSHOT/contrib/mdc_replication/hbase-contrib-mdc_replication-0.21.0-SNAPSHOT.jar already added, skipping
[INFO] hbase-0.21.0-SNAPSHOT/contrib/mdc_replication/hbase-contrib-mdc_replication-0.21.0-SNAPSHOT.jar already added, skipping
[INFO] hbase-0.21.0-SNAPSHOT/contrib/mdc_replication/hbase-contrib-mdc_replication-0.21.0-SNAPSHOT.jar already added, skipping
[INFO] hbase-0.21.0-SNAPSHOT/contrib/mdc_replication/hbase-contrib-mdc_replication-0.21.0-SNAPSHOT.jar already added, skipping
[INFO] hbase-0.21.0-SNAPSHOT/contrib/mdc_replication/hbase-contrib-mdc_replication-0.21.0-SNAPSHOT.jar already added, skipping
[INFO] hbase-0.21.0-SNAPSHOT/contrib/mdc_replication/hbase-contrib-mdc_replication-0.21.0-SNAPSHOT.jar already added, skipping
[INFO] hbase-0.21.0-SNAPSHOT/contrib/mdc_replication/hbase-contrib-mdc_replication-0.21.0-SNAPSHOT.jar already added, skipping
[INFO] hbase-0.21.0-SNAPSHOT/contrib/mdc_replication/hbase-contrib-mdc_replication-0.21.0-SNAPSHOT.jar already added, skipping
[INFO] hbase-0.21.0-SNAPSHOT/contrib/mdc_replication/hbase-contrib-mdc_replication-0.21.0-SNAPSHOT.jar already added, skipping
[INFO] hbase-0.21.0-SNAPSHOT/contrib/mdc_replication/hbase-contrib-mdc_replication-0.21.0-SNAPSHOT.jar already added, skipping
[INFO] hbase-0.21.0-SNAPSHOT/contrib/mdc_replication/hbase-contrib-mdc_replication-0.21.0-SNAPSHOT.jar already added, skipping
[INFO] hbase-0.21.0-SNAPSHOT/contrib/mdc_replication/hbase-contrib-mdc_replication-0.21.0-SNAPSHOT.jar already added, skipping
[INFO] hbase-0.21.0-SNAPSHOT/contrib/mdc_replication/hbase-contrib-mdc_replication-0.21.0-SNAPSHOT.jar already added, skipping
[INFO] hbase-0.21.0-SNAPSHOT/contrib/mdc_replication/hbase-contrib-mdc_replication-0.21.0-SNAPSHOT.jar already added, skipping
[INFO] hbase-0.21.0-SNAPSHOT/contrib/mdc_replication/hbase-contrib-mdc_replication-0.21.0-SNAPSHOT.jar already added, skipping
[INFO] hbase-0.21.0-SNAPSHOT/contrib/mdc_replication/hbase-contrib-mdc_replication-0.21.0-SNAPSHOT.jar already added, skipping
[INFO] hbase-0.21.0-SNAPSHOT/contrib/mdc_replication/hbase-contrib-mdc_replication-0.21.0-SNAPSHOT.jar already added, skipping
[INFO] hbase-0.21.0-SNAPSHOT/contrib/mdc_replication/hbase-contrib-mdc_replication-0.21.0-SNAPSHOT.jar already added, skipping
[INFO] hbase-0.21.0-SNAPSHOT/contrib/mdc_replication/hbase-contrib-mdc_replication-0.21.0-SNAPSHOT.jar already added, skipping
[INFO] hbase-0.21.0-SNAPSHOT/contrib/mdc_replication/hbase-contrib-mdc_replication-0.21.0-SNAPSHOT.jar already added, skipping
[INFO] hbase-0.21.0-SNAPSHOT/contrib/mdc_replication/hbase-contrib-mdc_replication-0.21.0-SNAPSHOT.jar already added, skipping
[INFO] hbase-0.21.0-SNAPSHOT/contrib/mdc_replication/hbase-contrib-mdc_replication-0.21.0-SNAPSHOT.jar already added, skipping
[INFO] hbase-0.21.0-SNAPSHOT/contrib/mdc_replication/hbase-contrib-mdc_replication-0.21.0-SNAPSHOT.jar already added, skipping
[INFO] hbase-0.21.0-SNAPSHOT/contrib/mdc_replication/hbase-contrib-mdc_replication-0.21.0-SNAPSHOT.jar already added, skipping
[INFO] hbase-0.21.0-SNAPSHOT/contrib/mdc_replication/hbase-contrib-mdc_replication-0.21.0-SNAPSHOT.jar already added, skipping
[INFO] hbase-0.21.0-SNAPSHOT/contrib/mdc_replication/hbase-contrib-mdc_replication-0.21.0-SNAPSHOT.jar already added, skipping
[INFO] hbase-0.21.0-SNAPSHOT/contrib/mdc_replication/hbase-contrib-mdc_replication-0.21.0-SNAPSHOT.jar already added, skipping
[INFO] hbase-0.21.0-SNAPSHOT/contrib/mdc_replication/hbase-contrib-mdc_replication-0.21.0-SNAPSHOT.jar already added, skipping
[INFO] hbase-0.21.0-SNAPSHOT/contrib/mdc_replication/hbase-contrib-mdc_replication-0.21.0-SNAPSHOT.jar already added, skipping
[INFO] hbase-0.21.0-SNAPSHOT/contrib/mdc_replication/hbase-contrib-mdc_replication-0.21.0-SNAPSHOT.jar already added, skipping
[INFO] hbase-0.21.0-SNAPSHOT/contrib/mdc_replication/hbase-contrib-mdc_replication-0.21.0-SNAPSHOT.jar already added, skipping
[INFO] hbase-0.21.0-SNAPSHOT/contrib/mdc_replication/hbase-contrib-mdc_replication-0.21.0-SNAPSHOT.jar already added, skipping
[INFO] hbase-0.21.0-SNAPSHOT/contrib/mdc_replication/hbase-contrib-mdc_replication-0.21.0-SNAPSHOT.jar already added, skipping
[INFO] hbase-0.21.0-SNAPSHOT/contrib/mdc_replication/hbase-contrib-mdc_replication-0.21.0-SNAPSHOT.jar already added, skipping
[INFO] hbase-0.21.0-SNAPSHOT/contrib/mdc_replication/hbase-contrib-mdc_replication-0.21.0-SNAPSHOT.jar already added, skipping
[INFO] hbase-0.21.0-SNAPSHOT/contrib/mdc_replication/hbase-contrib-mdc_replication-0.21.0-SNAPSHOT.jar already added, skipping
[INFO] hbase-0.21.0-SNAPSHOT/contrib/mdc_replication/hbase-contrib-mdc_replication-0.21.0-SNAPSHOT.jar already added, skipping
[INFO] hbase-0.21.0-SNAPSHOT/contrib/mdc_replication/hbase-contrib-mdc_replication-0.21.0-SNAPSHOT.jar already added, skipping
[INFO] hbase-0.21.0-SNAPSHOT/contrib/mdc_replication/hbase-contrib-mdc_replication-0.21.0-SNAPSHOT.jar already added, skipping
[INFO] hbase-0.21.0-SNAPSHOT/contrib/mdc_replication/hbase-contrib-mdc_replication-0.21.0-SNAPSHOT.jar already added, skipping
[INFO] hbase-0.21.0-SNAPSHOT/contrib/mdc_replication/hbase-contrib-mdc_replication-0.21.0-SNAPSHOT.jar already added, skipping
[INFO] hbase-0.21.0-SNAPSHOT/contrib/mdc_replication/hbase-contrib-mdc_replication-0.21.0-SNAPSHOT.jar already added, skipping
[INFO] hbase-0.21.0-SNAPSHOT/contrib/mdc_replication/hbase-contrib-mdc_replication-0.21.0-SNAPSHOT.jar already added, skipping
[INFO] hbase-0.21.0-SNAPSHOT/contrib/mdc_replication/hbase-contrib-mdc_replication-0.21.0-SNAPSHOT.jar already added, skipping
[INFO] hbase-0.21.0-SNAPSHOT/contrib/mdc_replication/hbase-contrib-mdc_replication-0.21.0-SNAPSHOT.jar already added, skipping
[INFO] hbase-0.21.0-SNAPSHOT/contrib/mdc_replication/hbase-contrib-mdc_replication-0.21.0-SNAPSHOT.jar already added, skipping
[INFO] hbase-0.21.0-SNAPSHOT/contrib/mdc_replication/hbase-contrib-mdc_replication-0.21.0-SNAPSHOT.jar already added, skipping
[INFO] hbase-0.21.0-SNAPSHOT/contrib/mdc_replication/hbase-contrib-mdc_replication-0.21.0-SNAPSHOT.jar already added, skipping
[INFO] hbase-0.21.0-SNAPSHOT/contrib/mdc_replication/hbase-contrib-mdc_replication-0.21.0-SNAPSHOT.jar already added, skipping
[INFO] hbase-0.21.0-SNAPSHOT/contrib/mdc_replication/hbase-contrib-mdc_replication-0.21.0-SNAPSHOT.jar already added, skipping
[INFO] hbase-0.21.0-SNAPSHOT/contrib/mdc_replication/hbase-contrib-mdc_replication-0.21.0-SNAPSHOT.jar already added, skipping
[INFO] hbase-0.21.0-SNAPSHOT/contrib/mdc_replication/hbase-contrib-mdc_replication-0.21.0-SNAPSHOT.jar already added, skipping
[INFO] hbase-0.21.0-SNAPSHOT/contrib/mdc_replication/hbase-contrib-mdc_replication-0.21.0-SNAPSHOT.jar already added, skipping
[INFO] hbase-0.21.0-SNAPSHOT/contrib/mdc_replication/hbase-contrib-mdc_replication-0.21.0-SNAPSHOT.jar already added, skipping
[INFO] hbase-0.21.0-SNAPSHOT/contrib/mdc_replication/hbase-contrib-mdc_replication-0.21.0-SNAPSHOT.jar already added, skipping
[INFO] hbase-0.21.0-SNAPSHOT/contrib/mdc_replication/hbase-contrib-mdc_replication-0.21.0-SNAPSHOT.jar already added, skipping
[INFO] hbase-0.21.0-SNAPSHOT/contrib/mdc_replication/hbase-contrib-mdc_replication-0.21.0-SNAPSHOT.jar already added, skipping
[INFO] hbase-0.21.0-SNAPSHOT/contrib/mdc_replication/hbase-contrib-mdc_replication-0.21.0-SNAPSHOT.jar already added, skipping
[INFO] hbase-0.21.0-SNAPSHOT/contrib/mdc_replication/hbase-contrib-mdc_replication-0.21.0-SNAPSHOT.jar already added, skipping
[INFO] hbase-0.21.0-SNAPSHOT/contrib/mdc_replication/hbase-contrib-mdc_replication-0.21.0-SNAPSHOT.jar already added, skipping
[INFO] hbase-0.21.0-SNAPSHOT/contrib/mdc_replication/hbase-contrib-mdc_replication-0.21.0-SNAPSHOT.jar already added, skipping
[INFO] hbase-0.21.0-SNAPSHOT/contrib/mdc_replication/hbase-contrib-mdc_replication-0.21.0-SNAPSHOT.jar already added, skipping
[INFO] hbase-0.21.0-SNAPSHOT/contrib/mdc_replication/hbase-contrib-mdc_replication-0.21.0-SNAPSHOT.jar already added, skipping
[INFO] hbase-0.21.0-SNAPSHOT/contrib/mdc_replication/hbase-contrib-mdc_replication-0.21.0-SNAPSHOT.jar already added, skipping
[INFO] hbase-0.21.0-SNAPSHOT/contrib/mdc_replication/hbase-contrib-mdc_replication-0.21.0-SNAPSHOT.jar already added, skipping
[INFO] hbase-0.21.0-SNAPSHOT/contrib/mdc_replication/hbase-contrib-mdc_replication-0.21.0-SNAPSHOT.jar already added, skipping
[INFO] hbase-0.21.0-SNAPSHOT/contrib/mdc_replication/hbase-contrib-mdc_replication-0.21.0-SNAPSHOT.jar already added, skipping
[INFO] hbase-0.21.0-SNAPSHOT/contrib/mdc_replication/hbase-contrib-mdc_replication-0.21.0-SNAPSHOT.jar already added, skipping
[INFO] hbase-0.21.0-SNAPSHOT/contrib/mdc_replication/hbase-contrib-mdc_replication-0.21.0-SNAPSHOT.jar already added, skipping
[INFO] hbase-0.21.0-SNAPSHOT/contrib/mdc_replication/hbase-contrib-mdc_replication-0.21.0-SNAPSHOT.jar already added, skipping
[INFO] hbase-0.21.0-SNAPSHOT/contrib/mdc_replication/hbase-contrib-mdc_replication-0.21.0-SNAPSHOT.jar already added, skipping
[INFO] hbase-0.21.0-SNAPSHOT/contrib/mdc_replication/hbase-contrib-mdc_replication-0.21.0-SNAPSHOT.jar already added, skipping
[INFO] hbase-0.21.0-SNAPSHOT/contrib/mdc_replication/hbase-contrib-mdc_replication-0.21.0-SNAPSHOT.jar already added, skipping
[INFO] hbase-0.21.0-SNAPSHOT/contrib/mdc_replication/hbase-contrib-mdc_replication-0.21.0-SNAPSHOT.jar already added, skipping
[INFO] hbase-0.21.0-SNAPSHOT/contrib/mdc_replication/hbase-contrib-mdc_replication-0.21.0-SNAPSHOT.jar already added, skipping
[INFO] hbase-0.21.0-SNAPSHOT/contrib/mdc_replication/hbase-contrib-mdc_replication-0.21.0-SNAPSHOT.jar already added, skipping
[INFO] hbase-0.21.0-SNAPSHOT/contrib/mdc_replication/hbase-contrib-mdc_replication-0.21.0-SNAPSHOT.jar already added, skipping
[INFO] hbase-0.21.0-SNAPSHOT/contrib/mdc_replication/hbase-contrib-mdc_replication-0.21.0-SNAPSHOT.jar already added, skipping
[INFO] hbase-0.21.0-SNAPSHOT/contrib/mdc_replication/hbase-contrib-mdc_replication-0.21.0-SNAPSHOT.jar already added, skipping
[INFO] hbase-0.21.0-SNAPSHOT/contrib/mdc_replication/hbase-contrib-mdc_replication-0.21.0-SNAPSHOT.jar already added, skipping
[INFO] hbase-0.21.0-SNAPSHOT/contrib/mdc_replication/hbase-contrib-mdc_replication-0.21.0-SNAPSHOT.jar already added, skipping
[INFO] hbase-0.21.0-SNAPSHOT/contrib/mdc_replication/hbase-contrib-mdc_replication-0.21.0-SNAPSHOT.jar already added, skipping
[INFO] hbase-0.21.0-SNAPSHOT/contrib/transactional/hbase-contrib-transactional-0.21.0-SNAPSHOT.jar already added, skipping
[INFO] hbase-0.21.0-SNAPSHOT/contrib/transactional/hbase-contrib-transactional-0.21.0-SNAPSHOT.jar already added, skipping
[INFO] hbase-0.21.0-SNAPSHOT/contrib/transactional/hbase-contrib-transactional-0.21.0-SNAPSHOT.jar already added, skipping
[INFO] hbase-0.21.0-SNAPSHOT/contrib/transactional/hbase-contrib-transactional-0.21.0-SNAPSHOT.jar already added, skipping
[INFO] hbase-0.21.0-SNAPSHOT/contrib/transactional/hbase-contrib-transactional-0.21.0-SNAPSHOT.jar already added, skipping
[INFO] hbase-0.21.0-SNAPSHOT/contrib/transactional/hbase-contrib-transactional-0.21.0-SNAPSHOT.jar already added, skipping
[INFO] hbase-0.21.0-SNAPSHOT/contrib/transactional/hbase-contrib-transactional-0.21.0-SNAPSHOT.jar already added, skipping
[INFO] hbase-0.21.0-SNAPSHOT/contrib/transactional/hbase-contrib-transactional-0.21.0-SNAPSHOT.jar already added, skipping
[INFO] hbase-0.21.0-SNAPSHOT/contrib/transactional/hbase-contrib-transactional-0.21.0-SNAPSHOT.jar already added, skipping
[INFO] hbase-0.21.0-SNAPSHOT/contrib/transactional/hbase-contrib-transactional-0.21.0-SNAPSHOT.jar already added, skipping
[INFO] hbase-0.21.0-SNAPSHOT/contrib/transactional/hbase-contrib-transactional-0.21.0-SNAPSHOT.jar already added, skipping
[INFO] hbase-0.21.0-SNAPSHOT/contrib/transactional/hbase-contrib-transactional-0.21.0-SNAPSHOT.jar already added, skipping
[INFO] hbase-0.21.0-SNAPSHOT/contrib/transactional/hbase-contrib-transactional-0.21.0-SNAPSHOT.jar already added, skipping
[INFO] hbase-0.21.0-SNAPSHOT/contrib/transactional/hbase-contrib-transactional-0.21.0-SNAPSHOT.jar already added, skipping
[INFO] hbase-0.21.0-SNAPSHOT/contrib/transactional/hbase-contrib-transactional-0.21.0-SNAPSHOT.jar already added, skipping
[INFO] hbase-0.21.0-SNAPSHOT/contrib/transactional/hbase-contrib-transactional-0.21.0-SNAPSHOT.jar already added, skipping
[INFO] hbase-0.21.0-SNAPSHOT/contrib/transactional/hbase-contrib-transactional-0.21.0-SNAPSHOT.jar already added, skipping
[INFO] hbase-0.21.0-SNAPSHOT/contrib/transactional/hbase-contrib-transactional-0.21.0-SNAPSHOT.jar already added, skipping
[INFO] hbase-0.21.0-SNAPSHOT/contrib/transactional/hbase-contrib-transactional-0.21.0-SNAPSHOT.jar already added, skipping
[INFO] hbase-0.21.0-SNAPSHOT/contrib/transactional/hbase-contrib-transactional-0.21.0-SNAPSHOT.jar already added, skipping
[INFO] hbase-0.21.0-SNAPSHOT/contrib/transactional/hbase-contrib-transactional-0.21.0-SNAPSHOT.jar already added, skipping
[INFO] hbase-0.21.0-SNAPSHOT/contrib/transactional/hbase-contrib-transactional-0.21.0-SNAPSHOT.jar already added, skipping
[INFO] hbase-0.21.0-SNAPSHOT/contrib/transactional/hbase-contrib-transactional-0.21.0-SNAPSHOT.jar already added, skipping
[INFO] hbase-0.21.0-SNAPSHOT/contrib/transactional/hbase-contrib-transactional-0.21.0-SNAPSHOT.jar already added, skipping
[INFO] hbase-0.21.0-SNAPSHOT/contrib/transactional/hbase-contrib-transactional-0.21.0-SNAPSHOT.jar already added, skipping
[INFO] hbase-0.21.0-SNAPSHOT/contrib/transactional/hbase-contrib-transactional-0.21.0-SNAPSHOT.jar already added, skipping
[INFO] hbase-0.21.0-SNAPSHOT/contrib/transactional/hbase-contrib-transactional-0.21.0-SNAPSHOT.jar already added, skipping
[INFO] hbase-0.21.0-SNAPSHOT/contrib/transactional/hbase-contrib-transactional-0.21.0-SNAPSHOT.jar already added, skipping
[INFO] hbase-0.21.0-SNAPSHOT/contrib/transactional/hbase-contrib-transactional-0.21.0-SNAPSHOT.jar already added, skipping
[INFO] hbase-0.21.0-SNAPSHOT/contrib/transactional/hbase-contrib-transactional-0.21.0-SNAPSHOT.jar already added, skipping
[INFO] hbase-0.21.0-SNAPSHOT/contrib/transactional/hbase-contrib-transactional-0.21.0-SNAPSHOT.jar already added, skipping
[INFO] hbase-0.21.0-SNAPSHOT/contrib/transactional/hbase-contrib-transactional-0.21.0-SNAPSHOT.jar already added, skipping
[INFO] hbase-0.21.0-SNAPSHOT/contrib/transactional/hbase-contrib-transactional-0.21.0-SNAPSHOT.jar already added, skipping
[INFO] hbase-0.21.0-SNAPSHOT/contrib/transactional/hbase-contrib-transactional-0.21.0-SNAPSHOT.jar already added, skipping
[INFO] hbase-0.21.0-SNAPSHOT/contrib/transactional/hbase-contrib-transactional-0.21.0-SNAPSHOT.jar already added, skipping
[INFO] hbase-0.21.0-SNAPSHOT/contrib/transactional/hbase-contrib-transactional-0.21.0-SNAPSHOT.jar already added, skipping
[INFO] hbase-0.21.0-SNAPSHOT/contrib/transactional/hbase-contrib-transactional-0.21.0-SNAPSHOT.jar already added, skipping
[INFO] hbase-0.21.0-SNAPSHOT/contrib/transactional/hbase-contrib-transactional-0.21.0-SNAPSHOT.jar already added, skipping
[INFO] hbase-0.21.0-SNAPSHOT/contrib/transactional/hbase-contrib-transactional-0.21.0-SNAPSHOT.jar already added, skipping
[INFO] hbase-0.21.0-SNAPSHOT/contrib/transactional/hbase-contrib-transactional-0.21.0-SNAPSHOT.jar already added, skipping
[INFO] hbase-0.21.0-SNAPSHOT/contrib/transactional/hbase-contrib-transactional-0.21.0-SNAPSHOT.jar already added, skipping
[INFO] hbase-0.21.0-SNAPSHOT/contrib/transactional/hbase-contrib-transactional-0.21.0-SNAPSHOT.jar already added, skipping
[INFO] hbase-0.21.0-SNAPSHOT/contrib/transactional/hbase-contrib-transactional-0.21.0-SNAPSHOT.jar already added, skipping
[INFO] Building tar : <http://hudson.zones.apache.org/hudson/job/HBase-Patch/1139/artifact/trunk/target/hbase-0.21.0-SNAPSHOT-src.tar.gz>
[INFO] Building tar : <http://hudson.zones.apache.org/hudson/job/HBase-Patch/ws/trunk/target/hbase-0.21.0-SNAPSHOT-src.tar.bz2>
[INFO] Building zip: <http://hudson.zones.apache.org/hudson/job/HBase-Patch/ws/trunk/target/hbase-0.21.0-SNAPSHOT-src.zip>
[INFO] Building tar : <http://hudson.zones.apache.org/hudson/job/HBase-Patch/1139/artifact/trunk/target/hbase-0.21.0-SNAPSHOT-project.tar.gz>
[INFO] Building tar : <http://hudson.zones.apache.org/hudson/job/HBase-Patch/ws/trunk/target/hbase-0.21.0-SNAPSHOT-project.tar.bz2>
[INFO] Building zip: <http://hudson.zones.apache.org/hudson/job/HBase-Patch/ws/trunk/target/hbase-0.21.0-SNAPSHOT-project.zip>
[INFO]
[INFO]
[INFO] ------------------------------------------------------------------------
[INFO] Reactor Summary:
[INFO] ------------------------------------------------------------------------
[INFO] HBase ................................................. SUCCESS [1:02:25.433s]
[INFO] HBase Core ............................................ SUCCESS [29:54.654s]
[INFO] HBase Contrib ......................................... SUCCESS [0.013s]
[INFO] HBase Contrib - Multi Datacenter Replication .......... SUCCESS [1:57.423s]
[INFO] HBase Contrib - Stargate .............................. SUCCESS [2:24.494s]
[INFO] HBase Contrib - Transactional ......................... SUCCESS [15:12.669s]
[INFO] ------------------------------------------------------------------------
[INFO] ------------------------------------------------------------------------
[INFO] BUILD SUCCESSFUL
[INFO] ------------------------------------------------------------------------
[INFO] Total time: 111 minutes 56 seconds
[INFO] Finished at: Thu Mar 04 22:07:37 UTC 2010
[INFO] Final Memory: 41M/180M
[INFO] ------------------------------------------------------------------------
[locks-and-latches] Releasing all the locks
[locks-and-latches] All the locks released
Archiving artifacts
Recording test results
No test report files were found. Configuration error?
Build failed in Hudson: HBase-Patch #1138
Posted by Apache Hudson Server <hu...@hudson.zones.apache.org>.
See <http://hudson.zones.apache.org/hudson/job/HBase-Patch/1138/changes>
Changes:
[stack] HBASE-2267 More improvements to the Maven build
[stack] HBASE-2282 More directories should be ignored when using git for development
[stack] HBASE-2281 Hbase shell does not work when started from the build dir
[apurtell] HBASE-2274 [stargate] filter support: JSON descriptors
[stack] HBASE-2063 For hfileoutputformat, on timeout/failure/kill clean up half-written hfile
------------------------------------------
[...truncated 468 lines...]
[WARNING] <http://hudson.zones.apache.org/hudson/job/HBase-Patch/ws/trunk/core/src/test/java/org/apache/hadoop/hbase/regionserver/TestStore.java>:[115,27] [deprecation] HBaseConfiguration() in org.apache.hadoop.hbase.HBaseConfiguration has been deprecated
[WARNING] <http://hudson.zones.apache.org/hudson/job/HBase-Patch/ws/trunk/core/src/test/java/org/apache/hadoop/hbase/mapreduce/TestTimeRangeMapRed.java>:[132,27] [deprecation] HBaseConfiguration(org.apache.hadoop.conf.Configuration) in org.apache.hadoop.hbase.HBaseConfiguration has been deprecated
[WARNING] <http://hudson.zones.apache.org/hudson/job/HBase-Patch/ws/trunk/core/src/test/java/org/apache/hadoop/hbase/mapreduce/TestTimeRangeMapRed.java>:[161,12] [deprecation] Job(org.apache.hadoop.conf.Configuration,java.lang.String) in org.apache.hadoop.mapreduce.Job has been deprecated
[WARNING] <http://hudson.zones.apache.org/hudson/job/HBase-Patch/ws/trunk/core/src/test/java/org/apache/hadoop/hbase/io/hfile/KVGenerator.java>:[67,33] [deprecation] get() in org.apache.hadoop.io.BytesWritable has been deprecated
[WARNING] <http://hudson.zones.apache.org/hudson/job/HBase-Patch/ws/trunk/core/src/test/java/org/apache/hadoop/hbase/io/hfile/KVGenerator.java>:[71,50] [deprecation] get() in org.apache.hadoop.io.BytesWritable has been deprecated
[WARNING] <http://hudson.zones.apache.org/hudson/job/HBase-Patch/ws/trunk/core/src/test/java/org/apache/hadoop/hbase/io/hfile/KVGenerator.java>:[72,12] [deprecation] getSize() in org.apache.hadoop.io.BytesWritable has been deprecated
[WARNING] <http://hudson.zones.apache.org/hudson/job/HBase-Patch/ws/trunk/core/src/test/java/org/apache/hadoop/hbase/io/hfile/KVGenerator.java>:[73,28] [deprecation] get() in org.apache.hadoop.io.BytesWritable has been deprecated
[WARNING] <http://hudson.zones.apache.org/hudson/job/HBase-Patch/ws/trunk/core/src/test/java/org/apache/hadoop/hbase/io/hfile/KVGenerator.java>:[73,50] [deprecation] getSize() in org.apache.hadoop.io.BytesWritable has been deprecated
[WARNING] <http://hudson.zones.apache.org/hudson/job/HBase-Patch/ws/trunk/core/src/test/java/org/apache/hadoop/hbase/io/hfile/KVGenerator.java>:[77,33] [deprecation] get() in org.apache.hadoop.io.BytesWritable has been deprecated
[WARNING] <http://hudson.zones.apache.org/hudson/job/HBase-Patch/ws/trunk/core/src/test/java/org/apache/hadoop/hbase/io/hfile/KVGenerator.java>:[88,33] [deprecation] get() in org.apache.hadoop.io.BytesWritable has been deprecated
[WARNING] <http://hudson.zones.apache.org/hudson/job/HBase-Patch/ws/trunk/core/src/test/java/org/apache/hadoop/hbase/mapred/TestTableMapReduce.java>:[126,4] [deprecation] org.apache.hadoop.mapred.JobConf in org.apache.hadoop.mapred has been deprecated
[WARNING] <http://hudson.zones.apache.org/hudson/job/HBase-Patch/ws/trunk/core/src/test/java/org/apache/hadoop/hbase/mapred/TestTableMapReduce.java>:[129,20] [deprecation] org.apache.hadoop.mapred.JobConf in org.apache.hadoop.mapred has been deprecated
[WARNING] <http://hudson.zones.apache.org/hudson/job/HBase-Patch/ws/trunk/core/src/test/java/org/apache/hadoop/hbase/mapred/TestTableMapReduce.java>:[132,6] [deprecation] org.apache.hadoop.hbase.mapred.TableMapReduceUtil in org.apache.hadoop.hbase.mapred has been deprecated
[WARNING] <http://hudson.zones.apache.org/hudson/job/HBase-Patch/ws/trunk/core/src/test/java/org/apache/hadoop/hbase/mapred/TestTableMapReduce.java>:[136,8] [deprecation] org.apache.hadoop.hbase.mapred.IdentityTableReduce in org.apache.hadoop.hbase.mapred has been deprecated
[WARNING] <http://hudson.zones.apache.org/hudson/job/HBase-Patch/ws/trunk/core/src/test/java/org/apache/hadoop/hbase/mapred/TestTableMapReduce.java>:[135,6] [deprecation] org.apache.hadoop.hbase.mapred.TableMapReduceUtil in org.apache.hadoop.hbase.mapred has been deprecated
[INFO] [surefire:test {execution: default-test}]
[INFO] Surefire report directory: <http://hudson.zones.apache.org/hudson/job/HBase-Patch/ws/trunk/core/target/surefire-reports>
-------------------------------------------------------
T E S T S
-------------------------------------------------------
Running org.apache.hadoop.hbase.TestFullLogReconstruction
Tests run: 1, Failures: 0, Errors: 0, Skipped: 0, Time elapsed: 161.792 sec
Running org.apache.hadoop.hbase.TestSerialization
Tests run: 18, Failures: 0, Errors: 0, Skipped: 0, Time elapsed: 10.963 sec
Running org.apache.hadoop.hbase.TestZooKeeper
Tests run: 4, Failures: 0, Errors: 0, Skipped: 0, Time elapsed: 109.464 sec
Running org.apache.hadoop.hbase.regionserver.wal.TestLogRolling
Tests run: 1, Failures: 0, Errors: 0, Skipped: 0, Time elapsed: 73.958 sec
Running org.apache.hadoop.hbase.io.hfile.TestCachedBlockQueue
Tests run: 2, Failures: 0, Errors: 0, Skipped: 0, Time elapsed: 0.092 sec
Running org.apache.hadoop.hbase.regionserver.TestKeyValueHeap
Tests run: 3, Failures: 0, Errors: 0, Skipped: 0, Time elapsed: 0.453 sec
Running org.apache.hadoop.hbase.regionserver.TestStoreScanner
Tests run: 13, Failures: 0, Errors: 0, Skipped: 0, Time elapsed: 0.118 sec
Running org.apache.hadoop.hbase.TestHMsg
Tests run: 2, Failures: 0, Errors: 0, Skipped: 0, Time elapsed: 0.066 sec
Running org.apache.hadoop.hbase.filter.TestPrefixFilter
Tests run: 3, Failures: 0, Errors: 0, Skipped: 0, Time elapsed: 0.043 sec
Running org.apache.hadoop.hbase.util.TestKeying
Tests run: 1, Failures: 0, Errors: 0, Skipped: 0, Time elapsed: 0.038 sec
Running org.apache.hadoop.hbase.regionserver.TestScanner
Tests run: 5, Failures: 0, Errors: 0, Skipped: 0, Time elapsed: 15.224 sec
Running org.apache.hadoop.hbase.regionserver.TestHRegionInfo
Tests run: 1, Failures: 0, Errors: 0, Skipped: 0, Time elapsed: 0.326 sec
Running org.apache.hadoop.hbase.io.TestHeapSize
Tests run: 2, Failures: 0, Errors: 0, Skipped: 0, Time elapsed: 0.122 sec
Running org.apache.hadoop.hbase.regionserver.TestMinorCompactingStoreScanner
Tests run: 2, Failures: 0, Errors: 0, Skipped: 0, Time elapsed: 0.102 sec
Running org.apache.hadoop.hbase.TestInfoServers
Tests run: 1, Failures: 0, Errors: 0, Skipped: 0, Time elapsed: 11.514 sec
Running org.apache.hadoop.hbase.io.hfile.TestHFileSeek
Tests run: 1, Failures: 0, Errors: 0, Skipped: 0, Time elapsed: 4.689 sec
Running org.apache.hadoop.hbase.regionserver.TestStore
Tests run: 5, Failures: 0, Errors: 0, Skipped: 0, Time elapsed: 1.054 sec
Running org.apache.hadoop.hbase.zookeeper.TestHQuorumPeer
Tests run: 2, Failures: 0, Errors: 0, Skipped: 0, Time elapsed: 0.541 sec
Running org.apache.hadoop.hbase.io.hfile.TestHFilePerformance
Tests run: 1, Failures: 0, Errors: 0, Skipped: 0, Time elapsed: 6.107 sec
Running org.apache.hadoop.hbase.io.TestHbaseObjectWritable
Tests run: 1, Failures: 0, Errors: 0, Skipped: 0, Time elapsed: 0.215 sec
Running org.apache.hadoop.hbase.master.TestOldLogsCleaner
Tests run: 1, Failures: 0, Errors: 0, Skipped: 0, Time elapsed: 1.297 sec
Running org.apache.hadoop.hbase.thrift.TestThriftServer
Tests run: 1, Failures: 0, Errors: 0, Skipped: 0, Time elapsed: 82.169 sec
Running org.apache.hadoop.hbase.regionserver.TestQueryMatcher
Tests run: 4, Failures: 0, Errors: 0, Skipped: 0, Time elapsed: 0.495 sec
Running org.apache.hadoop.hbase.client.TestAdmin
Tests run: 14, Failures: 0, Errors: 0, Skipped: 0, Time elapsed: 146.99 sec
Running org.apache.hadoop.hbase.util.TestMergeTool
Tests run: 1, Failures: 0, Errors: 0, Skipped: 0, Time elapsed: 33.227 sec
Running org.apache.hadoop.hbase.TestCompare
Tests run: 1, Failures: 0, Errors: 0, Skipped: 0, Time elapsed: 0.057 sec
Running org.apache.hadoop.hbase.regionserver.TestExplicitColumnTracker
Tests run: 3, Failures: 0, Errors: 0, Skipped: 0, Time elapsed: 0.885 sec
Running org.apache.hadoop.hbase.regionserver.TestStoreReconstruction
Tests run: 1, Failures: 0, Errors: 0, Skipped: 0, Time elapsed: 23.935 sec
Running org.apache.hadoop.hbase.TestEmptyMetaInfo
Tests run: 1, Failures: 0, Errors: 0, Skipped: 0, Time elapsed: 58.561 sec
Running org.apache.hadoop.hbase.util.TestBase64
Tests run: 1, Failures: 0, Errors: 0, Skipped: 0, Time elapsed: 0.091 sec
Running org.apache.hadoop.hbase.regionserver.TestMemStore
Tests run: 17, Failures: 0, Errors: 0, Skipped: 0, Time elapsed: 0.307 sec
Running org.apache.hadoop.hbase.io.hfile.TestLruBlockCache
Tests run: 7, Failures: 0, Errors: 0, Skipped: 0, Time elapsed: 1.141 sec
Running org.apache.hadoop.hbase.regionserver.TestDeleteCompare
Tests run: 4, Failures: 0, Errors: 0, Skipped: 0, Time elapsed: 0.105 sec
Running org.apache.hadoop.hbase.regionserver.TestScanWildcardColumnTracker
Tests run: 2, Failures: 0, Errors: 0, Skipped: 0, Time elapsed: 0.391 sec
Running org.apache.hadoop.hbase.regionserver.TestKeyValueSkipListSet
Tests run: 4, Failures: 0, Errors: 0, Skipped: 0, Time elapsed: 0.105 sec
Running org.apache.hadoop.hbase.io.hfile.TestSeekTo
Tests run: 3, Failures: 0, Errors: 0, Skipped: 0, Time elapsed: 0.527 sec
Running org.apache.hadoop.hbase.filter.TestPageFilter
Tests run: 2, Failures: 0, Errors: 0, Skipped: 0, Time elapsed: 0.039 sec
Running org.apache.hadoop.hbase.TestMergeMeta
Tests run: 1, Failures: 0, Errors: 0, Skipped: 0, Time elapsed: 57.216 sec
Running org.apache.hadoop.hbase.TestKeyValue
Tests run: 7, Failures: 0, Errors: 0, Skipped: 0, Time elapsed: 0.11 sec
Running org.apache.hadoop.hbase.mapreduce.TestTableMapReduce
Tests run: 1, Failures: 0, Errors: 0, Skipped: 0, Time elapsed: 120.198 sec
Running org.apache.hadoop.hbase.client.TestFromClientSide
Tests run: 33, Failures: 0, Errors: 0, Skipped: 4, Time elapsed: 264.738 sec
Running org.apache.hadoop.hbase.regionserver.TestCompaction
Tests run: 2, Failures: 0, Errors: 0, Skipped: 0, Time elapsed: 16.464 sec
Running org.apache.hadoop.hbase.client.TestHTablePool
Tests run: 4, Failures: 0, Errors: 0, Skipped: 0, Time elapsed: 0.489 sec
Running org.apache.hadoop.hbase.TestMultiParallelPut
Tests run: 1, Failures: 0, Errors: 0, Skipped: 0, Time elapsed: 32.62 sec
Running org.apache.hadoop.hbase.master.TestRegionManager
Tests run: 1, Failures: 0, Errors: 0, Skipped: 0, Time elapsed: 30.131 sec
Running org.apache.hadoop.hbase.mapreduce.TestTimeRangeMapRed
Tests run: 1, Failures: 0, Errors: 0, Skipped: 0, Time elapsed: 55.463 sec
Running org.apache.hadoop.hbase.filter.TestSingleColumnValueFilter
Tests run: 2, Failures: 0, Errors: 0, Skipped: 0, Time elapsed: 0.137 sec
Running org.apache.hadoop.hbase.master.TestMinimumServerCount
Tests run: 1, Failures: 0, Errors: 0, Skipped: 0, Time elapsed: 42.486 sec
Running org.apache.hadoop.hbase.mapreduce.TestSimpleTotalOrderPartitioner
Tests run: 1, Failures: 0, Errors: 0, Skipped: 0, Time elapsed: 0.334 sec
Running org.apache.hadoop.hbase.regionserver.TestGetDeleteTracker
Tests run: 7, Failures: 0, Errors: 0, Skipped: 0, Time elapsed: 0.62 sec
Running org.apache.hadoop.hbase.mapreduce.TestHFileOutputFormat
Tests run: 1, Failures: 0, Errors: 0, Skipped: 0, Time elapsed: 5.612 sec
Running org.apache.hadoop.hbase.regionserver.TestScanDeleteTracker
Tests run: 6, Failures: 0, Errors: 0, Skipped: 0, Time elapsed: 0.585 sec
Running org.apache.hadoop.hbase.metrics.TestMetricsMBeanBase
Tests run: 2, Failures: 0, Errors: 0, Skipped: 0, Time elapsed: 0.11 sec
Running org.apache.hadoop.hbase.mapreduce.TestTableInputFormatScan
Tests run: 11, Failures: 0, Errors: 0, Skipped: 0, Time elapsed: 95.007 sec
Running org.apache.hadoop.hbase.filter.TestFilterList
Tests run: 4, Failures: 0, Errors: 0, Skipped: 0, Time elapsed: 0.151 sec
Running org.apache.hadoop.hbase.regionserver.TestHRegion
Tests run: 37, Failures: 0, Errors: 0, Skipped: 0, Time elapsed: 8.3 sec
Running org.apache.hadoop.hbase.TestRegionRebalancing
Tests run: 1, Failures: 0, Errors: 0, Skipped: 0, Time elapsed: 66.05 sec
Running org.apache.hadoop.hbase.filter.TestInclusiveStopFilter
Tests run: 2, Failures: 0, Errors: 0, Skipped: 0, Time elapsed: 0.041 sec
Running org.apache.hadoop.hbase.filter.TestSingleColumnValueExcludeFilter
Tests run: 1, Failures: 0, Errors: 0, Skipped: 0, Time elapsed: 0.102 sec
Running org.apache.hadoop.hbase.util.TestRootPath
Tests run: 1, Failures: 0, Errors: 0, Skipped: 0, Time elapsed: 0.095 sec
Running org.apache.hadoop.hbase.mapred.TestTableMapReduce
Tests run: 1, Failures: 0, Errors: 0, Skipped: 0, Time elapsed: 53.933 sec
Running org.apache.hadoop.hbase.regionserver.TestKeyValueScanFixture
Tests run: 1, Failures: 0, Errors: 0, Skipped: 0, Time elapsed: 0.102 sec
Running org.apache.hadoop.hbase.util.TestBytes
Tests run: 8, Failures: 0, Errors: 0, Skipped: 0, Time elapsed: 0.045 sec
Running org.apache.hadoop.hbase.regionserver.TestWildcardColumnTracker
Tests run: 6, Failures: 0, Errors: 0, Skipped: 0, Time elapsed: 0.873 sec
Running org.apache.hadoop.hbase.regionserver.TestStoreFile
Tests run: 2, Failures: 0, Errors: 0, Skipped: 0, Time elapsed: 21.286 sec
Running org.apache.hadoop.hbase.client.TestGetRowVersions
Tests run: 1, Failures: 0, Errors: 0, Skipped: 0, Time elapsed: 67.844 sec
Running org.apache.hadoop.hbase.io.hfile.TestHFile
Tests run: 7, Failures: 0, Errors: 0, Skipped: 0, Time elapsed: 0.847 sec
Running org.apache.hadoop.hbase.filter.TestFilter
Tests run: 14, Failures: 0, Errors: 0, Skipped: 0, Time elapsed: 2.977 sec
Running org.apache.hadoop.hbase.regionserver.TestWideScanner
Tests run: 1, Failures: 0, Errors: 0, Skipped: 0, Time elapsed: 21.523 sec
Running org.apache.hadoop.hbase.regionserver.wal.TestHLog
Tests run: 4, Failures: 0, Errors: 0, Skipped: 0, Time elapsed: 47.616 sec
Running org.apache.hadoop.hbase.client.TestTimestamp
Tests run: 1, Failures: 0, Errors: 0, Skipped: 0, Time elapsed: 17.4 sec
Running org.apache.hadoop.hbase.TestScanMultipleVersions
Tests run: 1, Failures: 0, Errors: 0, Skipped: 0, Time elapsed: 36.87 sec
Running org.apache.hadoop.hbase.TestMergeTable
Tests run: 1, Failures: 0, Errors: 0, Skipped: 0, Time elapsed: 69.728 sec
Running org.apache.hadoop.hbase.regionserver.TestGetClosestAtOrBefore
Tests run: 3, Failures: 0, Errors: 0, Skipped: 0, Time elapsed: 26.378 sec
Results :
Tests run: 315, Failures: 0, Errors: 0, Skipped: 4
[INFO] [jar:jar {execution: default-jar}]
[INFO] Building jar: <http://hudson.zones.apache.org/hudson/job/HBase-Patch/ws/trunk/core/target/hbase-core-0.21.0-SNAPSHOT.jar>
[INFO] [jar:test-jar {execution: default}]
[INFO] Building jar: <http://hudson.zones.apache.org/hudson/job/HBase-Patch/ws/trunk/core/target/hbase-core-0.21.0-SNAPSHOT-tests.jar>
[INFO] [source:jar-no-fork {execution: attach-sources}]
[INFO] Building jar: <http://hudson.zones.apache.org/hudson/job/HBase-Patch/ws/trunk/core/target/hbase-core-0.21.0-SNAPSHOT-sources.jar>
[INFO] [install:install {execution: default-install}]
[INFO] Installing <http://hudson.zones.apache.org/hudson/job/HBase-Patch/ws/trunk/core/target/hbase-core-0.21.0-SNAPSHOT.jar> to /home/hudson/.m2/repository/org/apache/hbase/hbase-core/0.21.0-SNAPSHOT/hbase-core-0.21.0-SNAPSHOT.jar
[INFO] Installing <http://hudson.zones.apache.org/hudson/job/HBase-Patch/ws/trunk/core/target/hbase-core-0.21.0-SNAPSHOT-tests.jar> to /home/hudson/.m2/repository/org/apache/hbase/hbase-core/0.21.0-SNAPSHOT/hbase-core-0.21.0-SNAPSHOT-tests.jar
[INFO] Installing <http://hudson.zones.apache.org/hudson/job/HBase-Patch/ws/trunk/core/target/hbase-core-0.21.0-SNAPSHOT-sources.jar> to /home/hudson/.m2/repository/org/apache/hbase/hbase-core/0.21.0-SNAPSHOT/hbase-core-0.21.0-SNAPSHOT-sources.jar
[INFO] ------------------------------------------------------------------------
[INFO] Building HBase Contrib
[INFO] task-segment: [clean, install]
[INFO] ------------------------------------------------------------------------
[INFO] [clean:clean {execution: default-clean}]
[INFO] [site:attach-descriptor {execution: default-attach-descriptor}]
[INFO] [install:install {execution: default-install}]
[INFO] Installing <http://hudson.zones.apache.org/hudson/job/HBase-Patch/ws/trunk/contrib/pom.xml> to /home/hudson/.m2/repository/org/apache/hbase/hbase-contrib/0.21.0-SNAPSHOT/hbase-contrib-0.21.0-SNAPSHOT.pom
[INFO] ------------------------------------------------------------------------
[INFO] Building HBase Contrib - Multi Datacenter Replication
[INFO] task-segment: [clean, install]
[INFO] ------------------------------------------------------------------------
[INFO] [clean:clean {execution: default-clean}]
[INFO] Deleting <http://hudson.zones.apache.org/hudson/job/HBase-Patch/ws/trunk/contrib/mdc_replication/target>
[INFO] [resources:resources {execution: default-resources}]
[INFO] Using 'UTF-8' encoding to copy filtered resources.
[INFO] skip non existing resourceDirectory <http://hudson.zones.apache.org/hudson/job/HBase-Patch/ws/trunk/contrib/mdc_replication/src/main/resources>
[INFO] [compiler:compile {execution: default-compile}]
[INFO] Compiling 8 source files to <http://hudson.zones.apache.org/hudson/job/HBase-Patch/ws/trunk/contrib/mdc_replication/target/classes>
[INFO] -------------------------------------------------------------
[ERROR] COMPILATION ERROR :
[INFO] -------------------------------------------------------------
[ERROR] <http://hudson.zones.apache.org/hudson/job/HBase-Patch/ws/trunk/contrib/mdc_replication/src/main/java/org/apache/hadoop/hbase/regionserver/wal/replication/ReplicationHLog.java>:[73,9] doWrite(org.apache.hadoop.hbase.HRegionInfo,org.apache.hadoop.hbase.regionserver.wal.HLogKey,org.apache.hadoop.hbase.KeyValue) in org.apache.hadoop.hbase.regionserver.wal.HLog cannot be applied to (org.apache.hadoop.hbase.HRegionInfo,org.apache.hadoop.hbase.regionserver.wal.HLogKey,org.apache.hadoop.hbase.KeyValue,long)
[ERROR] <http://hudson.zones.apache.org/hudson/job/HBase-Patch/ws/trunk/contrib/mdc_replication/src/main/java/org/apache/hadoop/hbase/regionserver/wal/replication/ReplicationHLog.java>:[68,2] method does not override or implement a method from a supertype
[INFO] 2 errors
[INFO] -------------------------------------------------------------
[INFO] ------------------------------------------------------------------------
[ERROR] BUILD FAILURE
[INFO] ------------------------------------------------------------------------
[INFO] Compilation failure
<http://hudson.zones.apache.org/hudson/job/HBase-Patch/ws/trunk/contrib/mdc_replication/src/main/java/org/apache/hadoop/hbase/regionserver/wal/replication/ReplicationHLog.java>:[73,9] doWrite(org.apache.hadoop.hbase.HRegionInfo,org.apache.hadoop.hbase.regionserver.wal.HLogKey,org.apache.hadoop.hbase.KeyValue) in org.apache.hadoop.hbase.regionserver.wal.HLog cannot be applied to (org.apache.hadoop.hbase.HRegionInfo,org.apache.hadoop.hbase.regionserver.wal.HLogKey,org.apache.hadoop.hbase.KeyValue,long)
<http://hudson.zones.apache.org/hudson/job/HBase-Patch/ws/trunk/contrib/mdc_replication/src/main/java/org/apache/hadoop/hbase/regionserver/wal/replication/ReplicationHLog.java>:[68,2] method does not override or implement a method from a supertype
[INFO] ------------------------------------------------------------------------
[INFO] For more information, run Maven with the -e switch
[INFO] ------------------------------------------------------------------------
[INFO] Total time: 32 minutes 39 seconds
[INFO] Finished at: Thu Mar 04 18:34:38 UTC 2010
[INFO] Final Memory: 43M/90M
[INFO] ------------------------------------------------------------------------
[locks-and-latches] Releasing all the locks
[locks-and-latches] All the locks released
Archiving artifacts
Recording test results
Build failed in Hudson: HBase-Patch #1137
Posted by Apache Hudson Server <hu...@hudson.zones.apache.org>.
See <http://hudson.zones.apache.org/hudson/job/HBase-Patch/1137/changes>
Changes:
[stack] HBASE-2284 fsWriteLatency metric may be incorrectly reported
[stack] HBASE-2284 fsWriteLatency metric may be incorrectly reported
------------------------------------------
[...truncated 430 lines...]
[WARNING] <http://hudson.zones.apache.org/hudson/job/HBase-Patch/ws/trunk/core/src/test/java/org/apache/hadoop/hbase/regionserver/TestStore.java>:[115,27] [deprecation] HBaseConfiguration() in org.apache.hadoop.hbase.HBaseConfiguration has been deprecated
[WARNING] <http://hudson.zones.apache.org/hudson/job/HBase-Patch/ws/trunk/core/src/test/java/org/apache/hadoop/hbase/mapreduce/TestTimeRangeMapRed.java>:[132,27] [deprecation] HBaseConfiguration(org.apache.hadoop.conf.Configuration) in org.apache.hadoop.hbase.HBaseConfiguration has been deprecated
[WARNING] <http://hudson.zones.apache.org/hudson/job/HBase-Patch/ws/trunk/core/src/test/java/org/apache/hadoop/hbase/mapreduce/TestTimeRangeMapRed.java>:[161,12] [deprecation] Job(org.apache.hadoop.conf.Configuration,java.lang.String) in org.apache.hadoop.mapreduce.Job has been deprecated
[WARNING] <http://hudson.zones.apache.org/hudson/job/HBase-Patch/ws/trunk/core/src/test/java/org/apache/hadoop/hbase/io/hfile/KVGenerator.java>:[67,33] [deprecation] get() in org.apache.hadoop.io.BytesWritable has been deprecated
[WARNING] <http://hudson.zones.apache.org/hudson/job/HBase-Patch/ws/trunk/core/src/test/java/org/apache/hadoop/hbase/io/hfile/KVGenerator.java>:[71,50] [deprecation] get() in org.apache.hadoop.io.BytesWritable has been deprecated
[WARNING] <http://hudson.zones.apache.org/hudson/job/HBase-Patch/ws/trunk/core/src/test/java/org/apache/hadoop/hbase/io/hfile/KVGenerator.java>:[72,12] [deprecation] getSize() in org.apache.hadoop.io.BytesWritable has been deprecated
[WARNING] <http://hudson.zones.apache.org/hudson/job/HBase-Patch/ws/trunk/core/src/test/java/org/apache/hadoop/hbase/io/hfile/KVGenerator.java>:[73,28] [deprecation] get() in org.apache.hadoop.io.BytesWritable has been deprecated
[WARNING] <http://hudson.zones.apache.org/hudson/job/HBase-Patch/ws/trunk/core/src/test/java/org/apache/hadoop/hbase/io/hfile/KVGenerator.java>:[73,50] [deprecation] getSize() in org.apache.hadoop.io.BytesWritable has been deprecated
[WARNING] <http://hudson.zones.apache.org/hudson/job/HBase-Patch/ws/trunk/core/src/test/java/org/apache/hadoop/hbase/io/hfile/KVGenerator.java>:[77,33] [deprecation] get() in org.apache.hadoop.io.BytesWritable has been deprecated
[WARNING] <http://hudson.zones.apache.org/hudson/job/HBase-Patch/ws/trunk/core/src/test/java/org/apache/hadoop/hbase/io/hfile/KVGenerator.java>:[88,33] [deprecation] get() in org.apache.hadoop.io.BytesWritable has been deprecated
[WARNING] <http://hudson.zones.apache.org/hudson/job/HBase-Patch/ws/trunk/core/src/test/java/org/apache/hadoop/hbase/mapred/TestTableMapReduce.java>:[126,4] [deprecation] org.apache.hadoop.mapred.JobConf in org.apache.hadoop.mapred has been deprecated
[WARNING] <http://hudson.zones.apache.org/hudson/job/HBase-Patch/ws/trunk/core/src/test/java/org/apache/hadoop/hbase/mapred/TestTableMapReduce.java>:[129,20] [deprecation] org.apache.hadoop.mapred.JobConf in org.apache.hadoop.mapred has been deprecated
[WARNING] <http://hudson.zones.apache.org/hudson/job/HBase-Patch/ws/trunk/core/src/test/java/org/apache/hadoop/hbase/mapred/TestTableMapReduce.java>:[132,6] [deprecation] org.apache.hadoop.hbase.mapred.TableMapReduceUtil in org.apache.hadoop.hbase.mapred has been deprecated
[WARNING] <http://hudson.zones.apache.org/hudson/job/HBase-Patch/ws/trunk/core/src/test/java/org/apache/hadoop/hbase/mapred/TestTableMapReduce.java>:[136,8] [deprecation] org.apache.hadoop.hbase.mapred.IdentityTableReduce in org.apache.hadoop.hbase.mapred has been deprecated
[WARNING] <http://hudson.zones.apache.org/hudson/job/HBase-Patch/ws/trunk/core/src/test/java/org/apache/hadoop/hbase/mapred/TestTableMapReduce.java>:[135,6] [deprecation] org.apache.hadoop.hbase.mapred.TableMapReduceUtil in org.apache.hadoop.hbase.mapred has been deprecated
[INFO] [surefire:test {execution: default-test}]
[INFO] Surefire report directory: <http://hudson.zones.apache.org/hudson/job/HBase-Patch/ws/trunk/core/target/surefire-reports>
-------------------------------------------------------
T E S T S
-------------------------------------------------------
Running org.apache.hadoop.hbase.TestFullLogReconstruction
Tests run: 1, Failures: 0, Errors: 0, Skipped: 0, Time elapsed: 151.319 sec
Running org.apache.hadoop.hbase.TestSerialization
Tests run: 18, Failures: 0, Errors: 0, Skipped: 0, Time elapsed: 11.001 sec
Running org.apache.hadoop.hbase.TestZooKeeper
Tests run: 4, Failures: 0, Errors: 0, Skipped: 0, Time elapsed: 108.85 sec
Running org.apache.hadoop.hbase.regionserver.wal.TestLogRolling
Tests run: 1, Failures: 0, Errors: 0, Skipped: 0, Time elapsed: 55.556 sec
Running org.apache.hadoop.hbase.io.hfile.TestCachedBlockQueue
Tests run: 2, Failures: 0, Errors: 0, Skipped: 0, Time elapsed: 0.094 sec
Running org.apache.hadoop.hbase.regionserver.TestKeyValueHeap
Tests run: 3, Failures: 0, Errors: 0, Skipped: 0, Time elapsed: 0.443 sec
Running org.apache.hadoop.hbase.regionserver.TestStoreScanner
Tests run: 13, Failures: 0, Errors: 0, Skipped: 0, Time elapsed: 0.118 sec
Running org.apache.hadoop.hbase.TestHMsg
Tests run: 2, Failures: 0, Errors: 0, Skipped: 0, Time elapsed: 0.064 sec
Running org.apache.hadoop.hbase.filter.TestPrefixFilter
Tests run: 3, Failures: 0, Errors: 0, Skipped: 0, Time elapsed: 0.043 sec
Running org.apache.hadoop.hbase.util.TestKeying
Tests run: 1, Failures: 0, Errors: 0, Skipped: 0, Time elapsed: 0.037 sec
Running org.apache.hadoop.hbase.regionserver.TestScanner
Tests run: 5, Failures: 0, Errors: 0, Skipped: 0, Time elapsed: 33.459 sec
Running org.apache.hadoop.hbase.regionserver.TestHRegionInfo
Tests run: 1, Failures: 0, Errors: 0, Skipped: 0, Time elapsed: 0.324 sec
Running org.apache.hadoop.hbase.io.TestHeapSize
Tests run: 2, Failures: 0, Errors: 0, Skipped: 0, Time elapsed: 0.121 sec
Running org.apache.hadoop.hbase.regionserver.TestMinorCompactingStoreScanner
Tests run: 2, Failures: 0, Errors: 0, Skipped: 0, Time elapsed: 0.1 sec
Running org.apache.hadoop.hbase.TestInfoServers
Tests run: 1, Failures: 0, Errors: 0, Skipped: 0, Time elapsed: 11.487 sec
Running org.apache.hadoop.hbase.io.hfile.TestHFileSeek
Tests run: 1, Failures: 0, Errors: 0, Skipped: 0, Time elapsed: 4.529 sec
Running org.apache.hadoop.hbase.regionserver.TestStore
Tests run: 5, Failures: 0, Errors: 0, Skipped: 0, Time elapsed: 1.079 sec
Running org.apache.hadoop.hbase.zookeeper.TestHQuorumPeer
Tests run: 2, Failures: 0, Errors: 0, Skipped: 0, Time elapsed: 0.483 sec
Running org.apache.hadoop.hbase.io.hfile.TestHFilePerformance
Tests run: 1, Failures: 0, Errors: 0, Skipped: 0, Time elapsed: 6.007 sec
Running org.apache.hadoop.hbase.io.TestHbaseObjectWritable
Tests run: 1, Failures: 0, Errors: 0, Skipped: 0, Time elapsed: 0.214 sec
Running org.apache.hadoop.hbase.master.TestOldLogsCleaner
Tests run: 1, Failures: 0, Errors: 0, Skipped: 0, Time elapsed: 0.756 sec
Running org.apache.hadoop.hbase.thrift.TestThriftServer
Tests run: 1, Failures: 0, Errors: 0, Skipped: 0, Time elapsed: 87.609 sec
Running org.apache.hadoop.hbase.regionserver.TestQueryMatcher
Tests run: 4, Failures: 0, Errors: 0, Skipped: 0, Time elapsed: 0.489 sec
Running org.apache.hadoop.hbase.client.TestAdmin
Tests run: 14, Failures: 0, Errors: 0, Skipped: 0, Time elapsed: 146.141 sec
Running org.apache.hadoop.hbase.util.TestMergeTool
Tests run: 1, Failures: 0, Errors: 0, Skipped: 0, Time elapsed: 24.349 sec
Running org.apache.hadoop.hbase.TestCompare
Tests run: 1, Failures: 0, Errors: 0, Skipped: 0, Time elapsed: 0.055 sec
Running org.apache.hadoop.hbase.regionserver.TestExplicitColumnTracker
Tests run: 3, Failures: 0, Errors: 0, Skipped: 0, Time elapsed: 0.85 sec
Running org.apache.hadoop.hbase.regionserver.TestStoreReconstruction
Tests run: 1, Failures: 0, Errors: 0, Skipped: 0, Time elapsed: 17.582 sec
Running org.apache.hadoop.hbase.TestEmptyMetaInfo
Tests run: 1, Failures: 0, Errors: 0, Skipped: 0, Time elapsed: 41.752 sec
Running org.apache.hadoop.hbase.util.TestBase64
Tests run: 1, Failures: 0, Errors: 0, Skipped: 0, Time elapsed: 0.092 sec
Running org.apache.hadoop.hbase.regionserver.TestMemStore
Tests run: 17, Failures: 0, Errors: 0, Skipped: 0, Time elapsed: 0.306 sec
Running org.apache.hadoop.hbase.io.hfile.TestLruBlockCache
Tests run: 7, Failures: 0, Errors: 0, Skipped: 0, Time elapsed: 1.147 sec
Running org.apache.hadoop.hbase.regionserver.TestDeleteCompare
Tests run: 4, Failures: 0, Errors: 0, Skipped: 0, Time elapsed: 0.101 sec
Running org.apache.hadoop.hbase.regionserver.TestScanWildcardColumnTracker
Tests run: 2, Failures: 0, Errors: 0, Skipped: 0, Time elapsed: 0.453 sec
Running org.apache.hadoop.hbase.regionserver.TestKeyValueSkipListSet
Tests run: 4, Failures: 0, Errors: 0, Skipped: 0, Time elapsed: 0.103 sec
Running org.apache.hadoop.hbase.io.hfile.TestSeekTo
Tests run: 3, Failures: 0, Errors: 0, Skipped: 0, Time elapsed: 0.515 sec
Running org.apache.hadoop.hbase.filter.TestPageFilter
Tests run: 2, Failures: 0, Errors: 0, Skipped: 0, Time elapsed: 0.041 sec
Running org.apache.hadoop.hbase.TestMergeMeta
Tests run: 1, Failures: 0, Errors: 0, Skipped: 0, Time elapsed: 34.48 sec
Running org.apache.hadoop.hbase.TestKeyValue
Tests run: 7, Failures: 0, Errors: 0, Skipped: 0, Time elapsed: 0.107 sec
Running org.apache.hadoop.hbase.mapreduce.TestTableMapReduce
Tests run: 1, Failures: 0, Errors: 0, Skipped: 0, Time elapsed: 59.426 sec
Running org.apache.hadoop.hbase.client.TestFromClientSide
Tests run: 33, Failures: 0, Errors: 0, Skipped: 4, Time elapsed: 227.698 sec
Running org.apache.hadoop.hbase.regionserver.TestCompaction
Tests run: 2, Failures: 0, Errors: 0, Skipped: 0, Time elapsed: 39.571 sec
Running org.apache.hadoop.hbase.client.TestHTablePool
Tests run: 4, Failures: 0, Errors: 0, Skipped: 0, Time elapsed: 0.486 sec
Running org.apache.hadoop.hbase.TestMultiParallelPut
Tests run: 1, Failures: 0, Errors: 0, Skipped: 0, Time elapsed: 38.119 sec
Running org.apache.hadoop.hbase.master.TestRegionManager
Tests run: 1, Failures: 0, Errors: 0, Skipped: 0, Time elapsed: 34.897 sec
Running org.apache.hadoop.hbase.mapreduce.TestTimeRangeMapRed
Tests run: 1, Failures: 0, Errors: 0, Skipped: 0, Time elapsed: 30.264 sec
Running org.apache.hadoop.hbase.filter.TestSingleColumnValueFilter
Tests run: 2, Failures: 0, Errors: 0, Skipped: 0, Time elapsed: 0.137 sec
Running org.apache.hadoop.hbase.master.TestMinimumServerCount
Tests run: 1, Failures: 0, Errors: 0, Skipped: 0, Time elapsed: 84.685 sec
Running org.apache.hadoop.hbase.mapreduce.TestSimpleTotalOrderPartitioner
Tests run: 1, Failures: 0, Errors: 0, Skipped: 0, Time elapsed: 0.389 sec
Running org.apache.hadoop.hbase.regionserver.TestGetDeleteTracker
Tests run: 7, Failures: 0, Errors: 0, Skipped: 0, Time elapsed: 0.625 sec
Running org.apache.hadoop.hbase.mapreduce.TestHFileOutputFormat
Tests run: 1, Failures: 0, Errors: 0, Skipped: 0, Time elapsed: 5.623 sec
Running org.apache.hadoop.hbase.regionserver.TestScanDeleteTracker
Tests run: 6, Failures: 0, Errors: 0, Skipped: 0, Time elapsed: 0.584 sec
Running org.apache.hadoop.hbase.metrics.TestMetricsMBeanBase
Tests run: 2, Failures: 0, Errors: 0, Skipped: 0, Time elapsed: 0.107 sec
Running org.apache.hadoop.hbase.mapreduce.TestTableInputFormatScan
Tests run: 11, Failures: 0, Errors: 0, Skipped: 0, Time elapsed: 100.061 sec
Running org.apache.hadoop.hbase.filter.TestFilterList
Tests run: 4, Failures: 0, Errors: 0, Skipped: 0, Time elapsed: 0.151 sec
Running org.apache.hadoop.hbase.regionserver.TestHRegion
Tests run: 37, Failures: 0, Errors: 0, Skipped: 0, Time elapsed: 7.878 sec
Running org.apache.hadoop.hbase.TestRegionRebalancing
Tests run: 1, Failures: 0, Errors: 0, Skipped: 0, Time elapsed: 115.549 sec
Running org.apache.hadoop.hbase.filter.TestInclusiveStopFilter
Tests run: 2, Failures: 0, Errors: 0, Skipped: 0, Time elapsed: 0.043 sec
Running org.apache.hadoop.hbase.filter.TestSingleColumnValueExcludeFilter
Tests run: 1, Failures: 0, Errors: 0, Skipped: 0, Time elapsed: 0.102 sec
Running org.apache.hadoop.hbase.util.TestRootPath
Tests run: 1, Failures: 0, Errors: 0, Skipped: 0, Time elapsed: 0.096 sec
Running org.apache.hadoop.hbase.mapred.TestTableMapReduce
Tests run: 1, Failures: 0, Errors: 0, Skipped: 0, Time elapsed: 55.267 sec
Running org.apache.hadoop.hbase.regionserver.TestKeyValueScanFixture
Tests run: 1, Failures: 0, Errors: 0, Skipped: 0, Time elapsed: 0.097 sec
Running org.apache.hadoop.hbase.util.TestBytes
Tests run: 8, Failures: 0, Errors: 0, Skipped: 0, Time elapsed: 0.047 sec
Running org.apache.hadoop.hbase.regionserver.TestWildcardColumnTracker
Tests run: 6, Failures: 0, Errors: 0, Skipped: 0, Time elapsed: 0.88 sec
Running org.apache.hadoop.hbase.regionserver.TestStoreFile
Tests run: 2, Failures: 0, Errors: 0, Skipped: 0, Time elapsed: 7.574 sec
Running org.apache.hadoop.hbase.client.TestGetRowVersions
Tests run: 1, Failures: 0, Errors: 0, Skipped: 0, Time elapsed: 108.364 sec
Running org.apache.hadoop.hbase.io.hfile.TestHFile
Tests run: 7, Failures: 0, Errors: 0, Skipped: 0, Time elapsed: 0.854 sec
Running org.apache.hadoop.hbase.filter.TestFilter
Tests run: 14, Failures: 0, Errors: 0, Skipped: 0, Time elapsed: 3.206 sec
Running org.apache.hadoop.hbase.regionserver.TestWideScanner
Tests run: 1, Failures: 0, Errors: 0, Skipped: 0, Time elapsed: 21.266 sec
Running org.apache.hadoop.hbase.regionserver.wal.TestHLog
Tests run: 4, Failures: 0, Errors: 0, Skipped: 0, Time elapsed: 51.328 sec
Running org.apache.hadoop.hbase.client.TestTimestamp
Tests run: 1, Failures: 0, Errors: 0, Skipped: 0, Time elapsed: 27.616 sec
Running org.apache.hadoop.hbase.TestScanMultipleVersions
Tests run: 1, Failures: 0, Errors: 0, Skipped: 0, Time elapsed: 40.689 sec
Running org.apache.hadoop.hbase.TestMergeTable
Tests run: 1, Failures: 0, Errors: 0, Skipped: 0, Time elapsed: 58.666 sec
Running org.apache.hadoop.hbase.regionserver.TestGetClosestAtOrBefore
Tests run: 3, Failures: 0, Errors: 0, Skipped: 0, Time elapsed: 24.654 sec
Results :
Tests run: 315, Failures: 0, Errors: 0, Skipped: 4
[INFO] [jar:jar {execution: default-jar}]
[INFO] Building jar: <http://hudson.zones.apache.org/hudson/job/HBase-Patch/ws/trunk/core/target/hbase-core-0.21.0-SNAPSHOT.jar>
[INFO] [jar:test-jar {execution: default}]
[INFO] Building jar: <http://hudson.zones.apache.org/hudson/job/HBase-Patch/ws/trunk/core/target/hbase-core-0.21.0-SNAPSHOT-tests.jar>
[INFO] [source:jar-no-fork {execution: attach-sources}]
[INFO] Building jar: <http://hudson.zones.apache.org/hudson/job/HBase-Patch/ws/trunk/core/target/hbase-core-0.21.0-SNAPSHOT-sources.jar>
[INFO] [install:install {execution: default-install}]
[INFO] Installing <http://hudson.zones.apache.org/hudson/job/HBase-Patch/ws/trunk/core/target/hbase-core-0.21.0-SNAPSHOT.jar> to /home/hudson/.m2/repository/org/apache/hbase/hbase-core/0.21.0-SNAPSHOT/hbase-core-0.21.0-SNAPSHOT.jar
[INFO] Installing <http://hudson.zones.apache.org/hudson/job/HBase-Patch/ws/trunk/core/target/hbase-core-0.21.0-SNAPSHOT-tests.jar> to /home/hudson/.m2/repository/org/apache/hbase/hbase-core/0.21.0-SNAPSHOT/hbase-core-0.21.0-SNAPSHOT-tests.jar
[INFO] Installing <http://hudson.zones.apache.org/hudson/job/HBase-Patch/ws/trunk/core/target/hbase-core-0.21.0-SNAPSHOT-sources.jar> to /home/hudson/.m2/repository/org/apache/hbase/hbase-core/0.21.0-SNAPSHOT/hbase-core-0.21.0-SNAPSHOT-sources.jar
[INFO] ------------------------------------------------------------------------
[INFO] Building HBase Contrib
[INFO] task-segment: [clean, install]
[INFO] ------------------------------------------------------------------------
[INFO] [clean:clean {execution: default-clean}]
[INFO] [site:attach-descriptor {execution: default-attach-descriptor}]
[INFO] [install:install {execution: default-install}]
[INFO] Installing <http://hudson.zones.apache.org/hudson/job/HBase-Patch/ws/trunk/contrib/pom.xml> to /home/hudson/.m2/repository/org/apache/hbase/hbase-contrib/0.21.0-SNAPSHOT/hbase-contrib-0.21.0-SNAPSHOT.pom
[INFO] ------------------------------------------------------------------------
[INFO] Building HBase Contrib - Multi Datacenter Replication
[INFO] task-segment: [clean, install]
[INFO] ------------------------------------------------------------------------
[INFO] [clean:clean {execution: default-clean}]
[INFO] Deleting directory <http://hudson.zones.apache.org/hudson/job/HBase-Patch/ws/trunk/contrib/mdc_replication/target>
[INFO] [resources:resources {execution: default-resources}]
[INFO] Using 'UTF-8' encoding to copy filtered resources.
[INFO] skip non existing resourceDirectory <http://hudson.zones.apache.org/hudson/job/HBase-Patch/ws/trunk/contrib/mdc_replication/src/main/resources>
[INFO] [compiler:compile {execution: default-compile}]
[INFO] Compiling 8 source files to <http://hudson.zones.apache.org/hudson/job/HBase-Patch/ws/trunk/contrib/mdc_replication/target/classes>
[INFO] -------------------------------------------------------------
[ERROR] COMPILATION ERROR :
[INFO] -------------------------------------------------------------
[ERROR] <http://hudson.zones.apache.org/hudson/job/HBase-Patch/ws/trunk/contrib/mdc_replication/src/main/java/org/apache/hadoop/hbase/regionserver/wal/replication/ReplicationHLog.java>:[73,9] doWrite(org.apache.hadoop.hbase.HRegionInfo,org.apache.hadoop.hbase.regionserver.wal.HLogKey,org.apache.hadoop.hbase.KeyValue) in org.apache.hadoop.hbase.regionserver.wal.HLog cannot be applied to (org.apache.hadoop.hbase.HRegionInfo,org.apache.hadoop.hbase.regionserver.wal.HLogKey,org.apache.hadoop.hbase.KeyValue,long)
[ERROR] <http://hudson.zones.apache.org/hudson/job/HBase-Patch/ws/trunk/contrib/mdc_replication/src/main/java/org/apache/hadoop/hbase/regionserver/wal/replication/ReplicationHLog.java>:[68,2] method does not override or implement a method from a supertype
[INFO] 2 errors
[INFO] -------------------------------------------------------------
[INFO] ------------------------------------------------------------------------
[ERROR] BUILD FAILURE
[INFO] ------------------------------------------------------------------------
[INFO] Compilation failure
<http://hudson.zones.apache.org/hudson/job/HBase-Patch/ws/trunk/contrib/mdc_replication/src/main/java/org/apache/hadoop/hbase/regionserver/wal/replication/ReplicationHLog.java>:[73,9] doWrite(org.apache.hadoop.hbase.HRegionInfo,org.apache.hadoop.hbase.regionserver.wal.HLogKey,org.apache.hadoop.hbase.KeyValue) in org.apache.hadoop.hbase.regionserver.wal.HLog cannot be applied to (org.apache.hadoop.hbase.HRegionInfo,org.apache.hadoop.hbase.regionserver.wal.HLogKey,org.apache.hadoop.hbase.KeyValue,long)
<http://hudson.zones.apache.org/hudson/job/HBase-Patch/ws/trunk/contrib/mdc_replication/src/main/java/org/apache/hadoop/hbase/regionserver/wal/replication/ReplicationHLog.java>:[68,2] method does not override or implement a method from a supertype
[INFO] ------------------------------------------------------------------------
[INFO] For more information, run Maven with the -e switch
[INFO] ------------------------------------------------------------------------
[INFO] Total time: 32 minutes 21 seconds
[INFO] Finished at: Thu Mar 04 06:57:19 UTC 2010
[INFO] Final Memory: 44M/99M
[INFO] ------------------------------------------------------------------------
[locks-and-latches] Releasing all the locks
[locks-and-latches] All the locks released
Archiving artifacts
Recording test results
Build failed in Hudson: HBase-Patch #1136
Posted by Apache Hudson Server <hu...@hudson.zones.apache.org>.
See <http://hudson.zones.apache.org/hudson/job/HBase-Patch/1136/changes>
Changes:
[stack] HBASE-2244 META gets inconsistent in a number of crash scenarios
------------------------------------------
[...truncated 597 lines...]
Tests run: 1, Failures: 0, Errors: 0, Skipped: 0, Time elapsed: 20.304 sec
Running org.apache.hadoop.hbase.regionserver.wal.TestHLog
Tests run: 4, Failures: 0, Errors: 0, Skipped: 0, Time elapsed: 53.925 sec
Running org.apache.hadoop.hbase.client.TestTimestamp
Tests run: 1, Failures: 0, Errors: 0, Skipped: 0, Time elapsed: 42.206 sec
Running org.apache.hadoop.hbase.TestScanMultipleVersions
Tests run: 1, Failures: 0, Errors: 0, Skipped: 0, Time elapsed: 37 sec
Running org.apache.hadoop.hbase.TestMergeTable
Tests run: 1, Failures: 0, Errors: 0, Skipped: 0, Time elapsed: 44.37 sec
Running org.apache.hadoop.hbase.regionserver.TestGetClosestAtOrBefore
Tests run: 3, Failures: 0, Errors: 0, Skipped: 0, Time elapsed: 18.285 sec
Results :
Tests run: 315, Failures: 0, Errors: 0, Skipped: 4
[INFO] [jar:jar {execution: default-jar}]
[INFO] Building jar: <http://hudson.zones.apache.org/hudson/job/HBase-Patch/ws/trunk/core/target/hbase-core-0.21.0-SNAPSHOT.jar>
[INFO] [jar:test-jar {execution: default}]
[INFO] Building jar: <http://hudson.zones.apache.org/hudson/job/HBase-Patch/ws/trunk/core/target/hbase-core-0.21.0-SNAPSHOT-tests.jar>
[INFO] [source:jar-no-fork {execution: attach-sources}]
[INFO] Building jar: <http://hudson.zones.apache.org/hudson/job/HBase-Patch/ws/trunk/core/target/hbase-core-0.21.0-SNAPSHOT-sources.jar>
[INFO] [install:install {execution: default-install}]
[INFO] Installing <http://hudson.zones.apache.org/hudson/job/HBase-Patch/ws/trunk/core/target/hbase-core-0.21.0-SNAPSHOT.jar> to /home/hudson/.m2/repository/org/apache/hbase/hbase-core/0.21.0-SNAPSHOT/hbase-core-0.21.0-SNAPSHOT.jar
[INFO] Installing <http://hudson.zones.apache.org/hudson/job/HBase-Patch/ws/trunk/core/target/hbase-core-0.21.0-SNAPSHOT-tests.jar> to /home/hudson/.m2/repository/org/apache/hbase/hbase-core/0.21.0-SNAPSHOT/hbase-core-0.21.0-SNAPSHOT-tests.jar
[INFO] Installing <http://hudson.zones.apache.org/hudson/job/HBase-Patch/ws/trunk/core/target/hbase-core-0.21.0-SNAPSHOT-sources.jar> to /home/hudson/.m2/repository/org/apache/hbase/hbase-core/0.21.0-SNAPSHOT/hbase-core-0.21.0-SNAPSHOT-sources.jar
[INFO] ------------------------------------------------------------------------
[INFO] Building HBase Contrib
[INFO] task-segment: [clean, install]
[INFO] ------------------------------------------------------------------------
[INFO] [clean:clean {execution: default-clean}]
[INFO] [site:attach-descriptor {execution: default-attach-descriptor}]
[INFO] [install:install {execution: default-install}]
[INFO] Installing <http://hudson.zones.apache.org/hudson/job/HBase-Patch/ws/trunk/contrib/pom.xml> to /home/hudson/.m2/repository/org/apache/hbase/hbase-contrib/0.21.0-SNAPSHOT/hbase-contrib-0.21.0-SNAPSHOT.pom
[INFO] ------------------------------------------------------------------------
[INFO] Building HBase Contrib - Multi Datacenter Replication
[INFO] task-segment: [clean, install]
[INFO] ------------------------------------------------------------------------
[INFO] [clean:clean {execution: default-clean}]
[INFO] Deleting directory <http://hudson.zones.apache.org/hudson/job/HBase-Patch/ws/trunk/contrib/mdc_replication/target>
[INFO] [resources:resources {execution: default-resources}]
[INFO] Using 'UTF-8' encoding to copy filtered resources.
[INFO] skip non existing resourceDirectory <http://hudson.zones.apache.org/hudson/job/HBase-Patch/ws/trunk/contrib/mdc_replication/src/main/resources>
[INFO] [compiler:compile {execution: default-compile}]
[INFO] Compiling 8 source files to <http://hudson.zones.apache.org/hudson/job/HBase-Patch/ws/trunk/contrib/mdc_replication/target/classes>
[INFO] [resources:testResources {execution: default-testResources}]
[INFO] Using 'UTF-8' encoding to copy filtered resources.
[INFO] skip non existing resourceDirectory <http://hudson.zones.apache.org/hudson/job/HBase-Patch/ws/trunk/contrib/mdc_replication/src/test/resources>
[INFO] [compiler:testCompile {execution: default-testCompile}]
[INFO] Compiling 2 source files to <http://hudson.zones.apache.org/hudson/job/HBase-Patch/ws/trunk/contrib/mdc_replication/target/test-classes>
[INFO] [surefire:test {execution: default-test}]
[INFO] Surefire report directory: <http://hudson.zones.apache.org/hudson/job/HBase-Patch/ws/trunk/contrib/mdc_replication/target/surefire-reports>
-------------------------------------------------------
T E S T S
-------------------------------------------------------
Running org.apache.hadoop.hbase.replication.TestReplication
Tests run: 2, Failures: 0, Errors: 0, Skipped: 0, Time elapsed: 79.775 sec
Running org.apache.hadoop.hbase.regionserver.replication.TestReplicationSink
Tests run: 5, Failures: 0, Errors: 0, Skipped: 0, Time elapsed: 41.282 sec
Results :
Tests run: 7, Failures: 0, Errors: 0, Skipped: 0
[INFO] [jar:jar {execution: default-jar}]
[INFO] Building jar: <http://hudson.zones.apache.org/hudson/job/HBase-Patch/ws/trunk/contrib/mdc_replication/target/hbase-contrib-mdc_replication-0.21.0-SNAPSHOT.jar>
[INFO] [install:install {execution: default-install}]
[INFO] Installing <http://hudson.zones.apache.org/hudson/job/HBase-Patch/ws/trunk/contrib/mdc_replication/target/hbase-contrib-mdc_replication-0.21.0-SNAPSHOT.jar> to /home/hudson/.m2/repository/org/apache/hbase/hbase-contrib-mdc_replication/0.21.0-SNAPSHOT/hbase-contrib-mdc_replication-0.21.0-SNAPSHOT.jar
[INFO] ------------------------------------------------------------------------
[INFO] Building HBase Contrib - Stargate
[INFO] task-segment: [clean, install]
[INFO] ------------------------------------------------------------------------
[INFO] [clean:clean {execution: default-clean}]
[INFO] Deleting directory <http://hudson.zones.apache.org/hudson/job/HBase-Patch/ws/trunk/contrib/stargate/target>
[INFO] [resources:resources {execution: default-resources}]
[INFO] Using 'UTF-8' encoding to copy filtered resources.
[INFO] Copying 10 resources
[INFO] [compiler:compile {execution: default-compile}]
[INFO] Compiling 56 source files to <http://hudson.zones.apache.org/hudson/job/HBase-Patch/ws/trunk/contrib/stargate/target/classes>
[INFO] [resources:testResources {execution: default-testResources}]
[INFO] Using 'UTF-8' encoding to copy filtered resources.
[INFO] skip non existing resourceDirectory <http://hudson.zones.apache.org/hudson/job/HBase-Patch/ws/trunk/contrib/stargate/src/test/resources>
[INFO] [compiler:testCompile {execution: default-testCompile}]
[INFO] Compiling 24 source files to <http://hudson.zones.apache.org/hudson/job/HBase-Patch/ws/trunk/contrib/stargate/target/test-classes>
[INFO] [surefire:test {execution: default-test}]
[INFO] Surefire report directory: <http://hudson.zones.apache.org/hudson/job/HBase-Patch/ws/trunk/contrib/stargate/target/surefire-reports>
-------------------------------------------------------
T E S T S
-------------------------------------------------------
Running org.apache.hadoop.hbase.stargate.model.TestScannerModel
Tests run: 3, Failures: 0, Errors: 0, Skipped: 0, Time elapsed: 0.476 sec
Running org.apache.hadoop.hbase.stargate.model.TestTableSchemaModel
Tests run: 3, Failures: 0, Errors: 0, Skipped: 0, Time elapsed: 0.039 sec
Running org.apache.hadoop.hbase.stargate.model.TestStorageClusterVersionModel
Tests run: 2, Failures: 0, Errors: 0, Skipped: 0, Time elapsed: 0.013 sec
Running org.apache.hadoop.hbase.stargate.TestRowResource
Tests run: 8, Failures: 0, Errors: 0, Skipped: 0, Time elapsed: 31.908 sec
Running org.apache.hadoop.hbase.stargate.model.TestTableInfoModel
Tests run: 3, Failures: 0, Errors: 0, Skipped: 0, Time elapsed: 0.027 sec
Running org.apache.hadoop.hbase.stargate.TestStatusResource
Tests run: 2, Failures: 0, Errors: 0, Skipped: 0, Time elapsed: 0.059 sec
Running org.apache.hadoop.hbase.stargate.auth.TestHTableAuthenticator
Tests run: 4, Failures: 0, Errors: 0, Skipped: 0, Time elapsed: 5.275 sec
Running org.apache.hadoop.hbase.stargate.TestSchemaResource
Tests run: 2, Failures: 0, Errors: 0, Skipped: 0, Time elapsed: 20.834 sec
Running org.apache.hadoop.hbase.stargate.auth.TestJDBCAuthenticator
Tests run: 4, Failures: 0, Errors: 0, Skipped: 0, Time elapsed: 0.133 sec
Running org.apache.hadoop.hbase.stargate.auth.TestZooKeeperAuthenticator
Tests run: 4, Failures: 0, Errors: 0, Skipped: 0, Time elapsed: 0.31 sec
Running org.apache.hadoop.hbase.stargate.Test00MiniCluster
Tests run: 4, Failures: 0, Errors: 0, Skipped: 0, Time elapsed: 0.004 sec
Running org.apache.hadoop.hbase.stargate.TestVersionResource
Tests run: 7, Failures: 0, Errors: 0, Skipped: 0, Time elapsed: 0.081 sec
Running org.apache.hadoop.hbase.stargate.model.TestTableListModel
Tests run: 3, Failures: 0, Errors: 0, Skipped: 0, Time elapsed: 0.014 sec
Running org.apache.hadoop.hbase.stargate.model.TestVersionModel
Tests run: 3, Failures: 0, Errors: 0, Skipped: 0, Time elapsed: 0.016 sec
Running org.apache.hadoop.hbase.stargate.auth.TestHBCAuthenticator
Tests run: 4, Failures: 0, Errors: 0, Skipped: 0, Time elapsed: 0.015 sec
Running org.apache.hadoop.hbase.stargate.model.TestStorageClusterStatusModel
Tests run: 3, Failures: 0, Errors: 0, Skipped: 0, Time elapsed: 0.059 sec
Running org.apache.hadoop.hbase.stargate.model.TestCellModel
Tests run: 3, Failures: 0, Errors: 0, Skipped: 0, Time elapsed: 0.013 sec
Running org.apache.hadoop.hbase.stargate.TestScannerResource
Tests run: 4, Failures: 0, Errors: 0, Skipped: 0, Time elapsed: 21.835 sec
Running org.apache.hadoop.hbase.stargate.model.TestCellSetModel
Tests run: 3, Failures: 0, Errors: 0, Skipped: 0, Time elapsed: 0.02 sec
Running org.apache.hadoop.hbase.stargate.model.TestTableRegionModel
Tests run: 2, Failures: 0, Errors: 0, Skipped: 0, Time elapsed: 0.012 sec
Running org.apache.hadoop.hbase.stargate.model.TestColumnSchemaModel
Tests run: 2, Failures: 0, Errors: 0, Skipped: 0, Time elapsed: 0.006 sec
Running org.apache.hadoop.hbase.stargate.model.TestRowModel
Tests run: 2, Failures: 0, Errors: 0, Skipped: 0, Time elapsed: 0.012 sec
Running org.apache.hadoop.hbase.stargate.TestTableResource
Tests run: 4, Failures: 0, Errors: 0, Skipped: 0, Time elapsed: 5.413 sec
Results :
Tests run: 79, Failures: 0, Errors: 0, Skipped: 0
[INFO] [war:war {execution: default-war}]
[INFO] Packaging webapp
[INFO] Assembling webapp[hbase-contrib-stargate] in [<http://hudson.zones.apache.org/hudson/job/HBase-Patch/ws/trunk/contrib/stargate/target/hbase-contrib-stargate-0.21.0-SNAPSHOT]>
[INFO] Processing war project
[INFO] Webapp assembled in[394 msecs]
[INFO] Building war: <http://hudson.zones.apache.org/hudson/job/HBase-Patch/ws/trunk/contrib/stargate/target/hbase-contrib-stargate-0.21.0-SNAPSHOT.war>
[INFO] [install:install {execution: default-install}]
[INFO] Installing <http://hudson.zones.apache.org/hudson/job/HBase-Patch/ws/trunk/contrib/stargate/target/hbase-contrib-stargate-0.21.0-SNAPSHOT.war> to /home/hudson/.m2/repository/org/apache/hbase/hbase-contrib-stargate/0.21.0-SNAPSHOT/hbase-contrib-stargate-0.21.0-SNAPSHOT.war
[INFO] ------------------------------------------------------------------------
[INFO] Building HBase Contrib - Transactional
[INFO] task-segment: [clean, install]
[INFO] ------------------------------------------------------------------------
[INFO] [clean:clean {execution: default-clean}]
[INFO] Deleting directory <http://hudson.zones.apache.org/hudson/job/HBase-Patch/ws/trunk/contrib/transactional/target>
[INFO] [resources:resources {execution: default-resources}]
[INFO] Using 'UTF-8' encoding to copy filtered resources.
[INFO] skip non existing resourceDirectory <http://hudson.zones.apache.org/hudson/job/HBase-Patch/ws/trunk/contrib/transactional/src/main/resources>
[INFO] [compiler:compile {execution: default-compile}]
[INFO] Compiling 31 source files to <http://hudson.zones.apache.org/hudson/job/HBase-Patch/ws/trunk/contrib/transactional/target/classes>
[WARNING] <http://hudson.zones.apache.org/hudson/job/HBase-Patch/ws/trunk/contrib/transactional/src/main/java/org/apache/hadoop/hbase/client/transactional/HBaseBackedTransactionLogger.java>:[56,38] [deprecation] HBaseConfiguration() in org.apache.hadoop.hbase.HBaseConfiguration has been deprecated
[WARNING] <http://hudson.zones.apache.org/hudson/job/HBase-Patch/ws/trunk/contrib/transactional/src/main/java/org/apache/hadoop/hbase/client/transactional/HBaseBackedTransactionLogger.java>:[68,38] [deprecation] HBaseConfiguration() in org.apache.hadoop.hbase.HBaseConfiguration has been deprecated
[WARNING] <http://hudson.zones.apache.org/hudson/job/HBase-Patch/ws/trunk/contrib/transactional/src/main/java/org/apache/hadoop/hbase/client/tableindexed/IndexSpecification.java>:[154,49] [deprecation] HBaseConfiguration() in org.apache.hadoop.hbase.HBaseConfiguration has been deprecated
[INFO] [resources:testResources {execution: default-testResources}]
[INFO] Using 'UTF-8' encoding to copy filtered resources.
[INFO] skip non existing resourceDirectory <http://hudson.zones.apache.org/hudson/job/HBase-Patch/ws/trunk/contrib/transactional/src/test/resources>
[INFO] [compiler:testCompile {execution: default-testCompile}]
[INFO] Compiling 7 source files to <http://hudson.zones.apache.org/hudson/job/HBase-Patch/ws/trunk/contrib/transactional/target/test-classes>
[WARNING] <http://hudson.zones.apache.org/hudson/job/HBase-Patch/ws/trunk/contrib/transactional/src/test/java/org/apache/hadoop/hbase/client/tableindexed/TestIndexedTable.java>:[29,30] [deprecation] org.apache.hadoop.hbase.HBaseClusterTestCase in org.apache.hadoop.hbase has been deprecated
[WARNING] <http://hudson.zones.apache.org/hudson/job/HBase-Patch/ws/trunk/contrib/transactional/src/test/java/org/apache/hadoop/hbase/client/tableindexed/TestIndexedTable.java>:[43,38] [deprecation] org.apache.hadoop.hbase.HBaseClusterTestCase in org.apache.hadoop.hbase has been deprecated
[WARNING] <http://hudson.zones.apache.org/hudson/job/HBase-Patch/ws/trunk/contrib/transactional/src/test/java/org/apache/hadoop/hbase/client/transactional/TestTransactions.java>:[26,30] [deprecation] org.apache.hadoop.hbase.HBaseClusterTestCase in org.apache.hadoop.hbase has been deprecated
[WARNING] <http://hudson.zones.apache.org/hudson/job/HBase-Patch/ws/trunk/contrib/transactional/src/test/java/org/apache/hadoop/hbase/client/transactional/TestTransactions.java>:[44,38] [deprecation] org.apache.hadoop.hbase.HBaseClusterTestCase in org.apache.hadoop.hbase has been deprecated
[WARNING] <http://hudson.zones.apache.org/hudson/job/HBase-Patch/ws/trunk/contrib/transactional/src/test/java/org/apache/hadoop/hbase/regionserver/transactional/TestTHLogRecovery.java>:[30,30] [deprecation] org.apache.hadoop.hbase.HBaseClusterTestCase in org.apache.hadoop.hbase has been deprecated
[WARNING] <http://hudson.zones.apache.org/hudson/job/HBase-Patch/ws/trunk/contrib/transactional/src/test/java/org/apache/hadoop/hbase/regionserver/transactional/TestTHLogRecovery.java>:[51,39] [deprecation] org.apache.hadoop.hbase.HBaseClusterTestCase in org.apache.hadoop.hbase has been deprecated
[WARNING] <http://hudson.zones.apache.org/hudson/job/HBase-Patch/ws/trunk/contrib/transactional/src/test/java/org/apache/hadoop/hbase/client/transactional/StressTestTransactions.java>:[32,30] [deprecation] org.apache.hadoop.hbase.HBaseClusterTestCase in org.apache.hadoop.hbase has been deprecated
[WARNING] <http://hudson.zones.apache.org/hudson/job/HBase-Patch/ws/trunk/contrib/transactional/src/test/java/org/apache/hadoop/hbase/client/transactional/StressTestTransactions.java>:[53,44] [deprecation] org.apache.hadoop.hbase.HBaseClusterTestCase in org.apache.hadoop.hbase has been deprecated
[WARNING] <http://hudson.zones.apache.org/hudson/job/HBase-Patch/ws/trunk/contrib/transactional/src/test/java/org/apache/hadoop/hbase/regionserver/transactional/TestTHLog.java>:[27,30] [deprecation] org.apache.hadoop.hbase.HBaseTestCase in org.apache.hadoop.hbase has been deprecated
[WARNING] <http://hudson.zones.apache.org/hudson/job/HBase-Patch/ws/trunk/contrib/transactional/src/test/java/org/apache/hadoop/hbase/regionserver/transactional/TestTHLog.java>:[37,31] [deprecation] org.apache.hadoop.hbase.HBaseTestCase in org.apache.hadoop.hbase has been deprecated
[INFO] [surefire:test {execution: default-test}]
[INFO] Surefire report directory: <http://hudson.zones.apache.org/hudson/job/HBase-Patch/ws/trunk/contrib/transactional/target/surefire-reports>
-------------------------------------------------------
T E S T S
-------------------------------------------------------
Running org.apache.hadoop.hbase.client.tableindexed.TestIndexedTable
Tests run: 7, Failures: 0, Errors: 7, Skipped: 0, Time elapsed: 5.237 sec <<< FAILURE!
Running org.apache.hadoop.hbase.regionserver.transactional.TestTHLog
Tests run: 5, Failures: 0, Errors: 5, Skipped: 0, Time elapsed: 1.495 sec <<< FAILURE!
Running org.apache.hadoop.hbase.client.transactional.TestTransactions
Tests run: 7, Failures: 0, Errors: 7, Skipped: 0, Time elapsed: 2.046 sec <<< FAILURE!
Running org.apache.hadoop.hbase.regionserver.transactional.TestTHLogRecovery
Tests run: 2, Failures: 0, Errors: 0, Skipped: 0, Time elapsed: 504.587 sec
Results :
Tests in error:
testInitialWrites(org.apache.hadoop.hbase.client.tableindexed.TestIndexedTable)
testMultipleWrites(org.apache.hadoop.hbase.client.tableindexed.TestIndexedTable)
testDelete(org.apache.hadoop.hbase.client.tableindexed.TestIndexedTable)
testRowUpdate(org.apache.hadoop.hbase.client.tableindexed.TestIndexedTable)
testLockedRowUpdate(org.apache.hadoop.hbase.client.tableindexed.TestIndexedTable)
testLockedRowUpdateNoAutoFlush(org.apache.hadoop.hbase.client.tableindexed.TestIndexedTable)
testLockedRowDelete(org.apache.hadoop.hbase.client.tableindexed.TestIndexedTable)
testSingleCommit(org.apache.hadoop.hbase.regionserver.transactional.TestTHLog)
testSingleAbort(org.apache.hadoop.hbase.regionserver.transactional.TestTHLog)
testInterlievedCommits(org.apache.hadoop.hbase.regionserver.transactional.TestTHLog)
testInterlievedAbortCommit(org.apache.hadoop.hbase.regionserver.transactional.TestTHLog)
testInterlievedCommitAbort(org.apache.hadoop.hbase.regionserver.transactional.TestTHLog)
testSimpleTransaction(org.apache.hadoop.hbase.client.transactional.TestTransactions)
testTwoTransactionsWithoutConflict(org.apache.hadoop.hbase.client.transactional.TestTransactions)
testTwoTransactionsWithConflict(org.apache.hadoop.hbase.client.transactional.TestTransactions)
testGetAfterPut(org.apache.hadoop.hbase.client.transactional.TestTransactions)
testScanAfterUpdatePut(org.apache.hadoop.hbase.client.transactional.TestTransactions)
testScanAfterNewPut(org.apache.hadoop.hbase.client.transactional.TestTransactions)
testPutPutScan(org.apache.hadoop.hbase.client.transactional.TestTransactions)
Tests run: 21, Failures: 0, Errors: 19, Skipped: 0
[INFO] ------------------------------------------------------------------------
[ERROR] BUILD FAILURE
[INFO] ------------------------------------------------------------------------
[INFO] There are test failures.
Please refer to <http://hudson.zones.apache.org/hudson/job/HBase-Patch/ws/trunk/contrib/transactional/target/surefire-reports> for the individual test results.
[INFO] ------------------------------------------------------------------------
[INFO] For more information, run Maven with the -e switch
[INFO] ------------------------------------------------------------------------
[INFO] Total time: 42 minutes 30 seconds
[INFO] Finished at: Wed Mar 03 05:58:28 UTC 2010
[INFO] Final Memory: 71M/126M
[INFO] ------------------------------------------------------------------------
[locks-and-latches] Releasing all the locks
[locks-and-latches] All the locks released
Archiving artifacts
Recording test results
Build failed in Hudson: HBase-Patch #1135
Posted by Apache Hudson Server <hu...@hudson.zones.apache.org>.
See <http://hudson.zones.apache.org/hudson/job/HBase-Patch/1135/changes>
Changes:
[stack] HBASE-2244 META gets inconsistent in a number of crash scenarios
[stack] HBASE-2244 META gets inconsistent in a number of crash scenarios
[stack] HBASE-2244 META gets inconsistent in a number of crash scenarios
------------------------------------------
[...truncated 1347 lines...]
Tests run: 1, Failures: 0, Errors: 0, Skipped: 0, Time elapsed: 26.858 sec
Running org.apache.hadoop.hbase.regionserver.wal.TestHLog
Tests run: 4, Failures: 0, Errors: 0, Skipped: 0, Time elapsed: 47.02 sec
Running org.apache.hadoop.hbase.client.TestTimestamp
Tests run: 1, Failures: 0, Errors: 0, Skipped: 0, Time elapsed: 17.471 sec
Running org.apache.hadoop.hbase.TestScanMultipleVersions
Tests run: 1, Failures: 0, Errors: 0, Skipped: 0, Time elapsed: 22.449 sec
Running org.apache.hadoop.hbase.TestMergeTable
Tests run: 1, Failures: 0, Errors: 0, Skipped: 0, Time elapsed: 45.024 sec
Running org.apache.hadoop.hbase.regionserver.TestGetClosestAtOrBefore
Tests run: 3, Failures: 0, Errors: 0, Skipped: 0, Time elapsed: 17.953 sec
Results :
Tests run: 315, Failures: 0, Errors: 0, Skipped: 4
[INFO] [jar:jar {execution: default-jar}]
[INFO] Building jar: <http://hudson.zones.apache.org/hudson/job/HBase-Patch/ws/trunk/core/target/hbase-core-0.21.0-SNAPSHOT.jar>
[INFO] [jar:test-jar {execution: default}]
[INFO] Building jar: <http://hudson.zones.apache.org/hudson/job/HBase-Patch/ws/trunk/core/target/hbase-core-0.21.0-SNAPSHOT-tests.jar>
[INFO] [source:jar-no-fork {execution: attach-sources}]
[INFO] Building jar: <http://hudson.zones.apache.org/hudson/job/HBase-Patch/ws/trunk/core/target/hbase-core-0.21.0-SNAPSHOT-sources.jar>
[INFO] [install:install {execution: default-install}]
[INFO] Installing <http://hudson.zones.apache.org/hudson/job/HBase-Patch/ws/trunk/core/target/hbase-core-0.21.0-SNAPSHOT.jar> to /home/hudson/.m2/repository/org/apache/hbase/hbase-core/0.21.0-SNAPSHOT/hbase-core-0.21.0-SNAPSHOT.jar
[INFO] Installing <http://hudson.zones.apache.org/hudson/job/HBase-Patch/ws/trunk/core/target/hbase-core-0.21.0-SNAPSHOT-tests.jar> to /home/hudson/.m2/repository/org/apache/hbase/hbase-core/0.21.0-SNAPSHOT/hbase-core-0.21.0-SNAPSHOT-tests.jar
[INFO] Installing <http://hudson.zones.apache.org/hudson/job/HBase-Patch/ws/trunk/core/target/hbase-core-0.21.0-SNAPSHOT-sources.jar> to /home/hudson/.m2/repository/org/apache/hbase/hbase-core/0.21.0-SNAPSHOT/hbase-core-0.21.0-SNAPSHOT-sources.jar
[INFO] ------------------------------------------------------------------------
[INFO] Building HBase Contrib
[INFO] task-segment: [clean, install]
[INFO] ------------------------------------------------------------------------
[INFO] [clean:clean {execution: default-clean}]
[INFO] [site:attach-descriptor {execution: default-attach-descriptor}]
[INFO] [install:install {execution: default-install}]
[INFO] Installing <http://hudson.zones.apache.org/hudson/job/HBase-Patch/ws/trunk/contrib/pom.xml> to /home/hudson/.m2/repository/org/apache/hbase/hbase-contrib/0.21.0-SNAPSHOT/hbase-contrib-0.21.0-SNAPSHOT.pom
[INFO] ------------------------------------------------------------------------
[INFO] Building HBase Contrib - Multi Datacenter Replication
[INFO] task-segment: [clean, install]
[INFO] ------------------------------------------------------------------------
[INFO] [clean:clean {execution: default-clean}]
[INFO] Deleting directory <http://hudson.zones.apache.org/hudson/job/HBase-Patch/ws/trunk/contrib/mdc_replication/target>
[INFO] [resources:resources {execution: default-resources}]
[INFO] Using 'UTF-8' encoding to copy filtered resources.
[INFO] skip non existing resourceDirectory <http://hudson.zones.apache.org/hudson/job/HBase-Patch/ws/trunk/contrib/mdc_replication/src/main/resources>
[INFO] [compiler:compile {execution: default-compile}]
[INFO] Compiling 8 source files to <http://hudson.zones.apache.org/hudson/job/HBase-Patch/ws/trunk/contrib/mdc_replication/target/classes>
[INFO] [resources:testResources {execution: default-testResources}]
[INFO] Using 'UTF-8' encoding to copy filtered resources.
[INFO] skip non existing resourceDirectory <http://hudson.zones.apache.org/hudson/job/HBase-Patch/ws/trunk/contrib/mdc_replication/src/test/resources>
[INFO] [compiler:testCompile {execution: default-testCompile}]
[INFO] Compiling 2 source files to <http://hudson.zones.apache.org/hudson/job/HBase-Patch/ws/trunk/contrib/mdc_replication/target/test-classes>
[INFO] [surefire:test {execution: default-test}]
[INFO] Surefire report directory: <http://hudson.zones.apache.org/hudson/job/HBase-Patch/ws/trunk/contrib/mdc_replication/target/surefire-reports>
-------------------------------------------------------
T E S T S
-------------------------------------------------------
Running org.apache.hadoop.hbase.replication.TestReplication
Tests run: 2, Failures: 0, Errors: 0, Skipped: 0, Time elapsed: 61.183 sec
Running org.apache.hadoop.hbase.regionserver.replication.TestReplicationSink
Tests run: 5, Failures: 0, Errors: 0, Skipped: 0, Time elapsed: 45.242 sec
Results :
Tests run: 7, Failures: 0, Errors: 0, Skipped: 0
[INFO] [jar:jar {execution: default-jar}]
[INFO] Building jar: <http://hudson.zones.apache.org/hudson/job/HBase-Patch/ws/trunk/contrib/mdc_replication/target/hbase-contrib-mdc_replication-0.21.0-SNAPSHOT.jar>
[INFO] [install:install {execution: default-install}]
[INFO] Installing <http://hudson.zones.apache.org/hudson/job/HBase-Patch/ws/trunk/contrib/mdc_replication/target/hbase-contrib-mdc_replication-0.21.0-SNAPSHOT.jar> to /home/hudson/.m2/repository/org/apache/hbase/hbase-contrib-mdc_replication/0.21.0-SNAPSHOT/hbase-contrib-mdc_replication-0.21.0-SNAPSHOT.jar
[INFO] ------------------------------------------------------------------------
[INFO] Building HBase Contrib - Stargate
[INFO] task-segment: [clean, install]
[INFO] ------------------------------------------------------------------------
[INFO] [clean:clean {execution: default-clean}]
[INFO] Deleting directory <http://hudson.zones.apache.org/hudson/job/HBase-Patch/ws/trunk/contrib/stargate/target>
[INFO] [resources:resources {execution: default-resources}]
[INFO] Using 'UTF-8' encoding to copy filtered resources.
[INFO] Copying 10 resources
[INFO] [compiler:compile {execution: default-compile}]
[INFO] Compiling 56 source files to <http://hudson.zones.apache.org/hudson/job/HBase-Patch/ws/trunk/contrib/stargate/target/classes>
[INFO] [resources:testResources {execution: default-testResources}]
[INFO] Using 'UTF-8' encoding to copy filtered resources.
[INFO] skip non existing resourceDirectory <http://hudson.zones.apache.org/hudson/job/HBase-Patch/ws/trunk/contrib/stargate/src/test/resources>
[INFO] [compiler:testCompile {execution: default-testCompile}]
[INFO] Compiling 24 source files to <http://hudson.zones.apache.org/hudson/job/HBase-Patch/ws/trunk/contrib/stargate/target/test-classes>
[INFO] [surefire:test {execution: default-test}]
[INFO] Surefire report directory: <http://hudson.zones.apache.org/hudson/job/HBase-Patch/ws/trunk/contrib/stargate/target/surefire-reports>
-------------------------------------------------------
T E S T S
-------------------------------------------------------
Running org.apache.hadoop.hbase.stargate.model.TestScannerModel
Tests run: 3, Failures: 0, Errors: 0, Skipped: 0, Time elapsed: 0.56 sec
Running org.apache.hadoop.hbase.stargate.model.TestTableSchemaModel
Tests run: 3, Failures: 0, Errors: 0, Skipped: 0, Time elapsed: 0.039 sec
Running org.apache.hadoop.hbase.stargate.model.TestStorageClusterVersionModel
Tests run: 2, Failures: 0, Errors: 0, Skipped: 0, Time elapsed: 0.013 sec
Running org.apache.hadoop.hbase.stargate.TestRowResource
Tests run: 8, Failures: 0, Errors: 0, Skipped: 0, Time elapsed: 16.311 sec
Running org.apache.hadoop.hbase.stargate.model.TestTableInfoModel
Tests run: 3, Failures: 0, Errors: 0, Skipped: 0, Time elapsed: 0.029 sec
Running org.apache.hadoop.hbase.stargate.TestStatusResource
Tests run: 2, Failures: 0, Errors: 0, Skipped: 0, Time elapsed: 0.057 sec
Running org.apache.hadoop.hbase.stargate.auth.TestHTableAuthenticator
Tests run: 4, Failures: 0, Errors: 0, Skipped: 0, Time elapsed: 5.287 sec
Running org.apache.hadoop.hbase.stargate.TestSchemaResource
Tests run: 2, Failures: 0, Errors: 0, Skipped: 0, Time elapsed: 20.847 sec
Running org.apache.hadoop.hbase.stargate.auth.TestJDBCAuthenticator
Tests run: 4, Failures: 0, Errors: 0, Skipped: 0, Time elapsed: 0.307 sec
Running org.apache.hadoop.hbase.stargate.auth.TestZooKeeperAuthenticator
Tests run: 4, Failures: 0, Errors: 0, Skipped: 0, Time elapsed: 0.301 sec
Running org.apache.hadoop.hbase.stargate.Test00MiniCluster
Tests run: 4, Failures: 0, Errors: 0, Skipped: 0, Time elapsed: 0.003 sec
Running org.apache.hadoop.hbase.stargate.TestVersionResource
Tests run: 7, Failures: 0, Errors: 0, Skipped: 0, Time elapsed: 0.069 sec
Running org.apache.hadoop.hbase.stargate.model.TestTableListModel
Tests run: 3, Failures: 0, Errors: 0, Skipped: 0, Time elapsed: 0.015 sec
Running org.apache.hadoop.hbase.stargate.model.TestVersionModel
Tests run: 3, Failures: 0, Errors: 0, Skipped: 0, Time elapsed: 0.015 sec
Running org.apache.hadoop.hbase.stargate.auth.TestHBCAuthenticator
Tests run: 4, Failures: 0, Errors: 0, Skipped: 0, Time elapsed: 0.015 sec
Running org.apache.hadoop.hbase.stargate.model.TestStorageClusterStatusModel
Tests run: 3, Failures: 0, Errors: 0, Skipped: 0, Time elapsed: 0.06 sec
Running org.apache.hadoop.hbase.stargate.model.TestCellModel
Tests run: 3, Failures: 0, Errors: 0, Skipped: 0, Time elapsed: 0.013 sec
Running org.apache.hadoop.hbase.stargate.TestScannerResource
Tests run: 4, Failures: 0, Errors: 0, Skipped: 0, Time elapsed: 22.168 sec
Running org.apache.hadoop.hbase.stargate.model.TestCellSetModel
Tests run: 3, Failures: 0, Errors: 0, Skipped: 0, Time elapsed: 0.021 sec
Running org.apache.hadoop.hbase.stargate.model.TestTableRegionModel
Tests run: 2, Failures: 0, Errors: 0, Skipped: 0, Time elapsed: 0.011 sec
Running org.apache.hadoop.hbase.stargate.model.TestColumnSchemaModel
Tests run: 2, Failures: 0, Errors: 0, Skipped: 0, Time elapsed: 0.006 sec
Running org.apache.hadoop.hbase.stargate.model.TestRowModel
Tests run: 2, Failures: 0, Errors: 0, Skipped: 0, Time elapsed: 0.069 sec
Running org.apache.hadoop.hbase.stargate.TestTableResource
Tests run: 4, Failures: 0, Errors: 0, Skipped: 0, Time elapsed: 5.454 sec
Results :
Tests run: 79, Failures: 0, Errors: 0, Skipped: 0
[INFO] [war:war {execution: default-war}]
[INFO] Packaging webapp
[INFO] Assembling webapp[hbase-contrib-stargate] in [<http://hudson.zones.apache.org/hudson/job/HBase-Patch/ws/trunk/contrib/stargate/target/hbase-contrib-stargate-0.21.0-SNAPSHOT]>
[INFO] Processing war project
[INFO] Webapp assembled in[521 msecs]
[INFO] Building war: <http://hudson.zones.apache.org/hudson/job/HBase-Patch/ws/trunk/contrib/stargate/target/hbase-contrib-stargate-0.21.0-SNAPSHOT.war>
[INFO] [install:install {execution: default-install}]
[INFO] Installing <http://hudson.zones.apache.org/hudson/job/HBase-Patch/ws/trunk/contrib/stargate/target/hbase-contrib-stargate-0.21.0-SNAPSHOT.war> to /home/hudson/.m2/repository/org/apache/hbase/hbase-contrib-stargate/0.21.0-SNAPSHOT/hbase-contrib-stargate-0.21.0-SNAPSHOT.war
[INFO] ------------------------------------------------------------------------
[INFO] Building HBase Contrib - Transactional
[INFO] task-segment: [clean, install]
[INFO] ------------------------------------------------------------------------
[INFO] [clean:clean {execution: default-clean}]
[INFO] Deleting directory <http://hudson.zones.apache.org/hudson/job/HBase-Patch/ws/trunk/contrib/transactional/target>
[INFO] [resources:resources {execution: default-resources}]
[INFO] Using 'UTF-8' encoding to copy filtered resources.
[INFO] skip non existing resourceDirectory <http://hudson.zones.apache.org/hudson/job/HBase-Patch/ws/trunk/contrib/transactional/src/main/resources>
[INFO] [compiler:compile {execution: default-compile}]
[INFO] Compiling 31 source files to <http://hudson.zones.apache.org/hudson/job/HBase-Patch/ws/trunk/contrib/transactional/target/classes>
[WARNING] <http://hudson.zones.apache.org/hudson/job/HBase-Patch/ws/trunk/contrib/transactional/src/main/java/org/apache/hadoop/hbase/client/transactional/HBaseBackedTransactionLogger.java>:[56,38] [deprecation] HBaseConfiguration() in org.apache.hadoop.hbase.HBaseConfiguration has been deprecated
[WARNING] <http://hudson.zones.apache.org/hudson/job/HBase-Patch/ws/trunk/contrib/transactional/src/main/java/org/apache/hadoop/hbase/client/transactional/HBaseBackedTransactionLogger.java>:[68,38] [deprecation] HBaseConfiguration() in org.apache.hadoop.hbase.HBaseConfiguration has been deprecated
[WARNING] <http://hudson.zones.apache.org/hudson/job/HBase-Patch/ws/trunk/contrib/transactional/src/main/java/org/apache/hadoop/hbase/client/tableindexed/IndexSpecification.java>:[154,49] [deprecation] HBaseConfiguration() in org.apache.hadoop.hbase.HBaseConfiguration has been deprecated
[INFO] [resources:testResources {execution: default-testResources}]
[INFO] Using 'UTF-8' encoding to copy filtered resources.
[INFO] skip non existing resourceDirectory <http://hudson.zones.apache.org/hudson/job/HBase-Patch/ws/trunk/contrib/transactional/src/test/resources>
[INFO] [compiler:testCompile {execution: default-testCompile}]
[INFO] Compiling 7 source files to <http://hudson.zones.apache.org/hudson/job/HBase-Patch/ws/trunk/contrib/transactional/target/test-classes>
[WARNING] <http://hudson.zones.apache.org/hudson/job/HBase-Patch/ws/trunk/contrib/transactional/src/test/java/org/apache/hadoop/hbase/client/tableindexed/TestIndexedTable.java>:[29,30] [deprecation] org.apache.hadoop.hbase.HBaseClusterTestCase in org.apache.hadoop.hbase has been deprecated
[WARNING] <http://hudson.zones.apache.org/hudson/job/HBase-Patch/ws/trunk/contrib/transactional/src/test/java/org/apache/hadoop/hbase/client/tableindexed/TestIndexedTable.java>:[43,38] [deprecation] org.apache.hadoop.hbase.HBaseClusterTestCase in org.apache.hadoop.hbase has been deprecated
[WARNING] <http://hudson.zones.apache.org/hudson/job/HBase-Patch/ws/trunk/contrib/transactional/src/test/java/org/apache/hadoop/hbase/client/transactional/TestTransactions.java>:[26,30] [deprecation] org.apache.hadoop.hbase.HBaseClusterTestCase in org.apache.hadoop.hbase has been deprecated
[WARNING] <http://hudson.zones.apache.org/hudson/job/HBase-Patch/ws/trunk/contrib/transactional/src/test/java/org/apache/hadoop/hbase/client/transactional/TestTransactions.java>:[44,38] [deprecation] org.apache.hadoop.hbase.HBaseClusterTestCase in org.apache.hadoop.hbase has been deprecated
[WARNING] <http://hudson.zones.apache.org/hudson/job/HBase-Patch/ws/trunk/contrib/transactional/src/test/java/org/apache/hadoop/hbase/regionserver/transactional/TestTHLogRecovery.java>:[30,30] [deprecation] org.apache.hadoop.hbase.HBaseClusterTestCase in org.apache.hadoop.hbase has been deprecated
[WARNING] <http://hudson.zones.apache.org/hudson/job/HBase-Patch/ws/trunk/contrib/transactional/src/test/java/org/apache/hadoop/hbase/regionserver/transactional/TestTHLogRecovery.java>:[51,39] [deprecation] org.apache.hadoop.hbase.HBaseClusterTestCase in org.apache.hadoop.hbase has been deprecated
[WARNING] <http://hudson.zones.apache.org/hudson/job/HBase-Patch/ws/trunk/contrib/transactional/src/test/java/org/apache/hadoop/hbase/client/transactional/StressTestTransactions.java>:[32,30] [deprecation] org.apache.hadoop.hbase.HBaseClusterTestCase in org.apache.hadoop.hbase has been deprecated
[WARNING] <http://hudson.zones.apache.org/hudson/job/HBase-Patch/ws/trunk/contrib/transactional/src/test/java/org/apache/hadoop/hbase/client/transactional/StressTestTransactions.java>:[53,44] [deprecation] org.apache.hadoop.hbase.HBaseClusterTestCase in org.apache.hadoop.hbase has been deprecated
[WARNING] <http://hudson.zones.apache.org/hudson/job/HBase-Patch/ws/trunk/contrib/transactional/src/test/java/org/apache/hadoop/hbase/regionserver/transactional/TestTHLog.java>:[27,30] [deprecation] org.apache.hadoop.hbase.HBaseTestCase in org.apache.hadoop.hbase has been deprecated
[WARNING] <http://hudson.zones.apache.org/hudson/job/HBase-Patch/ws/trunk/contrib/transactional/src/test/java/org/apache/hadoop/hbase/regionserver/transactional/TestTHLog.java>:[37,31] [deprecation] org.apache.hadoop.hbase.HBaseTestCase in org.apache.hadoop.hbase has been deprecated
[INFO] [surefire:test {execution: default-test}]
[INFO] Surefire report directory: <http://hudson.zones.apache.org/hudson/job/HBase-Patch/ws/trunk/contrib/transactional/target/surefire-reports>
-------------------------------------------------------
T E S T S
-------------------------------------------------------
Running org.apache.hadoop.hbase.client.tableindexed.TestIndexedTable
Tests run: 7, Failures: 0, Errors: 7, Skipped: 0, Time elapsed: 2.939 sec <<< FAILURE!
Running org.apache.hadoop.hbase.regionserver.transactional.TestTHLog
Tests run: 5, Failures: 0, Errors: 5, Skipped: 0, Time elapsed: 1.452 sec <<< FAILURE!
Running org.apache.hadoop.hbase.client.transactional.TestTransactions
Tests run: 7, Failures: 0, Errors: 7, Skipped: 0, Time elapsed: 2.043 sec <<< FAILURE!
Running org.apache.hadoop.hbase.regionserver.transactional.TestTHLogRecovery
Tests run: 2, Failures: 0, Errors: 0, Skipped: 0, Time elapsed: 513.935 sec
Results :
Tests in error:
testInitialWrites(org.apache.hadoop.hbase.client.tableindexed.TestIndexedTable)
testMultipleWrites(org.apache.hadoop.hbase.client.tableindexed.TestIndexedTable)
testDelete(org.apache.hadoop.hbase.client.tableindexed.TestIndexedTable)
testRowUpdate(org.apache.hadoop.hbase.client.tableindexed.TestIndexedTable)
testLockedRowUpdate(org.apache.hadoop.hbase.client.tableindexed.TestIndexedTable)
testLockedRowUpdateNoAutoFlush(org.apache.hadoop.hbase.client.tableindexed.TestIndexedTable)
testLockedRowDelete(org.apache.hadoop.hbase.client.tableindexed.TestIndexedTable)
testSingleCommit(org.apache.hadoop.hbase.regionserver.transactional.TestTHLog)
testSingleAbort(org.apache.hadoop.hbase.regionserver.transactional.TestTHLog)
testInterlievedCommits(org.apache.hadoop.hbase.regionserver.transactional.TestTHLog)
testInterlievedAbortCommit(org.apache.hadoop.hbase.regionserver.transactional.TestTHLog)
testInterlievedCommitAbort(org.apache.hadoop.hbase.regionserver.transactional.TestTHLog)
testSimpleTransaction(org.apache.hadoop.hbase.client.transactional.TestTransactions)
testTwoTransactionsWithoutConflict(org.apache.hadoop.hbase.client.transactional.TestTransactions)
testTwoTransactionsWithConflict(org.apache.hadoop.hbase.client.transactional.TestTransactions)
testGetAfterPut(org.apache.hadoop.hbase.client.transactional.TestTransactions)
testScanAfterUpdatePut(org.apache.hadoop.hbase.client.transactional.TestTransactions)
testScanAfterNewPut(org.apache.hadoop.hbase.client.transactional.TestTransactions)
testPutPutScan(org.apache.hadoop.hbase.client.transactional.TestTransactions)
Tests run: 21, Failures: 0, Errors: 19, Skipped: 0
[INFO] ------------------------------------------------------------------------
[ERROR] BUILD FAILURE
[INFO] ------------------------------------------------------------------------
[INFO] There are test failures.
Please refer to <http://hudson.zones.apache.org/hudson/job/HBase-Patch/ws/trunk/contrib/transactional/target/surefire-reports> for the individual test results.
[INFO] ------------------------------------------------------------------------
[INFO] For more information, run Maven with the -e switch
[INFO] ------------------------------------------------------------------------
[INFO] Total time: 40 minutes 51 seconds
[INFO] Finished at: Wed Mar 03 01:26:52 UTC 2010
[INFO] Final Memory: 71M/124M
[INFO] ------------------------------------------------------------------------
[locks-and-latches] Releasing all the locks
[locks-and-latches] All the locks released
Archiving artifacts
Recording test results
Build failed in Hudson: HBase-Patch #1134
Posted by Apache Hudson Server <hu...@hudson.zones.apache.org>.
See <http://hudson.zones.apache.org/hudson/job/HBase-Patch/1134/changes>
Changes:
[jdcryans] HBASE-2245 Unnecessary call to syncWal(region); in HRegionServer
(Benoit Sigoure via JD)
HBASE-2246 Add a getConfiguration method to HTableInterface
(Benoit Sigoure via JD)
------------------------------------------
[...truncated 607 lines...]
Tests run: 1, Failures: 0, Errors: 0, Skipped: 0, Time elapsed: 16.089 sec
Running org.apache.hadoop.hbase.regionserver.wal.TestHLog
Tests run: 4, Failures: 0, Errors: 0, Skipped: 0, Time elapsed: 54.864 sec
Running org.apache.hadoop.hbase.client.TestTimestamp
Tests run: 1, Failures: 0, Errors: 0, Skipped: 0, Time elapsed: 17.483 sec
Running org.apache.hadoop.hbase.TestScanMultipleVersions
Tests run: 1, Failures: 0, Errors: 0, Skipped: 0, Time elapsed: 47.348 sec
Running org.apache.hadoop.hbase.TestMergeTable
Tests run: 1, Failures: 0, Errors: 0, Skipped: 0, Time elapsed: 44.09 sec
Running org.apache.hadoop.hbase.regionserver.TestGetClosestAtOrBefore
Tests run: 3, Failures: 0, Errors: 0, Skipped: 0, Time elapsed: 17.24 sec
Results :
Tests run: 315, Failures: 0, Errors: 0, Skipped: 4
[INFO] [jar:jar {execution: default-jar}]
[INFO] Building jar: <http://hudson.zones.apache.org/hudson/job/HBase-Patch/ws/trunk/core/target/hbase-core-0.21.0-SNAPSHOT.jar>
[INFO] [jar:test-jar {execution: default}]
[INFO] Building jar: <http://hudson.zones.apache.org/hudson/job/HBase-Patch/ws/trunk/core/target/hbase-core-0.21.0-SNAPSHOT-tests.jar>
[INFO] [source:jar-no-fork {execution: attach-sources}]
[INFO] Building jar: <http://hudson.zones.apache.org/hudson/job/HBase-Patch/ws/trunk/core/target/hbase-core-0.21.0-SNAPSHOT-sources.jar>
[INFO] [install:install {execution: default-install}]
[INFO] Installing <http://hudson.zones.apache.org/hudson/job/HBase-Patch/ws/trunk/core/target/hbase-core-0.21.0-SNAPSHOT.jar> to /home/hudson/.m2/repository/org/apache/hbase/hbase-core/0.21.0-SNAPSHOT/hbase-core-0.21.0-SNAPSHOT.jar
[INFO] Installing <http://hudson.zones.apache.org/hudson/job/HBase-Patch/ws/trunk/core/target/hbase-core-0.21.0-SNAPSHOT-tests.jar> to /home/hudson/.m2/repository/org/apache/hbase/hbase-core/0.21.0-SNAPSHOT/hbase-core-0.21.0-SNAPSHOT-tests.jar
[INFO] Installing <http://hudson.zones.apache.org/hudson/job/HBase-Patch/ws/trunk/core/target/hbase-core-0.21.0-SNAPSHOT-sources.jar> to /home/hudson/.m2/repository/org/apache/hbase/hbase-core/0.21.0-SNAPSHOT/hbase-core-0.21.0-SNAPSHOT-sources.jar
[INFO] ------------------------------------------------------------------------
[INFO] Building HBase Contrib
[INFO] task-segment: [clean, install]
[INFO] ------------------------------------------------------------------------
[INFO] [clean:clean {execution: default-clean}]
[INFO] [site:attach-descriptor {execution: default-attach-descriptor}]
[INFO] [install:install {execution: default-install}]
[INFO] Installing <http://hudson.zones.apache.org/hudson/job/HBase-Patch/ws/trunk/contrib/pom.xml> to /home/hudson/.m2/repository/org/apache/hbase/hbase-contrib/0.21.0-SNAPSHOT/hbase-contrib-0.21.0-SNAPSHOT.pom
[INFO] ------------------------------------------------------------------------
[INFO] Building HBase Contrib - Multi Datacenter Replication
[INFO] task-segment: [clean, install]
[INFO] ------------------------------------------------------------------------
[INFO] [clean:clean {execution: default-clean}]
[INFO] Deleting directory <http://hudson.zones.apache.org/hudson/job/HBase-Patch/ws/trunk/contrib/mdc_replication/target>
[INFO] [resources:resources {execution: default-resources}]
[INFO] Using 'UTF-8' encoding to copy filtered resources.
[INFO] skip non existing resourceDirectory <http://hudson.zones.apache.org/hudson/job/HBase-Patch/ws/trunk/contrib/mdc_replication/src/main/resources>
[INFO] [compiler:compile {execution: default-compile}]
[INFO] Compiling 8 source files to <http://hudson.zones.apache.org/hudson/job/HBase-Patch/ws/trunk/contrib/mdc_replication/target/classes>
[INFO] [resources:testResources {execution: default-testResources}]
[INFO] Using 'UTF-8' encoding to copy filtered resources.
[INFO] skip non existing resourceDirectory <http://hudson.zones.apache.org/hudson/job/HBase-Patch/ws/trunk/contrib/mdc_replication/src/test/resources>
[INFO] [compiler:testCompile {execution: default-testCompile}]
[INFO] Compiling 2 source files to <http://hudson.zones.apache.org/hudson/job/HBase-Patch/ws/trunk/contrib/mdc_replication/target/test-classes>
[INFO] [surefire:test {execution: default-test}]
[INFO] Surefire report directory: <http://hudson.zones.apache.org/hudson/job/HBase-Patch/ws/trunk/contrib/mdc_replication/target/surefire-reports>
-------------------------------------------------------
T E S T S
-------------------------------------------------------
Running org.apache.hadoop.hbase.replication.TestReplication
Tests run: 2, Failures: 0, Errors: 0, Skipped: 0, Time elapsed: 59.957 sec
Running org.apache.hadoop.hbase.regionserver.replication.TestReplicationSink
Tests run: 5, Failures: 0, Errors: 0, Skipped: 0, Time elapsed: 57.401 sec
Results :
Tests run: 7, Failures: 0, Errors: 0, Skipped: 0
[INFO] [jar:jar {execution: default-jar}]
[INFO] Building jar: <http://hudson.zones.apache.org/hudson/job/HBase-Patch/ws/trunk/contrib/mdc_replication/target/hbase-contrib-mdc_replication-0.21.0-SNAPSHOT.jar>
[INFO] [install:install {execution: default-install}]
[INFO] Installing <http://hudson.zones.apache.org/hudson/job/HBase-Patch/ws/trunk/contrib/mdc_replication/target/hbase-contrib-mdc_replication-0.21.0-SNAPSHOT.jar> to /home/hudson/.m2/repository/org/apache/hbase/hbase-contrib-mdc_replication/0.21.0-SNAPSHOT/hbase-contrib-mdc_replication-0.21.0-SNAPSHOT.jar
[INFO] ------------------------------------------------------------------------
[INFO] Building HBase Contrib - Stargate
[INFO] task-segment: [clean, install]
[INFO] ------------------------------------------------------------------------
[INFO] [clean:clean {execution: default-clean}]
[INFO] Deleting directory <http://hudson.zones.apache.org/hudson/job/HBase-Patch/ws/trunk/contrib/stargate/target>
[INFO] [resources:resources {execution: default-resources}]
[INFO] Using 'UTF-8' encoding to copy filtered resources.
[INFO] Copying 10 resources
[INFO] [compiler:compile {execution: default-compile}]
[INFO] Compiling 56 source files to <http://hudson.zones.apache.org/hudson/job/HBase-Patch/ws/trunk/contrib/stargate/target/classes>
[INFO] [resources:testResources {execution: default-testResources}]
[INFO] Using 'UTF-8' encoding to copy filtered resources.
[INFO] skip non existing resourceDirectory <http://hudson.zones.apache.org/hudson/job/HBase-Patch/ws/trunk/contrib/stargate/src/test/resources>
[INFO] [compiler:testCompile {execution: default-testCompile}]
[INFO] Compiling 24 source files to <http://hudson.zones.apache.org/hudson/job/HBase-Patch/ws/trunk/contrib/stargate/target/test-classes>
[INFO] [surefire:test {execution: default-test}]
[INFO] Surefire report directory: <http://hudson.zones.apache.org/hudson/job/HBase-Patch/ws/trunk/contrib/stargate/target/surefire-reports>
-------------------------------------------------------
T E S T S
-------------------------------------------------------
Running org.apache.hadoop.hbase.stargate.model.TestScannerModel
Tests run: 3, Failures: 0, Errors: 0, Skipped: 0, Time elapsed: 0.615 sec
Running org.apache.hadoop.hbase.stargate.model.TestTableSchemaModel
Tests run: 3, Failures: 0, Errors: 0, Skipped: 0, Time elapsed: 0.039 sec
Running org.apache.hadoop.hbase.stargate.model.TestStorageClusterVersionModel
Tests run: 2, Failures: 0, Errors: 0, Skipped: 0, Time elapsed: 0.013 sec
Running org.apache.hadoop.hbase.stargate.TestRowResource
Tests run: 8, Failures: 0, Errors: 0, Skipped: 0, Time elapsed: 16.531 sec
Running org.apache.hadoop.hbase.stargate.model.TestTableInfoModel
Tests run: 3, Failures: 0, Errors: 0, Skipped: 0, Time elapsed: 0.029 sec
Running org.apache.hadoop.hbase.stargate.TestStatusResource
Tests run: 2, Failures: 0, Errors: 0, Skipped: 0, Time elapsed: 0.057 sec
Running org.apache.hadoop.hbase.stargate.auth.TestHTableAuthenticator
Tests run: 4, Failures: 0, Errors: 0, Skipped: 0, Time elapsed: 5.222 sec
Running org.apache.hadoop.hbase.stargate.TestSchemaResource
Tests run: 2, Failures: 0, Errors: 0, Skipped: 0, Time elapsed: 20.906 sec
Running org.apache.hadoop.hbase.stargate.auth.TestJDBCAuthenticator
Tests run: 4, Failures: 0, Errors: 0, Skipped: 0, Time elapsed: 0.254 sec
Running org.apache.hadoop.hbase.stargate.auth.TestZooKeeperAuthenticator
Tests run: 4, Failures: 0, Errors: 0, Skipped: 0, Time elapsed: 0.38 sec
Running org.apache.hadoop.hbase.stargate.Test00MiniCluster
Tests run: 4, Failures: 0, Errors: 0, Skipped: 0, Time elapsed: 0.011 sec
Running org.apache.hadoop.hbase.stargate.TestVersionResource
Tests run: 7, Failures: 0, Errors: 0, Skipped: 0, Time elapsed: 0.088 sec
Running org.apache.hadoop.hbase.stargate.model.TestTableListModel
Tests run: 3, Failures: 0, Errors: 0, Skipped: 0, Time elapsed: 0.038 sec
Running org.apache.hadoop.hbase.stargate.model.TestVersionModel
Tests run: 3, Failures: 0, Errors: 0, Skipped: 0, Time elapsed: 0.056 sec
Running org.apache.hadoop.hbase.stargate.auth.TestHBCAuthenticator
Tests run: 4, Failures: 0, Errors: 0, Skipped: 0, Time elapsed: 0.016 sec
Running org.apache.hadoop.hbase.stargate.model.TestStorageClusterStatusModel
Tests run: 3, Failures: 0, Errors: 0, Skipped: 0, Time elapsed: 0.06 sec
Running org.apache.hadoop.hbase.stargate.model.TestCellModel
Tests run: 3, Failures: 0, Errors: 0, Skipped: 0, Time elapsed: 0.013 sec
Running org.apache.hadoop.hbase.stargate.TestScannerResource
Tests run: 4, Failures: 0, Errors: 0, Skipped: 0, Time elapsed: 22.117 sec
Running org.apache.hadoop.hbase.stargate.model.TestCellSetModel
Tests run: 3, Failures: 0, Errors: 0, Skipped: 0, Time elapsed: 0.02 sec
Running org.apache.hadoop.hbase.stargate.model.TestTableRegionModel
Tests run: 2, Failures: 0, Errors: 0, Skipped: 0, Time elapsed: 0.011 sec
Running org.apache.hadoop.hbase.stargate.model.TestColumnSchemaModel
Tests run: 2, Failures: 0, Errors: 0, Skipped: 0, Time elapsed: 0.005 sec
Running org.apache.hadoop.hbase.stargate.model.TestRowModel
Tests run: 2, Failures: 0, Errors: 0, Skipped: 0, Time elapsed: 0.012 sec
Running org.apache.hadoop.hbase.stargate.TestTableResource
Tests run: 4, Failures: 0, Errors: 0, Skipped: 0, Time elapsed: 5.399 sec
Results :
Tests run: 79, Failures: 0, Errors: 0, Skipped: 0
[INFO] [war:war {execution: default-war}]
[INFO] Packaging webapp
[INFO] Assembling webapp[hbase-contrib-stargate] in [<http://hudson.zones.apache.org/hudson/job/HBase-Patch/ws/trunk/contrib/stargate/target/hbase-contrib-stargate-0.21.0-SNAPSHOT]>
[INFO] Processing war project
[INFO] Webapp assembled in[727 msecs]
[INFO] Building war: <http://hudson.zones.apache.org/hudson/job/HBase-Patch/ws/trunk/contrib/stargate/target/hbase-contrib-stargate-0.21.0-SNAPSHOT.war>
[INFO] [install:install {execution: default-install}]
[INFO] Installing <http://hudson.zones.apache.org/hudson/job/HBase-Patch/ws/trunk/contrib/stargate/target/hbase-contrib-stargate-0.21.0-SNAPSHOT.war> to /home/hudson/.m2/repository/org/apache/hbase/hbase-contrib-stargate/0.21.0-SNAPSHOT/hbase-contrib-stargate-0.21.0-SNAPSHOT.war
[INFO] ------------------------------------------------------------------------
[INFO] Building HBase Contrib - Transactional
[INFO] task-segment: [clean, install]
[INFO] ------------------------------------------------------------------------
[INFO] [clean:clean {execution: default-clean}]
[INFO] Deleting directory <http://hudson.zones.apache.org/hudson/job/HBase-Patch/ws/trunk/contrib/transactional/target>
[INFO] [resources:resources {execution: default-resources}]
[INFO] Using 'UTF-8' encoding to copy filtered resources.
[INFO] skip non existing resourceDirectory <http://hudson.zones.apache.org/hudson/job/HBase-Patch/ws/trunk/contrib/transactional/src/main/resources>
[INFO] [compiler:compile {execution: default-compile}]
[INFO] Compiling 31 source files to <http://hudson.zones.apache.org/hudson/job/HBase-Patch/ws/trunk/contrib/transactional/target/classes>
[WARNING] <http://hudson.zones.apache.org/hudson/job/HBase-Patch/ws/trunk/contrib/transactional/src/main/java/org/apache/hadoop/hbase/client/transactional/HBaseBackedTransactionLogger.java>:[56,38] [deprecation] HBaseConfiguration() in org.apache.hadoop.hbase.HBaseConfiguration has been deprecated
[WARNING] <http://hudson.zones.apache.org/hudson/job/HBase-Patch/ws/trunk/contrib/transactional/src/main/java/org/apache/hadoop/hbase/client/transactional/HBaseBackedTransactionLogger.java>:[68,38] [deprecation] HBaseConfiguration() in org.apache.hadoop.hbase.HBaseConfiguration has been deprecated
[WARNING] <http://hudson.zones.apache.org/hudson/job/HBase-Patch/ws/trunk/contrib/transactional/src/main/java/org/apache/hadoop/hbase/client/tableindexed/IndexSpecification.java>:[154,49] [deprecation] HBaseConfiguration() in org.apache.hadoop.hbase.HBaseConfiguration has been deprecated
[INFO] [resources:testResources {execution: default-testResources}]
[INFO] Using 'UTF-8' encoding to copy filtered resources.
[INFO] skip non existing resourceDirectory <http://hudson.zones.apache.org/hudson/job/HBase-Patch/ws/trunk/contrib/transactional/src/test/resources>
[INFO] [compiler:testCompile {execution: default-testCompile}]
[INFO] Compiling 7 source files to <http://hudson.zones.apache.org/hudson/job/HBase-Patch/ws/trunk/contrib/transactional/target/test-classes>
[WARNING] <http://hudson.zones.apache.org/hudson/job/HBase-Patch/ws/trunk/contrib/transactional/src/test/java/org/apache/hadoop/hbase/client/tableindexed/TestIndexedTable.java>:[29,30] [deprecation] org.apache.hadoop.hbase.HBaseClusterTestCase in org.apache.hadoop.hbase has been deprecated
[WARNING] <http://hudson.zones.apache.org/hudson/job/HBase-Patch/ws/trunk/contrib/transactional/src/test/java/org/apache/hadoop/hbase/client/tableindexed/TestIndexedTable.java>:[43,38] [deprecation] org.apache.hadoop.hbase.HBaseClusterTestCase in org.apache.hadoop.hbase has been deprecated
[WARNING] <http://hudson.zones.apache.org/hudson/job/HBase-Patch/ws/trunk/contrib/transactional/src/test/java/org/apache/hadoop/hbase/client/transactional/TestTransactions.java>:[26,30] [deprecation] org.apache.hadoop.hbase.HBaseClusterTestCase in org.apache.hadoop.hbase has been deprecated
[WARNING] <http://hudson.zones.apache.org/hudson/job/HBase-Patch/ws/trunk/contrib/transactional/src/test/java/org/apache/hadoop/hbase/client/transactional/TestTransactions.java>:[44,38] [deprecation] org.apache.hadoop.hbase.HBaseClusterTestCase in org.apache.hadoop.hbase has been deprecated
[WARNING] <http://hudson.zones.apache.org/hudson/job/HBase-Patch/ws/trunk/contrib/transactional/src/test/java/org/apache/hadoop/hbase/regionserver/transactional/TestTHLogRecovery.java>:[30,30] [deprecation] org.apache.hadoop.hbase.HBaseClusterTestCase in org.apache.hadoop.hbase has been deprecated
[WARNING] <http://hudson.zones.apache.org/hudson/job/HBase-Patch/ws/trunk/contrib/transactional/src/test/java/org/apache/hadoop/hbase/regionserver/transactional/TestTHLogRecovery.java>:[51,39] [deprecation] org.apache.hadoop.hbase.HBaseClusterTestCase in org.apache.hadoop.hbase has been deprecated
[WARNING] <http://hudson.zones.apache.org/hudson/job/HBase-Patch/ws/trunk/contrib/transactional/src/test/java/org/apache/hadoop/hbase/client/transactional/StressTestTransactions.java>:[32,30] [deprecation] org.apache.hadoop.hbase.HBaseClusterTestCase in org.apache.hadoop.hbase has been deprecated
[WARNING] <http://hudson.zones.apache.org/hudson/job/HBase-Patch/ws/trunk/contrib/transactional/src/test/java/org/apache/hadoop/hbase/client/transactional/StressTestTransactions.java>:[53,44] [deprecation] org.apache.hadoop.hbase.HBaseClusterTestCase in org.apache.hadoop.hbase has been deprecated
[WARNING] <http://hudson.zones.apache.org/hudson/job/HBase-Patch/ws/trunk/contrib/transactional/src/test/java/org/apache/hadoop/hbase/regionserver/transactional/TestTHLog.java>:[27,30] [deprecation] org.apache.hadoop.hbase.HBaseTestCase in org.apache.hadoop.hbase has been deprecated
[WARNING] <http://hudson.zones.apache.org/hudson/job/HBase-Patch/ws/trunk/contrib/transactional/src/test/java/org/apache/hadoop/hbase/regionserver/transactional/TestTHLog.java>:[37,31] [deprecation] org.apache.hadoop.hbase.HBaseTestCase in org.apache.hadoop.hbase has been deprecated
[INFO] [surefire:test {execution: default-test}]
[INFO] Surefire report directory: <http://hudson.zones.apache.org/hudson/job/HBase-Patch/ws/trunk/contrib/transactional/target/surefire-reports>
-------------------------------------------------------
T E S T S
-------------------------------------------------------
Running org.apache.hadoop.hbase.client.tableindexed.TestIndexedTable
Tests run: 7, Failures: 0, Errors: 7, Skipped: 0, Time elapsed: 2.672 sec <<< FAILURE!
Running org.apache.hadoop.hbase.regionserver.transactional.TestTHLog
Tests run: 5, Failures: 0, Errors: 5, Skipped: 0, Time elapsed: 1.477 sec <<< FAILURE!
Running org.apache.hadoop.hbase.client.transactional.TestTransactions
Tests run: 7, Failures: 0, Errors: 7, Skipped: 0, Time elapsed: 1.973 sec <<< FAILURE!
Running org.apache.hadoop.hbase.regionserver.transactional.TestTHLogRecovery
Tests run: 2, Failures: 0, Errors: 0, Skipped: 0, Time elapsed: 514.228 sec
Results :
Tests in error:
testInitialWrites(org.apache.hadoop.hbase.client.tableindexed.TestIndexedTable)
testMultipleWrites(org.apache.hadoop.hbase.client.tableindexed.TestIndexedTable)
testDelete(org.apache.hadoop.hbase.client.tableindexed.TestIndexedTable)
testRowUpdate(org.apache.hadoop.hbase.client.tableindexed.TestIndexedTable)
testLockedRowUpdate(org.apache.hadoop.hbase.client.tableindexed.TestIndexedTable)
testLockedRowUpdateNoAutoFlush(org.apache.hadoop.hbase.client.tableindexed.TestIndexedTable)
testLockedRowDelete(org.apache.hadoop.hbase.client.tableindexed.TestIndexedTable)
testSingleCommit(org.apache.hadoop.hbase.regionserver.transactional.TestTHLog)
testSingleAbort(org.apache.hadoop.hbase.regionserver.transactional.TestTHLog)
testInterlievedCommits(org.apache.hadoop.hbase.regionserver.transactional.TestTHLog)
testInterlievedAbortCommit(org.apache.hadoop.hbase.regionserver.transactional.TestTHLog)
testInterlievedCommitAbort(org.apache.hadoop.hbase.regionserver.transactional.TestTHLog)
testSimpleTransaction(org.apache.hadoop.hbase.client.transactional.TestTransactions)
testTwoTransactionsWithoutConflict(org.apache.hadoop.hbase.client.transactional.TestTransactions)
testTwoTransactionsWithConflict(org.apache.hadoop.hbase.client.transactional.TestTransactions)
testGetAfterPut(org.apache.hadoop.hbase.client.transactional.TestTransactions)
testScanAfterUpdatePut(org.apache.hadoop.hbase.client.transactional.TestTransactions)
testScanAfterNewPut(org.apache.hadoop.hbase.client.transactional.TestTransactions)
testPutPutScan(org.apache.hadoop.hbase.client.transactional.TestTransactions)
Tests run: 21, Failures: 0, Errors: 19, Skipped: 0
[INFO] ------------------------------------------------------------------------
[ERROR] BUILD FAILURE
[INFO] ------------------------------------------------------------------------
[INFO] There are test failures.
Please refer to <http://hudson.zones.apache.org/hudson/job/HBase-Patch/ws/trunk/contrib/transactional/target/surefire-reports> for the individual test results.
[INFO] ------------------------------------------------------------------------
[INFO] For more information, run Maven with the -e switch
[INFO] ------------------------------------------------------------------------
[INFO] Total time: 42 minutes 10 seconds
[INFO] Finished at: Mon Mar 01 23:58:05 UTC 2010
[INFO] Final Memory: 71M/131M
[INFO] ------------------------------------------------------------------------
[locks-and-latches] Releasing all the locks
[locks-and-latches] All the locks released
Archiving artifacts
Recording test results
Build failed in Hudson: HBase-Patch #1133
Posted by Apache Hudson Server <hu...@hudson.zones.apache.org>.
See <http://hudson.zones.apache.org/hudson/job/HBase-Patch/1133/changes>
Changes:
[larsgeorge] HBASE-2276 - Fixed CHANGES.txt with wrong issue number
[larsgeorge] HBASE-2274 Hbase Shell hcd() method is broken by the replication scope parameter (Alexey Kovyrin via Lars George)
------------------------------------------
[...truncated 604 lines...]
Tests run: 1, Failures: 0, Errors: 0, Skipped: 0, Time elapsed: 5.89 sec
Running org.apache.hadoop.hbase.regionserver.wal.TestHLog
Tests run: 4, Failures: 0, Errors: 0, Skipped: 0, Time elapsed: 34.96 sec
Running org.apache.hadoop.hbase.client.TestTimestamp
Tests run: 1, Failures: 0, Errors: 0, Skipped: 0, Time elapsed: 28.354 sec
Running org.apache.hadoop.hbase.TestScanMultipleVersions
Tests run: 1, Failures: 0, Errors: 0, Skipped: 0, Time elapsed: 22.361 sec
Running org.apache.hadoop.hbase.TestMergeTable
Tests run: 1, Failures: 0, Errors: 0, Skipped: 0, Time elapsed: 63.51 sec
Running org.apache.hadoop.hbase.regionserver.TestGetClosestAtOrBefore
Tests run: 3, Failures: 0, Errors: 0, Skipped: 0, Time elapsed: 6.689 sec
Results :
Tests run: 314, Failures: 0, Errors: 0, Skipped: 4
[INFO] [jar:jar {execution: default-jar}]
[INFO] Building jar: <http://hudson.zones.apache.org/hudson/job/HBase-Patch/ws/trunk/core/target/hbase-core-0.21.0-SNAPSHOT.jar>
[INFO] [jar:test-jar {execution: default}]
[INFO] Building jar: <http://hudson.zones.apache.org/hudson/job/HBase-Patch/ws/trunk/core/target/hbase-core-0.21.0-SNAPSHOT-tests.jar>
[INFO] [source:jar-no-fork {execution: attach-sources}]
[INFO] Building jar: <http://hudson.zones.apache.org/hudson/job/HBase-Patch/ws/trunk/core/target/hbase-core-0.21.0-SNAPSHOT-sources.jar>
[INFO] [install:install {execution: default-install}]
[INFO] Installing <http://hudson.zones.apache.org/hudson/job/HBase-Patch/ws/trunk/core/target/hbase-core-0.21.0-SNAPSHOT.jar> to /home/hudson/.m2/repository/org/apache/hbase/hbase-core/0.21.0-SNAPSHOT/hbase-core-0.21.0-SNAPSHOT.jar
[INFO] Installing <http://hudson.zones.apache.org/hudson/job/HBase-Patch/ws/trunk/core/target/hbase-core-0.21.0-SNAPSHOT-tests.jar> to /home/hudson/.m2/repository/org/apache/hbase/hbase-core/0.21.0-SNAPSHOT/hbase-core-0.21.0-SNAPSHOT-tests.jar
[INFO] Installing <http://hudson.zones.apache.org/hudson/job/HBase-Patch/ws/trunk/core/target/hbase-core-0.21.0-SNAPSHOT-sources.jar> to /home/hudson/.m2/repository/org/apache/hbase/hbase-core/0.21.0-SNAPSHOT/hbase-core-0.21.0-SNAPSHOT-sources.jar
[INFO] ------------------------------------------------------------------------
[INFO] Building HBase Contrib
[INFO] task-segment: [clean, install]
[INFO] ------------------------------------------------------------------------
[INFO] [clean:clean {execution: default-clean}]
[INFO] [site:attach-descriptor {execution: default-attach-descriptor}]
[INFO] [install:install {execution: default-install}]
[INFO] Installing <http://hudson.zones.apache.org/hudson/job/HBase-Patch/ws/trunk/contrib/pom.xml> to /home/hudson/.m2/repository/org/apache/hbase/hbase-contrib/0.21.0-SNAPSHOT/hbase-contrib-0.21.0-SNAPSHOT.pom
[INFO] ------------------------------------------------------------------------
[INFO] Building HBase Contrib - Multi Datacenter Replication
[INFO] task-segment: [clean, install]
[INFO] ------------------------------------------------------------------------
[INFO] [clean:clean {execution: default-clean}]
[INFO] Deleting directory <http://hudson.zones.apache.org/hudson/job/HBase-Patch/ws/trunk/contrib/mdc_replication/target>
[INFO] [resources:resources {execution: default-resources}]
[INFO] Using 'UTF-8' encoding to copy filtered resources.
[INFO] skip non existing resourceDirectory <http://hudson.zones.apache.org/hudson/job/HBase-Patch/ws/trunk/contrib/mdc_replication/src/main/resources>
[INFO] [compiler:compile {execution: default-compile}]
[INFO] Compiling 8 source files to <http://hudson.zones.apache.org/hudson/job/HBase-Patch/ws/trunk/contrib/mdc_replication/target/classes>
[INFO] [resources:testResources {execution: default-testResources}]
[INFO] Using 'UTF-8' encoding to copy filtered resources.
[INFO] skip non existing resourceDirectory <http://hudson.zones.apache.org/hudson/job/HBase-Patch/ws/trunk/contrib/mdc_replication/src/test/resources>
[INFO] [compiler:testCompile {execution: default-testCompile}]
[INFO] Compiling 2 source files to <http://hudson.zones.apache.org/hudson/job/HBase-Patch/ws/trunk/contrib/mdc_replication/target/test-classes>
[INFO] [surefire:test {execution: default-test}]
[INFO] Surefire report directory: <http://hudson.zones.apache.org/hudson/job/HBase-Patch/ws/trunk/contrib/mdc_replication/target/surefire-reports>
-------------------------------------------------------
T E S T S
-------------------------------------------------------
Running org.apache.hadoop.hbase.replication.TestReplication
Tests run: 2, Failures: 0, Errors: 0, Skipped: 0, Time elapsed: 59.887 sec
Running org.apache.hadoop.hbase.regionserver.replication.TestReplicationSink
Tests run: 5, Failures: 0, Errors: 0, Skipped: 0, Time elapsed: 50.709 sec
Results :
Tests run: 7, Failures: 0, Errors: 0, Skipped: 0
[INFO] [jar:jar {execution: default-jar}]
[INFO] Building jar: <http://hudson.zones.apache.org/hudson/job/HBase-Patch/ws/trunk/contrib/mdc_replication/target/hbase-contrib-mdc_replication-0.21.0-SNAPSHOT.jar>
[INFO] [install:install {execution: default-install}]
[INFO] Installing <http://hudson.zones.apache.org/hudson/job/HBase-Patch/ws/trunk/contrib/mdc_replication/target/hbase-contrib-mdc_replication-0.21.0-SNAPSHOT.jar> to /home/hudson/.m2/repository/org/apache/hbase/hbase-contrib-mdc_replication/0.21.0-SNAPSHOT/hbase-contrib-mdc_replication-0.21.0-SNAPSHOT.jar
[INFO] ------------------------------------------------------------------------
[INFO] Building HBase Contrib - Stargate
[INFO] task-segment: [clean, install]
[INFO] ------------------------------------------------------------------------
[INFO] [clean:clean {execution: default-clean}]
[INFO] Deleting directory <http://hudson.zones.apache.org/hudson/job/HBase-Patch/ws/trunk/contrib/stargate/target>
[INFO] [resources:resources {execution: default-resources}]
[INFO] Using 'UTF-8' encoding to copy filtered resources.
[INFO] Copying 10 resources
[INFO] [compiler:compile {execution: default-compile}]
[INFO] Compiling 56 source files to <http://hudson.zones.apache.org/hudson/job/HBase-Patch/ws/trunk/contrib/stargate/target/classes>
[INFO] [resources:testResources {execution: default-testResources}]
[INFO] Using 'UTF-8' encoding to copy filtered resources.
[INFO] skip non existing resourceDirectory <http://hudson.zones.apache.org/hudson/job/HBase-Patch/ws/trunk/contrib/stargate/src/test/resources>
[INFO] [compiler:testCompile {execution: default-testCompile}]
[INFO] Compiling 24 source files to <http://hudson.zones.apache.org/hudson/job/HBase-Patch/ws/trunk/contrib/stargate/target/test-classes>
[INFO] [surefire:test {execution: default-test}]
[INFO] Surefire report directory: <http://hudson.zones.apache.org/hudson/job/HBase-Patch/ws/trunk/contrib/stargate/target/surefire-reports>
-------------------------------------------------------
T E S T S
-------------------------------------------------------
Running org.apache.hadoop.hbase.stargate.model.TestScannerModel
Tests run: 3, Failures: 0, Errors: 0, Skipped: 0, Time elapsed: 0.659 sec
Running org.apache.hadoop.hbase.stargate.model.TestTableSchemaModel
Tests run: 3, Failures: 0, Errors: 0, Skipped: 0, Time elapsed: 0.039 sec
Running org.apache.hadoop.hbase.stargate.model.TestStorageClusterVersionModel
Tests run: 2, Failures: 0, Errors: 0, Skipped: 0, Time elapsed: 0.013 sec
Running org.apache.hadoop.hbase.stargate.TestRowResource
Tests run: 8, Failures: 0, Errors: 0, Skipped: 0, Time elapsed: 33.948 sec
Running org.apache.hadoop.hbase.stargate.model.TestTableInfoModel
Tests run: 3, Failures: 0, Errors: 0, Skipped: 0, Time elapsed: 0.028 sec
Running org.apache.hadoop.hbase.stargate.TestStatusResource
Tests run: 2, Failures: 0, Errors: 0, Skipped: 0, Time elapsed: 0.059 sec
Running org.apache.hadoop.hbase.stargate.auth.TestHTableAuthenticator
Tests run: 4, Failures: 0, Errors: 0, Skipped: 0, Time elapsed: 5.278 sec
Running org.apache.hadoop.hbase.stargate.TestSchemaResource
Tests run: 2, Failures: 0, Errors: 0, Skipped: 0, Time elapsed: 20.809 sec
Running org.apache.hadoop.hbase.stargate.auth.TestJDBCAuthenticator
Tests run: 4, Failures: 0, Errors: 0, Skipped: 0, Time elapsed: 0.256 sec
Running org.apache.hadoop.hbase.stargate.auth.TestZooKeeperAuthenticator
Tests run: 4, Failures: 0, Errors: 0, Skipped: 0, Time elapsed: 0.34 sec
Running org.apache.hadoop.hbase.stargate.Test00MiniCluster
Tests run: 4, Failures: 0, Errors: 0, Skipped: 0, Time elapsed: 0.003 sec
Running org.apache.hadoop.hbase.stargate.TestVersionResource
Tests run: 7, Failures: 0, Errors: 0, Skipped: 0, Time elapsed: 0.08 sec
Running org.apache.hadoop.hbase.stargate.model.TestTableListModel
Tests run: 3, Failures: 0, Errors: 0, Skipped: 0, Time elapsed: 0.014 sec
Running org.apache.hadoop.hbase.stargate.model.TestVersionModel
Tests run: 3, Failures: 0, Errors: 0, Skipped: 0, Time elapsed: 0.015 sec
Running org.apache.hadoop.hbase.stargate.auth.TestHBCAuthenticator
Tests run: 4, Failures: 0, Errors: 0, Skipped: 0, Time elapsed: 0.015 sec
Running org.apache.hadoop.hbase.stargate.model.TestStorageClusterStatusModel
Tests run: 3, Failures: 0, Errors: 0, Skipped: 0, Time elapsed: 0.06 sec
Running org.apache.hadoop.hbase.stargate.model.TestCellModel
Tests run: 3, Failures: 0, Errors: 0, Skipped: 0, Time elapsed: 0.013 sec
Running org.apache.hadoop.hbase.stargate.TestScannerResource
Tests run: 4, Failures: 0, Errors: 0, Skipped: 0, Time elapsed: 21.826 sec
Running org.apache.hadoop.hbase.stargate.model.TestCellSetModel
Tests run: 3, Failures: 0, Errors: 0, Skipped: 0, Time elapsed: 0.02 sec
Running org.apache.hadoop.hbase.stargate.model.TestTableRegionModel
Tests run: 2, Failures: 0, Errors: 0, Skipped: 0, Time elapsed: 0.011 sec
Running org.apache.hadoop.hbase.stargate.model.TestColumnSchemaModel
Tests run: 2, Failures: 0, Errors: 0, Skipped: 0, Time elapsed: 0.01 sec
Running org.apache.hadoop.hbase.stargate.model.TestRowModel
Tests run: 2, Failures: 0, Errors: 0, Skipped: 0, Time elapsed: 0.012 sec
Running org.apache.hadoop.hbase.stargate.TestTableResource
Tests run: 4, Failures: 0, Errors: 0, Skipped: 0, Time elapsed: 5.535 sec
Results :
Tests run: 79, Failures: 0, Errors: 0, Skipped: 0
[INFO] [war:war {execution: default-war}]
[INFO] Packaging webapp
[INFO] Assembling webapp[hbase-contrib-stargate] in [<http://hudson.zones.apache.org/hudson/job/HBase-Patch/ws/trunk/contrib/stargate/target/hbase-contrib-stargate-0.21.0-SNAPSHOT]>
[INFO] Processing war project
[INFO] Webapp assembled in[625 msecs]
[INFO] Building war: <http://hudson.zones.apache.org/hudson/job/HBase-Patch/ws/trunk/contrib/stargate/target/hbase-contrib-stargate-0.21.0-SNAPSHOT.war>
[INFO] [install:install {execution: default-install}]
[INFO] Installing <http://hudson.zones.apache.org/hudson/job/HBase-Patch/ws/trunk/contrib/stargate/target/hbase-contrib-stargate-0.21.0-SNAPSHOT.war> to /home/hudson/.m2/repository/org/apache/hbase/hbase-contrib-stargate/0.21.0-SNAPSHOT/hbase-contrib-stargate-0.21.0-SNAPSHOT.war
[INFO] ------------------------------------------------------------------------
[INFO] Building HBase Contrib - Transactional
[INFO] task-segment: [clean, install]
[INFO] ------------------------------------------------------------------------
[INFO] [clean:clean {execution: default-clean}]
[INFO] Deleting directory <http://hudson.zones.apache.org/hudson/job/HBase-Patch/ws/trunk/contrib/transactional/target>
[INFO] [resources:resources {execution: default-resources}]
[INFO] Using 'UTF-8' encoding to copy filtered resources.
[INFO] skip non existing resourceDirectory <http://hudson.zones.apache.org/hudson/job/HBase-Patch/ws/trunk/contrib/transactional/src/main/resources>
[INFO] [compiler:compile {execution: default-compile}]
[INFO] Compiling 31 source files to <http://hudson.zones.apache.org/hudson/job/HBase-Patch/ws/trunk/contrib/transactional/target/classes>
[WARNING] <http://hudson.zones.apache.org/hudson/job/HBase-Patch/ws/trunk/contrib/transactional/src/main/java/org/apache/hadoop/hbase/client/transactional/HBaseBackedTransactionLogger.java>:[56,38] [deprecation] HBaseConfiguration() in org.apache.hadoop.hbase.HBaseConfiguration has been deprecated
[WARNING] <http://hudson.zones.apache.org/hudson/job/HBase-Patch/ws/trunk/contrib/transactional/src/main/java/org/apache/hadoop/hbase/client/transactional/HBaseBackedTransactionLogger.java>:[68,38] [deprecation] HBaseConfiguration() in org.apache.hadoop.hbase.HBaseConfiguration has been deprecated
[WARNING] <http://hudson.zones.apache.org/hudson/job/HBase-Patch/ws/trunk/contrib/transactional/src/main/java/org/apache/hadoop/hbase/client/tableindexed/IndexSpecification.java>:[154,49] [deprecation] HBaseConfiguration() in org.apache.hadoop.hbase.HBaseConfiguration has been deprecated
[INFO] [resources:testResources {execution: default-testResources}]
[INFO] Using 'UTF-8' encoding to copy filtered resources.
[INFO] skip non existing resourceDirectory <http://hudson.zones.apache.org/hudson/job/HBase-Patch/ws/trunk/contrib/transactional/src/test/resources>
[INFO] [compiler:testCompile {execution: default-testCompile}]
[INFO] Compiling 7 source files to <http://hudson.zones.apache.org/hudson/job/HBase-Patch/ws/trunk/contrib/transactional/target/test-classes>
[WARNING] <http://hudson.zones.apache.org/hudson/job/HBase-Patch/ws/trunk/contrib/transactional/src/test/java/org/apache/hadoop/hbase/client/tableindexed/TestIndexedTable.java>:[29,30] [deprecation] org.apache.hadoop.hbase.HBaseClusterTestCase in org.apache.hadoop.hbase has been deprecated
[WARNING] <http://hudson.zones.apache.org/hudson/job/HBase-Patch/ws/trunk/contrib/transactional/src/test/java/org/apache/hadoop/hbase/client/tableindexed/TestIndexedTable.java>:[43,38] [deprecation] org.apache.hadoop.hbase.HBaseClusterTestCase in org.apache.hadoop.hbase has been deprecated
[WARNING] <http://hudson.zones.apache.org/hudson/job/HBase-Patch/ws/trunk/contrib/transactional/src/test/java/org/apache/hadoop/hbase/client/transactional/TestTransactions.java>:[26,30] [deprecation] org.apache.hadoop.hbase.HBaseClusterTestCase in org.apache.hadoop.hbase has been deprecated
[WARNING] <http://hudson.zones.apache.org/hudson/job/HBase-Patch/ws/trunk/contrib/transactional/src/test/java/org/apache/hadoop/hbase/client/transactional/TestTransactions.java>:[44,38] [deprecation] org.apache.hadoop.hbase.HBaseClusterTestCase in org.apache.hadoop.hbase has been deprecated
[WARNING] <http://hudson.zones.apache.org/hudson/job/HBase-Patch/ws/trunk/contrib/transactional/src/test/java/org/apache/hadoop/hbase/regionserver/transactional/TestTHLogRecovery.java>:[30,30] [deprecation] org.apache.hadoop.hbase.HBaseClusterTestCase in org.apache.hadoop.hbase has been deprecated
[WARNING] <http://hudson.zones.apache.org/hudson/job/HBase-Patch/ws/trunk/contrib/transactional/src/test/java/org/apache/hadoop/hbase/regionserver/transactional/TestTHLogRecovery.java>:[51,39] [deprecation] org.apache.hadoop.hbase.HBaseClusterTestCase in org.apache.hadoop.hbase has been deprecated
[WARNING] <http://hudson.zones.apache.org/hudson/job/HBase-Patch/ws/trunk/contrib/transactional/src/test/java/org/apache/hadoop/hbase/client/transactional/StressTestTransactions.java>:[32,30] [deprecation] org.apache.hadoop.hbase.HBaseClusterTestCase in org.apache.hadoop.hbase has been deprecated
[WARNING] <http://hudson.zones.apache.org/hudson/job/HBase-Patch/ws/trunk/contrib/transactional/src/test/java/org/apache/hadoop/hbase/client/transactional/StressTestTransactions.java>:[53,44] [deprecation] org.apache.hadoop.hbase.HBaseClusterTestCase in org.apache.hadoop.hbase has been deprecated
[WARNING] <http://hudson.zones.apache.org/hudson/job/HBase-Patch/ws/trunk/contrib/transactional/src/test/java/org/apache/hadoop/hbase/regionserver/transactional/TestTHLog.java>:[27,30] [deprecation] org.apache.hadoop.hbase.HBaseTestCase in org.apache.hadoop.hbase has been deprecated
[WARNING] <http://hudson.zones.apache.org/hudson/job/HBase-Patch/ws/trunk/contrib/transactional/src/test/java/org/apache/hadoop/hbase/regionserver/transactional/TestTHLog.java>:[37,31] [deprecation] org.apache.hadoop.hbase.HBaseTestCase in org.apache.hadoop.hbase has been deprecated
[INFO] [surefire:test {execution: default-test}]
[INFO] Surefire report directory: <http://hudson.zones.apache.org/hudson/job/HBase-Patch/ws/trunk/contrib/transactional/target/surefire-reports>
-------------------------------------------------------
T E S T S
-------------------------------------------------------
Running org.apache.hadoop.hbase.client.tableindexed.TestIndexedTable
Tests run: 7, Failures: 0, Errors: 7, Skipped: 0, Time elapsed: 2.686 sec <<< FAILURE!
Running org.apache.hadoop.hbase.regionserver.transactional.TestTHLog
Tests run: 5, Failures: 0, Errors: 5, Skipped: 0, Time elapsed: 1.583 sec <<< FAILURE!
Running org.apache.hadoop.hbase.client.transactional.TestTransactions
Tests run: 7, Failures: 0, Errors: 7, Skipped: 0, Time elapsed: 2.145 sec <<< FAILURE!
Running org.apache.hadoop.hbase.regionserver.transactional.TestTHLogRecovery
Tests run: 2, Failures: 0, Errors: 0, Skipped: 0, Time elapsed: 901.507 sec
Results :
Tests in error:
testInitialWrites(org.apache.hadoop.hbase.client.tableindexed.TestIndexedTable)
testMultipleWrites(org.apache.hadoop.hbase.client.tableindexed.TestIndexedTable)
testDelete(org.apache.hadoop.hbase.client.tableindexed.TestIndexedTable)
testRowUpdate(org.apache.hadoop.hbase.client.tableindexed.TestIndexedTable)
testLockedRowUpdate(org.apache.hadoop.hbase.client.tableindexed.TestIndexedTable)
testLockedRowUpdateNoAutoFlush(org.apache.hadoop.hbase.client.tableindexed.TestIndexedTable)
testLockedRowDelete(org.apache.hadoop.hbase.client.tableindexed.TestIndexedTable)
testSingleCommit(org.apache.hadoop.hbase.regionserver.transactional.TestTHLog)
testSingleAbort(org.apache.hadoop.hbase.regionserver.transactional.TestTHLog)
testInterlievedCommits(org.apache.hadoop.hbase.regionserver.transactional.TestTHLog)
testInterlievedAbortCommit(org.apache.hadoop.hbase.regionserver.transactional.TestTHLog)
testInterlievedCommitAbort(org.apache.hadoop.hbase.regionserver.transactional.TestTHLog)
testSimpleTransaction(org.apache.hadoop.hbase.client.transactional.TestTransactions)
testTwoTransactionsWithoutConflict(org.apache.hadoop.hbase.client.transactional.TestTransactions)
testTwoTransactionsWithConflict(org.apache.hadoop.hbase.client.transactional.TestTransactions)
testGetAfterPut(org.apache.hadoop.hbase.client.transactional.TestTransactions)
testScanAfterUpdatePut(org.apache.hadoop.hbase.client.transactional.TestTransactions)
testScanAfterNewPut(org.apache.hadoop.hbase.client.transactional.TestTransactions)
testPutPutScan(org.apache.hadoop.hbase.client.transactional.TestTransactions)
Tests run: 21, Failures: 0, Errors: 19, Skipped: 0
[INFO] ------------------------------------------------------------------------
[ERROR] BUILD FAILURE
[INFO] ------------------------------------------------------------------------
[INFO] There are test failures.
Please refer to <http://hudson.zones.apache.org/hudson/job/HBase-Patch/ws/trunk/contrib/transactional/target/surefire-reports> for the individual test results.
[INFO] ------------------------------------------------------------------------
[INFO] For more information, run Maven with the -e switch
[INFO] ------------------------------------------------------------------------
[INFO] Total time: 49 minutes 10 seconds
[INFO] Finished at: Sun Feb 28 12:05:04 UTC 2010
[INFO] Final Memory: 71M/131M
[INFO] ------------------------------------------------------------------------
[locks-and-latches] Releasing all the locks
[locks-and-latches] All the locks released
Archiving artifacts
Recording test results
Build failed in Hudson: HBase-Patch #1132
Posted by Apache Hudson Server <hu...@hudson.zones.apache.org>.
See <http://hudson.zones.apache.org/hudson/job/HBase-Patch/1132/changes>
Changes:
[apurtell] fix minor nit in commented HBASE_OPTS
[apurtell] HBASE-2273 [stargate] export metrics via Hadoop metrics, JMX, and zookeeper
[apurtell] add (test) dependency on hsqldb
------------------------------------------
[...truncated 628 lines...]
Tests run: 1, Failures: 0, Errors: 0, Skipped: 0, Time elapsed: 5.915 sec
Running org.apache.hadoop.hbase.regionserver.wal.TestHLog
Tests run: 4, Failures: 0, Errors: 0, Skipped: 0, Time elapsed: 44.871 sec
Running org.apache.hadoop.hbase.client.TestTimestamp
Tests run: 1, Failures: 0, Errors: 0, Skipped: 0, Time elapsed: 17.491 sec
Running org.apache.hadoop.hbase.TestScanMultipleVersions
Tests run: 1, Failures: 0, Errors: 0, Skipped: 0, Time elapsed: 22.348 sec
Running org.apache.hadoop.hbase.TestMergeTable
Tests run: 1, Failures: 0, Errors: 0, Skipped: 0, Time elapsed: 63.323 sec
Running org.apache.hadoop.hbase.regionserver.TestGetClosestAtOrBefore
Tests run: 3, Failures: 0, Errors: 0, Skipped: 0, Time elapsed: 22.936 sec
Results :
Tests run: 314, Failures: 0, Errors: 0, Skipped: 4
[INFO] [jar:jar {execution: default-jar}]
[INFO] Building jar: <http://hudson.zones.apache.org/hudson/job/HBase-Patch/ws/trunk/core/target/hbase-core-0.21.0-SNAPSHOT.jar>
[INFO] [jar:test-jar {execution: default}]
[INFO] Building jar: <http://hudson.zones.apache.org/hudson/job/HBase-Patch/ws/trunk/core/target/hbase-core-0.21.0-SNAPSHOT-tests.jar>
[INFO] [source:jar-no-fork {execution: attach-sources}]
[INFO] Building jar: <http://hudson.zones.apache.org/hudson/job/HBase-Patch/ws/trunk/core/target/hbase-core-0.21.0-SNAPSHOT-sources.jar>
[INFO] [install:install {execution: default-install}]
[INFO] Installing <http://hudson.zones.apache.org/hudson/job/HBase-Patch/ws/trunk/core/target/hbase-core-0.21.0-SNAPSHOT.jar> to /home/hudson/.m2/repository/org/apache/hbase/hbase-core/0.21.0-SNAPSHOT/hbase-core-0.21.0-SNAPSHOT.jar
[INFO] Installing <http://hudson.zones.apache.org/hudson/job/HBase-Patch/ws/trunk/core/target/hbase-core-0.21.0-SNAPSHOT-tests.jar> to /home/hudson/.m2/repository/org/apache/hbase/hbase-core/0.21.0-SNAPSHOT/hbase-core-0.21.0-SNAPSHOT-tests.jar
[INFO] Installing <http://hudson.zones.apache.org/hudson/job/HBase-Patch/ws/trunk/core/target/hbase-core-0.21.0-SNAPSHOT-sources.jar> to /home/hudson/.m2/repository/org/apache/hbase/hbase-core/0.21.0-SNAPSHOT/hbase-core-0.21.0-SNAPSHOT-sources.jar
[INFO] ------------------------------------------------------------------------
[INFO] Building HBase Contrib
[INFO] task-segment: [clean, install]
[INFO] ------------------------------------------------------------------------
[INFO] [clean:clean {execution: default-clean}]
[INFO] [site:attach-descriptor {execution: default-attach-descriptor}]
[INFO] [install:install {execution: default-install}]
[INFO] Installing <http://hudson.zones.apache.org/hudson/job/HBase-Patch/ws/trunk/contrib/pom.xml> to /home/hudson/.m2/repository/org/apache/hbase/hbase-contrib/0.21.0-SNAPSHOT/hbase-contrib-0.21.0-SNAPSHOT.pom
[INFO] ------------------------------------------------------------------------
[INFO] Building HBase Contrib - Multi Datacenter Replication
[INFO] task-segment: [clean, install]
[INFO] ------------------------------------------------------------------------
[INFO] [clean:clean {execution: default-clean}]
[INFO] Deleting directory <http://hudson.zones.apache.org/hudson/job/HBase-Patch/ws/trunk/contrib/mdc_replication/target>
[INFO] [resources:resources {execution: default-resources}]
[INFO] Using 'UTF-8' encoding to copy filtered resources.
[INFO] skip non existing resourceDirectory <http://hudson.zones.apache.org/hudson/job/HBase-Patch/ws/trunk/contrib/mdc_replication/src/main/resources>
[INFO] [compiler:compile {execution: default-compile}]
[INFO] Compiling 8 source files to <http://hudson.zones.apache.org/hudson/job/HBase-Patch/ws/trunk/contrib/mdc_replication/target/classes>
[INFO] [resources:testResources {execution: default-testResources}]
[INFO] Using 'UTF-8' encoding to copy filtered resources.
[INFO] skip non existing resourceDirectory <http://hudson.zones.apache.org/hudson/job/HBase-Patch/ws/trunk/contrib/mdc_replication/src/test/resources>
[INFO] [compiler:testCompile {execution: default-testCompile}]
[INFO] Compiling 2 source files to <http://hudson.zones.apache.org/hudson/job/HBase-Patch/ws/trunk/contrib/mdc_replication/target/test-classes>
[INFO] [surefire:test {execution: default-test}]
[INFO] Surefire report directory: <http://hudson.zones.apache.org/hudson/job/HBase-Patch/ws/trunk/contrib/mdc_replication/target/surefire-reports>
-------------------------------------------------------
T E S T S
-------------------------------------------------------
Running org.apache.hadoop.hbase.replication.TestReplication
Tests run: 2, Failures: 0, Errors: 0, Skipped: 0, Time elapsed: 72.662 sec
Running org.apache.hadoop.hbase.regionserver.replication.TestReplicationSink
Tests run: 5, Failures: 0, Errors: 0, Skipped: 0, Time elapsed: 47.175 sec
Results :
Tests run: 7, Failures: 0, Errors: 0, Skipped: 0
[INFO] [jar:jar {execution: default-jar}]
[INFO] Building jar: <http://hudson.zones.apache.org/hudson/job/HBase-Patch/ws/trunk/contrib/mdc_replication/target/hbase-contrib-mdc_replication-0.21.0-SNAPSHOT.jar>
[INFO] [install:install {execution: default-install}]
[INFO] Installing <http://hudson.zones.apache.org/hudson/job/HBase-Patch/ws/trunk/contrib/mdc_replication/target/hbase-contrib-mdc_replication-0.21.0-SNAPSHOT.jar> to /home/hudson/.m2/repository/org/apache/hbase/hbase-contrib-mdc_replication/0.21.0-SNAPSHOT/hbase-contrib-mdc_replication-0.21.0-SNAPSHOT.jar
[INFO] ------------------------------------------------------------------------
[INFO] Building HBase Contrib - Stargate
[INFO] task-segment: [clean, install]
[INFO] ------------------------------------------------------------------------
[INFO] [clean:clean {execution: default-clean}]
[INFO] Deleting directory <http://hudson.zones.apache.org/hudson/job/HBase-Patch/ws/trunk/contrib/stargate/target>
[INFO] [resources:resources {execution: default-resources}]
[INFO] Using 'UTF-8' encoding to copy filtered resources.
[INFO] Copying 10 resources
[INFO] [compiler:compile {execution: default-compile}]
[INFO] Compiling 56 source files to <http://hudson.zones.apache.org/hudson/job/HBase-Patch/ws/trunk/contrib/stargate/target/classes>
[INFO] [resources:testResources {execution: default-testResources}]
[INFO] Using 'UTF-8' encoding to copy filtered resources.
[INFO] skip non existing resourceDirectory <http://hudson.zones.apache.org/hudson/job/HBase-Patch/ws/trunk/contrib/stargate/src/test/resources>
[INFO] [compiler:testCompile {execution: default-testCompile}]
[INFO] Compiling 24 source files to <http://hudson.zones.apache.org/hudson/job/HBase-Patch/ws/trunk/contrib/stargate/target/test-classes>
[INFO] [surefire:test {execution: default-test}]
[INFO] Surefire report directory: <http://hudson.zones.apache.org/hudson/job/HBase-Patch/ws/trunk/contrib/stargate/target/surefire-reports>
-------------------------------------------------------
T E S T S
-------------------------------------------------------
Running org.apache.hadoop.hbase.stargate.model.TestScannerModel
Tests run: 3, Failures: 0, Errors: 0, Skipped: 0, Time elapsed: 0.622 sec
Running org.apache.hadoop.hbase.stargate.model.TestTableSchemaModel
Tests run: 3, Failures: 0, Errors: 0, Skipped: 0, Time elapsed: 0.039 sec
Running org.apache.hadoop.hbase.stargate.model.TestStorageClusterVersionModel
Tests run: 2, Failures: 0, Errors: 0, Skipped: 0, Time elapsed: 0.013 sec
Running org.apache.hadoop.hbase.stargate.TestRowResource
Tests run: 8, Failures: 0, Errors: 0, Skipped: 0, Time elapsed: 16.496 sec
Running org.apache.hadoop.hbase.stargate.model.TestTableInfoModel
Tests run: 3, Failures: 0, Errors: 0, Skipped: 0, Time elapsed: 0.029 sec
Running org.apache.hadoop.hbase.stargate.TestStatusResource
Tests run: 2, Failures: 0, Errors: 0, Skipped: 0, Time elapsed: 0.063 sec
Running org.apache.hadoop.hbase.stargate.auth.TestHTableAuthenticator
Tests run: 4, Failures: 0, Errors: 0, Skipped: 0, Time elapsed: 5.285 sec
Running org.apache.hadoop.hbase.stargate.TestSchemaResource
Tests run: 2, Failures: 0, Errors: 0, Skipped: 0, Time elapsed: 20.789 sec
Running org.apache.hadoop.hbase.stargate.auth.TestJDBCAuthenticator
Tests run: 4, Failures: 0, Errors: 0, Skipped: 0, Time elapsed: 0.293 sec
Running org.apache.hadoop.hbase.stargate.auth.TestZooKeeperAuthenticator
Tests run: 4, Failures: 0, Errors: 0, Skipped: 0, Time elapsed: 0.341 sec
Running org.apache.hadoop.hbase.stargate.Test00MiniCluster
Tests run: 4, Failures: 0, Errors: 0, Skipped: 0, Time elapsed: 0.004 sec
Running org.apache.hadoop.hbase.stargate.TestVersionResource
Tests run: 7, Failures: 0, Errors: 0, Skipped: 0, Time elapsed: 0.069 sec
Running org.apache.hadoop.hbase.stargate.model.TestTableListModel
Tests run: 3, Failures: 0, Errors: 0, Skipped: 0, Time elapsed: 0.015 sec
Running org.apache.hadoop.hbase.stargate.model.TestVersionModel
Tests run: 3, Failures: 0, Errors: 0, Skipped: 0, Time elapsed: 0.014 sec
Running org.apache.hadoop.hbase.stargate.auth.TestHBCAuthenticator
Tests run: 4, Failures: 0, Errors: 0, Skipped: 0, Time elapsed: 0.016 sec
Running org.apache.hadoop.hbase.stargate.model.TestStorageClusterStatusModel
Tests run: 3, Failures: 0, Errors: 0, Skipped: 0, Time elapsed: 0.06 sec
Running org.apache.hadoop.hbase.stargate.model.TestCellModel
Tests run: 3, Failures: 0, Errors: 0, Skipped: 0, Time elapsed: 0.013 sec
Running org.apache.hadoop.hbase.stargate.TestScannerResource
Tests run: 4, Failures: 0, Errors: 0, Skipped: 0, Time elapsed: 21.44 sec
Running org.apache.hadoop.hbase.stargate.model.TestCellSetModel
Tests run: 3, Failures: 0, Errors: 0, Skipped: 0, Time elapsed: 0.02 sec
Running org.apache.hadoop.hbase.stargate.model.TestTableRegionModel
Tests run: 2, Failures: 0, Errors: 0, Skipped: 0, Time elapsed: 0.012 sec
Running org.apache.hadoop.hbase.stargate.model.TestColumnSchemaModel
Tests run: 2, Failures: 0, Errors: 0, Skipped: 0, Time elapsed: 0.006 sec
Running org.apache.hadoop.hbase.stargate.model.TestRowModel
Tests run: 2, Failures: 0, Errors: 0, Skipped: 0, Time elapsed: 0.011 sec
Running org.apache.hadoop.hbase.stargate.TestTableResource
Tests run: 4, Failures: 0, Errors: 0, Skipped: 0, Time elapsed: 5.372 sec
Results :
Tests run: 79, Failures: 0, Errors: 0, Skipped: 0
[INFO] [war:war {execution: default-war}]
[INFO] Packaging webapp
[INFO] Assembling webapp[hbase-contrib-stargate] in [<http://hudson.zones.apache.org/hudson/job/HBase-Patch/ws/trunk/contrib/stargate/target/hbase-contrib-stargate-0.21.0-SNAPSHOT]>
[INFO] Processing war project
[INFO] Webapp assembled in[630 msecs]
[INFO] Building war: <http://hudson.zones.apache.org/hudson/job/HBase-Patch/ws/trunk/contrib/stargate/target/hbase-contrib-stargate-0.21.0-SNAPSHOT.war>
[INFO] [install:install {execution: default-install}]
[INFO] Installing <http://hudson.zones.apache.org/hudson/job/HBase-Patch/ws/trunk/contrib/stargate/target/hbase-contrib-stargate-0.21.0-SNAPSHOT.war> to /home/hudson/.m2/repository/org/apache/hbase/hbase-contrib-stargate/0.21.0-SNAPSHOT/hbase-contrib-stargate-0.21.0-SNAPSHOT.war
[INFO] ------------------------------------------------------------------------
[INFO] Building HBase Contrib - Transactional
[INFO] task-segment: [clean, install]
[INFO] ------------------------------------------------------------------------
[INFO] [clean:clean {execution: default-clean}]
[INFO] Deleting directory <http://hudson.zones.apache.org/hudson/job/HBase-Patch/ws/trunk/contrib/transactional/target>
[INFO] [resources:resources {execution: default-resources}]
[INFO] Using 'UTF-8' encoding to copy filtered resources.
[INFO] skip non existing resourceDirectory <http://hudson.zones.apache.org/hudson/job/HBase-Patch/ws/trunk/contrib/transactional/src/main/resources>
[INFO] [compiler:compile {execution: default-compile}]
[INFO] Compiling 31 source files to <http://hudson.zones.apache.org/hudson/job/HBase-Patch/ws/trunk/contrib/transactional/target/classes>
[WARNING] <http://hudson.zones.apache.org/hudson/job/HBase-Patch/ws/trunk/contrib/transactional/src/main/java/org/apache/hadoop/hbase/client/transactional/HBaseBackedTransactionLogger.java>:[56,38] [deprecation] HBaseConfiguration() in org.apache.hadoop.hbase.HBaseConfiguration has been deprecated
[WARNING] <http://hudson.zones.apache.org/hudson/job/HBase-Patch/ws/trunk/contrib/transactional/src/main/java/org/apache/hadoop/hbase/client/transactional/HBaseBackedTransactionLogger.java>:[68,38] [deprecation] HBaseConfiguration() in org.apache.hadoop.hbase.HBaseConfiguration has been deprecated
[WARNING] <http://hudson.zones.apache.org/hudson/job/HBase-Patch/ws/trunk/contrib/transactional/src/main/java/org/apache/hadoop/hbase/client/tableindexed/IndexSpecification.java>:[154,49] [deprecation] HBaseConfiguration() in org.apache.hadoop.hbase.HBaseConfiguration has been deprecated
[INFO] [resources:testResources {execution: default-testResources}]
[INFO] Using 'UTF-8' encoding to copy filtered resources.
[INFO] skip non existing resourceDirectory <http://hudson.zones.apache.org/hudson/job/HBase-Patch/ws/trunk/contrib/transactional/src/test/resources>
[INFO] [compiler:testCompile {execution: default-testCompile}]
[INFO] Compiling 7 source files to <http://hudson.zones.apache.org/hudson/job/HBase-Patch/ws/trunk/contrib/transactional/target/test-classes>
[WARNING] <http://hudson.zones.apache.org/hudson/job/HBase-Patch/ws/trunk/contrib/transactional/src/test/java/org/apache/hadoop/hbase/client/tableindexed/TestIndexedTable.java>:[29,30] [deprecation] org.apache.hadoop.hbase.HBaseClusterTestCase in org.apache.hadoop.hbase has been deprecated
[WARNING] <http://hudson.zones.apache.org/hudson/job/HBase-Patch/ws/trunk/contrib/transactional/src/test/java/org/apache/hadoop/hbase/client/tableindexed/TestIndexedTable.java>:[43,38] [deprecation] org.apache.hadoop.hbase.HBaseClusterTestCase in org.apache.hadoop.hbase has been deprecated
[WARNING] <http://hudson.zones.apache.org/hudson/job/HBase-Patch/ws/trunk/contrib/transactional/src/test/java/org/apache/hadoop/hbase/client/transactional/TestTransactions.java>:[26,30] [deprecation] org.apache.hadoop.hbase.HBaseClusterTestCase in org.apache.hadoop.hbase has been deprecated
[WARNING] <http://hudson.zones.apache.org/hudson/job/HBase-Patch/ws/trunk/contrib/transactional/src/test/java/org/apache/hadoop/hbase/client/transactional/TestTransactions.java>:[44,38] [deprecation] org.apache.hadoop.hbase.HBaseClusterTestCase in org.apache.hadoop.hbase has been deprecated
[WARNING] <http://hudson.zones.apache.org/hudson/job/HBase-Patch/ws/trunk/contrib/transactional/src/test/java/org/apache/hadoop/hbase/regionserver/transactional/TestTHLogRecovery.java>:[30,30] [deprecation] org.apache.hadoop.hbase.HBaseClusterTestCase in org.apache.hadoop.hbase has been deprecated
[WARNING] <http://hudson.zones.apache.org/hudson/job/HBase-Patch/ws/trunk/contrib/transactional/src/test/java/org/apache/hadoop/hbase/regionserver/transactional/TestTHLogRecovery.java>:[51,39] [deprecation] org.apache.hadoop.hbase.HBaseClusterTestCase in org.apache.hadoop.hbase has been deprecated
[WARNING] <http://hudson.zones.apache.org/hudson/job/HBase-Patch/ws/trunk/contrib/transactional/src/test/java/org/apache/hadoop/hbase/client/transactional/StressTestTransactions.java>:[32,30] [deprecation] org.apache.hadoop.hbase.HBaseClusterTestCase in org.apache.hadoop.hbase has been deprecated
[WARNING] <http://hudson.zones.apache.org/hudson/job/HBase-Patch/ws/trunk/contrib/transactional/src/test/java/org/apache/hadoop/hbase/client/transactional/StressTestTransactions.java>:[53,44] [deprecation] org.apache.hadoop.hbase.HBaseClusterTestCase in org.apache.hadoop.hbase has been deprecated
[WARNING] <http://hudson.zones.apache.org/hudson/job/HBase-Patch/ws/trunk/contrib/transactional/src/test/java/org/apache/hadoop/hbase/regionserver/transactional/TestTHLog.java>:[27,30] [deprecation] org.apache.hadoop.hbase.HBaseTestCase in org.apache.hadoop.hbase has been deprecated
[WARNING] <http://hudson.zones.apache.org/hudson/job/HBase-Patch/ws/trunk/contrib/transactional/src/test/java/org/apache/hadoop/hbase/regionserver/transactional/TestTHLog.java>:[37,31] [deprecation] org.apache.hadoop.hbase.HBaseTestCase in org.apache.hadoop.hbase has been deprecated
[INFO] [surefire:test {execution: default-test}]
[INFO] Surefire report directory: <http://hudson.zones.apache.org/hudson/job/HBase-Patch/ws/trunk/contrib/transactional/target/surefire-reports>
-------------------------------------------------------
T E S T S
-------------------------------------------------------
Running org.apache.hadoop.hbase.client.tableindexed.TestIndexedTable
Tests run: 7, Failures: 0, Errors: 7, Skipped: 0, Time elapsed: 2.747 sec <<< FAILURE!
Running org.apache.hadoop.hbase.regionserver.transactional.TestTHLog
Tests run: 5, Failures: 0, Errors: 5, Skipped: 0, Time elapsed: 1.546 sec <<< FAILURE!
Running org.apache.hadoop.hbase.client.transactional.TestTransactions
Tests run: 7, Failures: 0, Errors: 7, Skipped: 0, Time elapsed: 2.345 sec <<< FAILURE!
Running org.apache.hadoop.hbase.regionserver.transactional.TestTHLogRecovery
Tests run: 2, Failures: 0, Errors: 0, Skipped: 0, Time elapsed: 513.201 sec
Results :
Tests in error:
testInitialWrites(org.apache.hadoop.hbase.client.tableindexed.TestIndexedTable)
testMultipleWrites(org.apache.hadoop.hbase.client.tableindexed.TestIndexedTable)
testDelete(org.apache.hadoop.hbase.client.tableindexed.TestIndexedTable)
testRowUpdate(org.apache.hadoop.hbase.client.tableindexed.TestIndexedTable)
testLockedRowUpdate(org.apache.hadoop.hbase.client.tableindexed.TestIndexedTable)
testLockedRowUpdateNoAutoFlush(org.apache.hadoop.hbase.client.tableindexed.TestIndexedTable)
testLockedRowDelete(org.apache.hadoop.hbase.client.tableindexed.TestIndexedTable)
testSingleCommit(org.apache.hadoop.hbase.regionserver.transactional.TestTHLog)
testSingleAbort(org.apache.hadoop.hbase.regionserver.transactional.TestTHLog)
testInterlievedCommits(org.apache.hadoop.hbase.regionserver.transactional.TestTHLog)
testInterlievedAbortCommit(org.apache.hadoop.hbase.regionserver.transactional.TestTHLog)
testInterlievedCommitAbort(org.apache.hadoop.hbase.regionserver.transactional.TestTHLog)
testSimpleTransaction(org.apache.hadoop.hbase.client.transactional.TestTransactions)
testTwoTransactionsWithoutConflict(org.apache.hadoop.hbase.client.transactional.TestTransactions)
testTwoTransactionsWithConflict(org.apache.hadoop.hbase.client.transactional.TestTransactions)
testGetAfterPut(org.apache.hadoop.hbase.client.transactional.TestTransactions)
testScanAfterUpdatePut(org.apache.hadoop.hbase.client.transactional.TestTransactions)
testScanAfterNewPut(org.apache.hadoop.hbase.client.transactional.TestTransactions)
testPutPutScan(org.apache.hadoop.hbase.client.transactional.TestTransactions)
Tests run: 21, Failures: 0, Errors: 19, Skipped: 0
[INFO] ------------------------------------------------------------------------
[ERROR] BUILD FAILURE
[INFO] ------------------------------------------------------------------------
[INFO] There are test failures.
Please refer to <http://hudson.zones.apache.org/hudson/job/HBase-Patch/ws/trunk/contrib/transactional/target/surefire-reports> for the individual test results.
[INFO] ------------------------------------------------------------------------
[INFO] For more information, run Maven with the -e switch
[INFO] ------------------------------------------------------------------------
[INFO] Total time: 42 minutes 56 seconds
[INFO] Finished at: Sat Feb 27 06:11:51 UTC 2010
[INFO] Final Memory: 71M/133M
[INFO] ------------------------------------------------------------------------
[locks-and-latches] Releasing all the locks
[locks-and-latches] All the locks released
Archiving artifacts
Recording test results
Build failed in Hudson: HBase-Patch #1131
Posted by Apache Hudson Server <hu...@hudson.zones.apache.org>.
See <http://hudson.zones.apache.org/hudson/job/HBase-Patch/1131/changes>
Changes:
[apurtell] HBASE-2263 [stargate] multiuser mode: authenticator for zookeeper
[apurtell] stargate needs org.json
------------------------------------------
[...truncated 718 lines...]
7973/?
8486/?
8645/?
9157/?
9669/?
10181/?
10692/?
11287/?
11799/?
12311/?
12823/?
13335/?
13848/?
14400/?
15008/?
15519/?
16031/?
16543/?
16815/?
16839/?
17293/?
17805/?
18317/?
18830/?
19342/?
19854/?
20365/?
20381/?
20893/?
21405/?
21916/?
22429/?
22941/?
23571/?
24129/?
24641/?
25153/?
25665/?
26177/?
26735/?
27247/?
27760/?
28311/?
28824/?
29378/?
29890/?
30403/?
30914/?
31427/?
31938/?
32449/?
32961/?
33474/?
33913/?
34425/?
34936/?
35446/?
35956/?
36469/?
36987/?
37503/?
38016/?
38529/?
39082/?
39593/?
40103/?
40616/?
41128/?
41639/?
42203/?
42714/?
43225/?
43736/?
43864/?
44376/?
45879/?
45944/?
[INFO] [compiler:compile {execution: default-compile}]
[INFO] Compiling 54 source files to <http://hudson.zones.apache.org/hudson/job/HBase-Patch/ws/trunk/contrib/stargate/target/classes>
[INFO] [resources:testResources {execution: default-testResources}]
[INFO] Using 'UTF-8' encoding to copy filtered resources.
[INFO] skip non existing resourceDirectory <http://hudson.zones.apache.org/hudson/job/HBase-Patch/ws/trunk/contrib/stargate/src/test/resources>
[INFO] [compiler:testCompile {execution: default-testCompile}]
[INFO] Compiling 24 source files to <http://hudson.zones.apache.org/hudson/job/HBase-Patch/ws/trunk/contrib/stargate/target/test-classes>
[INFO] [surefire:test {execution: default-test}]
[INFO] Surefire report directory: <http://hudson.zones.apache.org/hudson/job/HBase-Patch/ws/trunk/contrib/stargate/target/surefire-reports>
-------------------------------------------------------
T E S T S
-------------------------------------------------------
Running org.apache.hadoop.hbase.stargate.model.TestScannerModel
Tests run: 3, Failures: 0, Errors: 0, Skipped: 0, Time elapsed: 0.467 sec
Running org.apache.hadoop.hbase.stargate.model.TestTableSchemaModel
Tests run: 3, Failures: 0, Errors: 0, Skipped: 0, Time elapsed: 0.038 sec
Running org.apache.hadoop.hbase.stargate.model.TestStorageClusterVersionModel
Tests run: 2, Failures: 0, Errors: 0, Skipped: 0, Time elapsed: 0.012 sec
Running org.apache.hadoop.hbase.stargate.TestRowResource
Tests run: 8, Failures: 0, Errors: 0, Skipped: 0, Time elapsed: 15.99 sec
Running org.apache.hadoop.hbase.stargate.model.TestTableInfoModel
Tests run: 3, Failures: 0, Errors: 0, Skipped: 0, Time elapsed: 0.028 sec
Running org.apache.hadoop.hbase.stargate.TestStatusResource
Tests run: 2, Failures: 0, Errors: 0, Skipped: 0, Time elapsed: 0.094 sec
Running org.apache.hadoop.hbase.stargate.auth.TestHTableAuthenticator
Tests run: 4, Failures: 0, Errors: 0, Skipped: 0, Time elapsed: 5.3 sec
Running org.apache.hadoop.hbase.stargate.TestSchemaResource
Tests run: 2, Failures: 0, Errors: 0, Skipped: 0, Time elapsed: 20.772 sec
Running org.apache.hadoop.hbase.stargate.auth.TestJDBCAuthenticator
Tests run: 4, Failures: 0, Errors: 0, Skipped: 0, Time elapsed: 0.123 sec
Running org.apache.hadoop.hbase.stargate.auth.TestZooKeeperAuthenticator
Tests run: 4, Failures: 0, Errors: 0, Skipped: 0, Time elapsed: 0.401 sec
Running org.apache.hadoop.hbase.stargate.Test00MiniCluster
Tests run: 4, Failures: 0, Errors: 0, Skipped: 0, Time elapsed: 0.003 sec
Running org.apache.hadoop.hbase.stargate.TestVersionResource
Tests run: 7, Failures: 0, Errors: 0, Skipped: 0, Time elapsed: 0.069 sec
Running org.apache.hadoop.hbase.stargate.model.TestTableListModel
Tests run: 3, Failures: 0, Errors: 0, Skipped: 0, Time elapsed: 0.015 sec
Running org.apache.hadoop.hbase.stargate.model.TestVersionModel
Tests run: 3, Failures: 0, Errors: 0, Skipped: 0, Time elapsed: 0.015 sec
Running org.apache.hadoop.hbase.stargate.auth.TestHBCAuthenticator
Tests run: 4, Failures: 0, Errors: 0, Skipped: 0, Time elapsed: 0.016 sec
Running org.apache.hadoop.hbase.stargate.model.TestStorageClusterStatusModel
Tests run: 3, Failures: 0, Errors: 0, Skipped: 0, Time elapsed: 0.059 sec
Running org.apache.hadoop.hbase.stargate.model.TestCellModel
Tests run: 3, Failures: 0, Errors: 0, Skipped: 0, Time elapsed: 0.012 sec
Running org.apache.hadoop.hbase.stargate.TestScannerResource
Tests run: 4, Failures: 0, Errors: 0, Skipped: 0, Time elapsed: 21.11 sec
Running org.apache.hadoop.hbase.stargate.model.TestCellSetModel
Tests run: 3, Failures: 0, Errors: 0, Skipped: 0, Time elapsed: 0.02 sec
Running org.apache.hadoop.hbase.stargate.model.TestTableRegionModel
Tests run: 2, Failures: 0, Errors: 0, Skipped: 0, Time elapsed: 0.011 sec
Running org.apache.hadoop.hbase.stargate.model.TestColumnSchemaModel
Tests run: 2, Failures: 0, Errors: 0, Skipped: 0, Time elapsed: 0.005 sec
Running org.apache.hadoop.hbase.stargate.model.TestRowModel
Tests run: 2, Failures: 0, Errors: 0, Skipped: 0, Time elapsed: 0.013 sec
Running org.apache.hadoop.hbase.stargate.TestTableResource
Tests run: 4, Failures: 0, Errors: 0, Skipped: 0, Time elapsed: 5.43 sec
Results :
Tests run: 79, Failures: 0, Errors: 0, Skipped: 0
[INFO] [war:war {execution: default-war}]
[INFO] Packaging webapp
[INFO] Assembling webapp[hbase-contrib-stargate] in [<http://hudson.zones.apache.org/hudson/job/HBase-Patch/ws/trunk/contrib/stargate/target/hbase-contrib-stargate-0.21.0-SNAPSHOT]>
[INFO] Processing war project
[INFO] Webapp assembled in[316 msecs]
[INFO] Building war: <http://hudson.zones.apache.org/hudson/job/HBase-Patch/ws/trunk/contrib/stargate/target/hbase-contrib-stargate-0.21.0-SNAPSHOT.war>
[INFO] [install:install {execution: default-install}]
[INFO] Installing <http://hudson.zones.apache.org/hudson/job/HBase-Patch/ws/trunk/contrib/stargate/target/hbase-contrib-stargate-0.21.0-SNAPSHOT.war> to /home/hudson/.m2/repository/org/apache/hbase/hbase-contrib-stargate/0.21.0-SNAPSHOT/hbase-contrib-stargate-0.21.0-SNAPSHOT.war
[INFO] ------------------------------------------------------------------------
[INFO] Building HBase Contrib - Transactional
[INFO] task-segment: [clean, install]
[INFO] ------------------------------------------------------------------------
[INFO] [clean:clean {execution: default-clean}]
[INFO] Deleting directory <http://hudson.zones.apache.org/hudson/job/HBase-Patch/ws/trunk/contrib/transactional/target>
[INFO] [resources:resources {execution: default-resources}]
[INFO] Using 'UTF-8' encoding to copy filtered resources.
[INFO] skip non existing resourceDirectory <http://hudson.zones.apache.org/hudson/job/HBase-Patch/ws/trunk/contrib/transactional/src/main/resources>
[INFO] [compiler:compile {execution: default-compile}]
[INFO] Compiling 31 source files to <http://hudson.zones.apache.org/hudson/job/HBase-Patch/ws/trunk/contrib/transactional/target/classes>
[WARNING] <http://hudson.zones.apache.org/hudson/job/HBase-Patch/ws/trunk/contrib/transactional/src/main/java/org/apache/hadoop/hbase/client/transactional/HBaseBackedTransactionLogger.java>:[56,38] [deprecation] HBaseConfiguration() in org.apache.hadoop.hbase.HBaseConfiguration has been deprecated
[WARNING] <http://hudson.zones.apache.org/hudson/job/HBase-Patch/ws/trunk/contrib/transactional/src/main/java/org/apache/hadoop/hbase/client/transactional/HBaseBackedTransactionLogger.java>:[68,38] [deprecation] HBaseConfiguration() in org.apache.hadoop.hbase.HBaseConfiguration has been deprecated
[WARNING] <http://hudson.zones.apache.org/hudson/job/HBase-Patch/ws/trunk/contrib/transactional/src/main/java/org/apache/hadoop/hbase/client/tableindexed/IndexSpecification.java>:[154,49] [deprecation] HBaseConfiguration() in org.apache.hadoop.hbase.HBaseConfiguration has been deprecated
[INFO] [resources:testResources {execution: default-testResources}]
[INFO] Using 'UTF-8' encoding to copy filtered resources.
[INFO] skip non existing resourceDirectory <http://hudson.zones.apache.org/hudson/job/HBase-Patch/ws/trunk/contrib/transactional/src/test/resources>
[INFO] [compiler:testCompile {execution: default-testCompile}]
[INFO] Compiling 7 source files to <http://hudson.zones.apache.org/hudson/job/HBase-Patch/ws/trunk/contrib/transactional/target/test-classes>
[WARNING] <http://hudson.zones.apache.org/hudson/job/HBase-Patch/ws/trunk/contrib/transactional/src/test/java/org/apache/hadoop/hbase/client/tableindexed/TestIndexedTable.java>:[29,30] [deprecation] org.apache.hadoop.hbase.HBaseClusterTestCase in org.apache.hadoop.hbase has been deprecated
[WARNING] <http://hudson.zones.apache.org/hudson/job/HBase-Patch/ws/trunk/contrib/transactional/src/test/java/org/apache/hadoop/hbase/client/tableindexed/TestIndexedTable.java>:[43,38] [deprecation] org.apache.hadoop.hbase.HBaseClusterTestCase in org.apache.hadoop.hbase has been deprecated
[WARNING] <http://hudson.zones.apache.org/hudson/job/HBase-Patch/ws/trunk/contrib/transactional/src/test/java/org/apache/hadoop/hbase/client/transactional/TestTransactions.java>:[26,30] [deprecation] org.apache.hadoop.hbase.HBaseClusterTestCase in org.apache.hadoop.hbase has been deprecated
[WARNING] <http://hudson.zones.apache.org/hudson/job/HBase-Patch/ws/trunk/contrib/transactional/src/test/java/org/apache/hadoop/hbase/client/transactional/TestTransactions.java>:[44,38] [deprecation] org.apache.hadoop.hbase.HBaseClusterTestCase in org.apache.hadoop.hbase has been deprecated
[WARNING] <http://hudson.zones.apache.org/hudson/job/HBase-Patch/ws/trunk/contrib/transactional/src/test/java/org/apache/hadoop/hbase/regionserver/transactional/TestTHLogRecovery.java>:[30,30] [deprecation] org.apache.hadoop.hbase.HBaseClusterTestCase in org.apache.hadoop.hbase has been deprecated
[WARNING] <http://hudson.zones.apache.org/hudson/job/HBase-Patch/ws/trunk/contrib/transactional/src/test/java/org/apache/hadoop/hbase/regionserver/transactional/TestTHLogRecovery.java>:[51,39] [deprecation] org.apache.hadoop.hbase.HBaseClusterTestCase in org.apache.hadoop.hbase has been deprecated
[WARNING] <http://hudson.zones.apache.org/hudson/job/HBase-Patch/ws/trunk/contrib/transactional/src/test/java/org/apache/hadoop/hbase/client/transactional/StressTestTransactions.java>:[32,30] [deprecation] org.apache.hadoop.hbase.HBaseClusterTestCase in org.apache.hadoop.hbase has been deprecated
[WARNING] <http://hudson.zones.apache.org/hudson/job/HBase-Patch/ws/trunk/contrib/transactional/src/test/java/org/apache/hadoop/hbase/client/transactional/StressTestTransactions.java>:[53,44] [deprecation] org.apache.hadoop.hbase.HBaseClusterTestCase in org.apache.hadoop.hbase has been deprecated
[WARNING] <http://hudson.zones.apache.org/hudson/job/HBase-Patch/ws/trunk/contrib/transactional/src/test/java/org/apache/hadoop/hbase/regionserver/transactional/TestTHLog.java>:[27,30] [deprecation] org.apache.hadoop.hbase.HBaseTestCase in org.apache.hadoop.hbase has been deprecated
[WARNING] <http://hudson.zones.apache.org/hudson/job/HBase-Patch/ws/trunk/contrib/transactional/src/test/java/org/apache/hadoop/hbase/regionserver/transactional/TestTHLog.java>:[37,31] [deprecation] org.apache.hadoop.hbase.HBaseTestCase in org.apache.hadoop.hbase has been deprecated
[INFO] [surefire:test {execution: default-test}]
[INFO] Surefire report directory: <http://hudson.zones.apache.org/hudson/job/HBase-Patch/ws/trunk/contrib/transactional/target/surefire-reports>
-------------------------------------------------------
T E S T S
-------------------------------------------------------
Running org.apache.hadoop.hbase.client.tableindexed.TestIndexedTable
Tests run: 7, Failures: 0, Errors: 7, Skipped: 0, Time elapsed: 4.372 sec <<< FAILURE!
Running org.apache.hadoop.hbase.regionserver.transactional.TestTHLog
Tests run: 5, Failures: 0, Errors: 5, Skipped: 0, Time elapsed: 1.608 sec <<< FAILURE!
Running org.apache.hadoop.hbase.client.transactional.TestTransactions
Tests run: 7, Failures: 0, Errors: 7, Skipped: 0, Time elapsed: 2.319 sec <<< FAILURE!
Running org.apache.hadoop.hbase.regionserver.transactional.TestTHLogRecovery
Tests run: 2, Failures: 0, Errors: 0, Skipped: 0, Time elapsed: 514.135 sec
Results :
Tests in error:
testInitialWrites(org.apache.hadoop.hbase.client.tableindexed.TestIndexedTable)
testMultipleWrites(org.apache.hadoop.hbase.client.tableindexed.TestIndexedTable)
testDelete(org.apache.hadoop.hbase.client.tableindexed.TestIndexedTable)
testRowUpdate(org.apache.hadoop.hbase.client.tableindexed.TestIndexedTable)
testLockedRowUpdate(org.apache.hadoop.hbase.client.tableindexed.TestIndexedTable)
testLockedRowUpdateNoAutoFlush(org.apache.hadoop.hbase.client.tableindexed.TestIndexedTable)
testLockedRowDelete(org.apache.hadoop.hbase.client.tableindexed.TestIndexedTable)
testSingleCommit(org.apache.hadoop.hbase.regionserver.transactional.TestTHLog)
testSingleAbort(org.apache.hadoop.hbase.regionserver.transactional.TestTHLog)
testInterlievedCommits(org.apache.hadoop.hbase.regionserver.transactional.TestTHLog)
testInterlievedAbortCommit(org.apache.hadoop.hbase.regionserver.transactional.TestTHLog)
testInterlievedCommitAbort(org.apache.hadoop.hbase.regionserver.transactional.TestTHLog)
testSimpleTransaction(org.apache.hadoop.hbase.client.transactional.TestTransactions)
testTwoTransactionsWithoutConflict(org.apache.hadoop.hbase.client.transactional.TestTransactions)
testTwoTransactionsWithConflict(org.apache.hadoop.hbase.client.transactional.TestTransactions)
testGetAfterPut(org.apache.hadoop.hbase.client.transactional.TestTransactions)
testScanAfterUpdatePut(org.apache.hadoop.hbase.client.transactional.TestTransactions)
testScanAfterNewPut(org.apache.hadoop.hbase.client.transactional.TestTransactions)
testPutPutScan(org.apache.hadoop.hbase.client.transactional.TestTransactions)
Tests run: 21, Failures: 0, Errors: 19, Skipped: 0
[INFO] ------------------------------------------------------------------------
[ERROR] BUILD FAILURE
[INFO] ------------------------------------------------------------------------
[INFO] There are test failures.
Please refer to <http://hudson.zones.apache.org/hudson/job/HBase-Patch/ws/trunk/contrib/transactional/target/surefire-reports> for the individual test results.
[INFO] ------------------------------------------------------------------------
[INFO] For more information, run Maven with the -e switch
[INFO] ------------------------------------------------------------------------
[INFO] Total time: 42 minutes 34 seconds
[INFO] Finished at: Fri Feb 26 04:33:24 UTC 2010
[INFO] Final Memory: 71M/136M
[INFO] ------------------------------------------------------------------------
[locks-and-latches] Releasing all the locks
[locks-and-latches] All the locks released
Archiving artifacts
Recording test results
Build failed in Hudson: HBase-Patch #1130
Posted by Apache Hudson Server <hu...@hudson.zones.apache.org>.
See <http://hudson.zones.apache.org/hudson/job/HBase-Patch/1130/changes>
Changes:
[jdcryans] Reverting HBASE-2077 redux
------------------------------------------
[...truncated 989 lines...]
Tests run: 14, Failures: 0, Errors: 0, Skipped: 0, Time elapsed: 2.93 sec
Running org.apache.hadoop.hbase.regionserver.TestWideScanner
Tests run: 1, Failures: 0, Errors: 0, Skipped: 0, Time elapsed: 28.305 sec
Running org.apache.hadoop.hbase.regionserver.wal.TestHLog
Tests run: 4, Failures: 0, Errors: 0, Skipped: 0, Time elapsed: 47.533 sec
Running org.apache.hadoop.hbase.client.TestTimestamp
Tests run: 1, Failures: 0, Errors: 0, Skipped: 0, Time elapsed: 17.629 sec
Running org.apache.hadoop.hbase.TestScanMultipleVersions
Tests run: 1, Failures: 0, Errors: 0, Skipped: 0, Time elapsed: 35.597 sec
Running org.apache.hadoop.hbase.TestMergeTable
Tests run: 1, Failures: 0, Errors: 0, Skipped: 0, Time elapsed: 60.505 sec
Running org.apache.hadoop.hbase.regionserver.TestGetClosestAtOrBefore
Tests run: 3, Failures: 0, Errors: 0, Skipped: 0, Time elapsed: 6.751 sec
Results :
Tests run: 314, Failures: 0, Errors: 0, Skipped: 4
[INFO] [jar:jar {execution: default-jar}]
[INFO] Building jar: <http://hudson.zones.apache.org/hudson/job/HBase-Patch/ws/trunk/core/target/hbase-core-0.21.0-SNAPSHOT.jar>
[INFO] [jar:test-jar {execution: default}]
[INFO] Building jar: <http://hudson.zones.apache.org/hudson/job/HBase-Patch/ws/trunk/core/target/hbase-core-0.21.0-SNAPSHOT-tests.jar>
[INFO] [source:jar-no-fork {execution: attach-sources}]
[INFO] Building jar: <http://hudson.zones.apache.org/hudson/job/HBase-Patch/ws/trunk/core/target/hbase-core-0.21.0-SNAPSHOT-sources.jar>
[INFO] [install:install {execution: default-install}]
[INFO] Installing <http://hudson.zones.apache.org/hudson/job/HBase-Patch/ws/trunk/core/target/hbase-core-0.21.0-SNAPSHOT.jar> to /home/hudson/.m2/repository/org/apache/hbase/hbase-core/0.21.0-SNAPSHOT/hbase-core-0.21.0-SNAPSHOT.jar
[INFO] Installing <http://hudson.zones.apache.org/hudson/job/HBase-Patch/ws/trunk/core/target/hbase-core-0.21.0-SNAPSHOT-tests.jar> to /home/hudson/.m2/repository/org/apache/hbase/hbase-core/0.21.0-SNAPSHOT/hbase-core-0.21.0-SNAPSHOT-tests.jar
[INFO] Installing <http://hudson.zones.apache.org/hudson/job/HBase-Patch/ws/trunk/core/target/hbase-core-0.21.0-SNAPSHOT-sources.jar> to /home/hudson/.m2/repository/org/apache/hbase/hbase-core/0.21.0-SNAPSHOT/hbase-core-0.21.0-SNAPSHOT-sources.jar
[INFO] ------------------------------------------------------------------------
[INFO] Building HBase Contrib
[INFO] task-segment: [clean, install]
[INFO] ------------------------------------------------------------------------
[INFO] [clean:clean {execution: default-clean}]
[INFO] [site:attach-descriptor {execution: default-attach-descriptor}]
[INFO] [install:install {execution: default-install}]
[INFO] Installing <http://hudson.zones.apache.org/hudson/job/HBase-Patch/ws/trunk/contrib/pom.xml> to /home/hudson/.m2/repository/org/apache/hbase/hbase-contrib/0.21.0-SNAPSHOT/hbase-contrib-0.21.0-SNAPSHOT.pom
[INFO] ------------------------------------------------------------------------
[INFO] Building HBase Contrib - Multi Datacenter Replication
[INFO] task-segment: [clean, install]
[INFO] ------------------------------------------------------------------------
[INFO] [clean:clean {execution: default-clean}]
[INFO] Deleting directory <http://hudson.zones.apache.org/hudson/job/HBase-Patch/ws/trunk/contrib/mdc_replication/target>
[INFO] [resources:resources {execution: default-resources}]
[INFO] Using 'UTF-8' encoding to copy filtered resources.
[INFO] skip non existing resourceDirectory <http://hudson.zones.apache.org/hudson/job/HBase-Patch/ws/trunk/contrib/mdc_replication/src/main/resources>
[INFO] [compiler:compile {execution: default-compile}]
[INFO] Compiling 8 source files to <http://hudson.zones.apache.org/hudson/job/HBase-Patch/ws/trunk/contrib/mdc_replication/target/classes>
[INFO] [resources:testResources {execution: default-testResources}]
[INFO] Using 'UTF-8' encoding to copy filtered resources.
[INFO] skip non existing resourceDirectory <http://hudson.zones.apache.org/hudson/job/HBase-Patch/ws/trunk/contrib/mdc_replication/src/test/resources>
[INFO] [compiler:testCompile {execution: default-testCompile}]
[INFO] Compiling 2 source files to <http://hudson.zones.apache.org/hudson/job/HBase-Patch/ws/trunk/contrib/mdc_replication/target/test-classes>
[INFO] [surefire:test {execution: default-test}]
[INFO] Surefire report directory: <http://hudson.zones.apache.org/hudson/job/HBase-Patch/ws/trunk/contrib/mdc_replication/target/surefire-reports>
-------------------------------------------------------
T E S T S
-------------------------------------------------------
Running org.apache.hadoop.hbase.replication.TestReplication
Tests run: 2, Failures: 0, Errors: 0, Skipped: 0, Time elapsed: 60.923 sec
Running org.apache.hadoop.hbase.regionserver.replication.TestReplicationSink
Tests run: 5, Failures: 0, Errors: 0, Skipped: 0, Time elapsed: 31.489 sec
Results :
Tests run: 7, Failures: 0, Errors: 0, Skipped: 0
[INFO] [jar:jar {execution: default-jar}]
[INFO] Building jar: <http://hudson.zones.apache.org/hudson/job/HBase-Patch/ws/trunk/contrib/mdc_replication/target/hbase-contrib-mdc_replication-0.21.0-SNAPSHOT.jar>
[INFO] [install:install {execution: default-install}]
[INFO] Installing <http://hudson.zones.apache.org/hudson/job/HBase-Patch/ws/trunk/contrib/mdc_replication/target/hbase-contrib-mdc_replication-0.21.0-SNAPSHOT.jar> to /home/hudson/.m2/repository/org/apache/hbase/hbase-contrib-mdc_replication/0.21.0-SNAPSHOT/hbase-contrib-mdc_replication-0.21.0-SNAPSHOT.jar
[INFO] ------------------------------------------------------------------------
[INFO] Building HBase Contrib - Stargate
[INFO] task-segment: [clean, install]
[INFO] ------------------------------------------------------------------------
[INFO] [clean:clean {execution: default-clean}]
[INFO] Deleting directory <http://hudson.zones.apache.org/hudson/job/HBase-Patch/ws/trunk/contrib/stargate/target>
[INFO] [resources:resources {execution: default-resources}]
[INFO] Using 'UTF-8' encoding to copy filtered resources.
[INFO] Copying 10 resources
[INFO] [compiler:compile {execution: default-compile}]
[INFO] Compiling 53 source files to <http://hudson.zones.apache.org/hudson/job/HBase-Patch/ws/trunk/contrib/stargate/target/classes>
[INFO] [resources:testResources {execution: default-testResources}]
[INFO] Using 'UTF-8' encoding to copy filtered resources.
[INFO] skip non existing resourceDirectory <http://hudson.zones.apache.org/hudson/job/HBase-Patch/ws/trunk/contrib/stargate/src/test/resources>
[INFO] [compiler:testCompile {execution: default-testCompile}]
[INFO] Compiling 23 source files to <http://hudson.zones.apache.org/hudson/job/HBase-Patch/ws/trunk/contrib/stargate/target/test-classes>
[INFO] [surefire:test {execution: default-test}]
[INFO] Surefire report directory: <http://hudson.zones.apache.org/hudson/job/HBase-Patch/ws/trunk/contrib/stargate/target/surefire-reports>
-------------------------------------------------------
T E S T S
-------------------------------------------------------
Running org.apache.hadoop.hbase.stargate.model.TestScannerModel
Tests run: 3, Failures: 0, Errors: 0, Skipped: 0, Time elapsed: 0.496 sec
Running org.apache.hadoop.hbase.stargate.model.TestTableSchemaModel
Tests run: 3, Failures: 0, Errors: 0, Skipped: 0, Time elapsed: 0.038 sec
Running org.apache.hadoop.hbase.stargate.model.TestStorageClusterVersionModel
Tests run: 2, Failures: 0, Errors: 0, Skipped: 0, Time elapsed: 0.012 sec
Running org.apache.hadoop.hbase.stargate.TestRowResource
Tests run: 8, Failures: 0, Errors: 0, Skipped: 0, Time elapsed: 15.918 sec
Running org.apache.hadoop.hbase.stargate.model.TestTableInfoModel
Tests run: 3, Failures: 0, Errors: 0, Skipped: 0, Time elapsed: 0.027 sec
Running org.apache.hadoop.hbase.stargate.TestStatusResource
Tests run: 2, Failures: 0, Errors: 0, Skipped: 0, Time elapsed: 0.058 sec
Running org.apache.hadoop.hbase.stargate.auth.TestHTableAuthenticator
Tests run: 4, Failures: 0, Errors: 0, Skipped: 0, Time elapsed: 5.27 sec
Running org.apache.hadoop.hbase.stargate.TestSchemaResource
Tests run: 2, Failures: 0, Errors: 0, Skipped: 0, Time elapsed: 20.868 sec
Running org.apache.hadoop.hbase.stargate.auth.TestJDBCAuthenticator
Tests run: 4, Failures: 0, Errors: 0, Skipped: 0, Time elapsed: 0.161 sec
Running org.apache.hadoop.hbase.stargate.Test00MiniCluster
Tests run: 4, Failures: 0, Errors: 0, Skipped: 0, Time elapsed: 0.007 sec
Running org.apache.hadoop.hbase.stargate.TestVersionResource
Tests run: 7, Failures: 0, Errors: 0, Skipped: 0, Time elapsed: 0.161 sec
Running org.apache.hadoop.hbase.stargate.model.TestTableListModel
Tests run: 3, Failures: 0, Errors: 0, Skipped: 0, Time elapsed: 0.015 sec
Running org.apache.hadoop.hbase.stargate.model.TestVersionModel
Tests run: 3, Failures: 0, Errors: 0, Skipped: 0, Time elapsed: 0.015 sec
Running org.apache.hadoop.hbase.stargate.auth.TestHBCAuthenticator
Tests run: 4, Failures: 0, Errors: 0, Skipped: 0, Time elapsed: 0.015 sec
Running org.apache.hadoop.hbase.stargate.model.TestStorageClusterStatusModel
Tests run: 3, Failures: 0, Errors: 0, Skipped: 0, Time elapsed: 0.059 sec
Running org.apache.hadoop.hbase.stargate.model.TestCellModel
Tests run: 3, Failures: 0, Errors: 0, Skipped: 0, Time elapsed: 0.012 sec
Running org.apache.hadoop.hbase.stargate.TestScannerResource
Tests run: 4, Failures: 0, Errors: 0, Skipped: 0, Time elapsed: 22.162 sec
Running org.apache.hadoop.hbase.stargate.model.TestCellSetModel
Tests run: 3, Failures: 0, Errors: 0, Skipped: 0, Time elapsed: 0.02 sec
Running org.apache.hadoop.hbase.stargate.model.TestTableRegionModel
Tests run: 2, Failures: 0, Errors: 0, Skipped: 0, Time elapsed: 0.011 sec
Running org.apache.hadoop.hbase.stargate.model.TestColumnSchemaModel
Tests run: 2, Failures: 0, Errors: 0, Skipped: 0, Time elapsed: 0.006 sec
Running org.apache.hadoop.hbase.stargate.model.TestRowModel
Tests run: 2, Failures: 0, Errors: 0, Skipped: 0, Time elapsed: 0.017 sec
Running org.apache.hadoop.hbase.stargate.TestTableResource
Tests run: 4, Failures: 0, Errors: 0, Skipped: 0, Time elapsed: 5.408 sec
Results :
Tests run: 75, Failures: 0, Errors: 0, Skipped: 0
[INFO] [war:war {execution: default-war}]
[INFO] Packaging webapp
[INFO] Assembling webapp[hbase-contrib-stargate] in [<http://hudson.zones.apache.org/hudson/job/HBase-Patch/ws/trunk/contrib/stargate/target/hbase-contrib-stargate-0.21.0-SNAPSHOT]>
[INFO] Processing war project
[INFO] Webapp assembled in[671 msecs]
[INFO] Building war: <http://hudson.zones.apache.org/hudson/job/HBase-Patch/ws/trunk/contrib/stargate/target/hbase-contrib-stargate-0.21.0-SNAPSHOT.war>
[INFO] [install:install {execution: default-install}]
[INFO] Installing <http://hudson.zones.apache.org/hudson/job/HBase-Patch/ws/trunk/contrib/stargate/target/hbase-contrib-stargate-0.21.0-SNAPSHOT.war> to /home/hudson/.m2/repository/org/apache/hbase/hbase-contrib-stargate/0.21.0-SNAPSHOT/hbase-contrib-stargate-0.21.0-SNAPSHOT.war
[INFO] ------------------------------------------------------------------------
[INFO] Building HBase Contrib - Transactional
[INFO] task-segment: [clean, install]
[INFO] ------------------------------------------------------------------------
[INFO] [clean:clean {execution: default-clean}]
[INFO] Deleting directory <http://hudson.zones.apache.org/hudson/job/HBase-Patch/ws/trunk/contrib/transactional/target>
[INFO] [resources:resources {execution: default-resources}]
[INFO] Using 'UTF-8' encoding to copy filtered resources.
[INFO] skip non existing resourceDirectory <http://hudson.zones.apache.org/hudson/job/HBase-Patch/ws/trunk/contrib/transactional/src/main/resources>
[INFO] [compiler:compile {execution: default-compile}]
[INFO] Compiling 31 source files to <http://hudson.zones.apache.org/hudson/job/HBase-Patch/ws/trunk/contrib/transactional/target/classes>
[WARNING] <http://hudson.zones.apache.org/hudson/job/HBase-Patch/ws/trunk/contrib/transactional/src/main/java/org/apache/hadoop/hbase/client/transactional/HBaseBackedTransactionLogger.java>:[56,38] [deprecation] HBaseConfiguration() in org.apache.hadoop.hbase.HBaseConfiguration has been deprecated
[WARNING] <http://hudson.zones.apache.org/hudson/job/HBase-Patch/ws/trunk/contrib/transactional/src/main/java/org/apache/hadoop/hbase/client/transactional/HBaseBackedTransactionLogger.java>:[68,38] [deprecation] HBaseConfiguration() in org.apache.hadoop.hbase.HBaseConfiguration has been deprecated
[WARNING] <http://hudson.zones.apache.org/hudson/job/HBase-Patch/ws/trunk/contrib/transactional/src/main/java/org/apache/hadoop/hbase/client/tableindexed/IndexSpecification.java>:[154,49] [deprecation] HBaseConfiguration() in org.apache.hadoop.hbase.HBaseConfiguration has been deprecated
[INFO] [resources:testResources {execution: default-testResources}]
[INFO] Using 'UTF-8' encoding to copy filtered resources.
[INFO] skip non existing resourceDirectory <http://hudson.zones.apache.org/hudson/job/HBase-Patch/ws/trunk/contrib/transactional/src/test/resources>
[INFO] [compiler:testCompile {execution: default-testCompile}]
[INFO] Compiling 7 source files to <http://hudson.zones.apache.org/hudson/job/HBase-Patch/ws/trunk/contrib/transactional/target/test-classes>
[WARNING] <http://hudson.zones.apache.org/hudson/job/HBase-Patch/ws/trunk/contrib/transactional/src/test/java/org/apache/hadoop/hbase/client/tableindexed/TestIndexedTable.java>:[29,30] [deprecation] org.apache.hadoop.hbase.HBaseClusterTestCase in org.apache.hadoop.hbase has been deprecated
[WARNING] <http://hudson.zones.apache.org/hudson/job/HBase-Patch/ws/trunk/contrib/transactional/src/test/java/org/apache/hadoop/hbase/client/tableindexed/TestIndexedTable.java>:[43,38] [deprecation] org.apache.hadoop.hbase.HBaseClusterTestCase in org.apache.hadoop.hbase has been deprecated
[WARNING] <http://hudson.zones.apache.org/hudson/job/HBase-Patch/ws/trunk/contrib/transactional/src/test/java/org/apache/hadoop/hbase/client/transactional/TestTransactions.java>:[26,30] [deprecation] org.apache.hadoop.hbase.HBaseClusterTestCase in org.apache.hadoop.hbase has been deprecated
[WARNING] <http://hudson.zones.apache.org/hudson/job/HBase-Patch/ws/trunk/contrib/transactional/src/test/java/org/apache/hadoop/hbase/client/transactional/TestTransactions.java>:[44,38] [deprecation] org.apache.hadoop.hbase.HBaseClusterTestCase in org.apache.hadoop.hbase has been deprecated
[WARNING] <http://hudson.zones.apache.org/hudson/job/HBase-Patch/ws/trunk/contrib/transactional/src/test/java/org/apache/hadoop/hbase/regionserver/transactional/TestTHLogRecovery.java>:[30,30] [deprecation] org.apache.hadoop.hbase.HBaseClusterTestCase in org.apache.hadoop.hbase has been deprecated
[WARNING] <http://hudson.zones.apache.org/hudson/job/HBase-Patch/ws/trunk/contrib/transactional/src/test/java/org/apache/hadoop/hbase/regionserver/transactional/TestTHLogRecovery.java>:[51,39] [deprecation] org.apache.hadoop.hbase.HBaseClusterTestCase in org.apache.hadoop.hbase has been deprecated
[WARNING] <http://hudson.zones.apache.org/hudson/job/HBase-Patch/ws/trunk/contrib/transactional/src/test/java/org/apache/hadoop/hbase/client/transactional/StressTestTransactions.java>:[32,30] [deprecation] org.apache.hadoop.hbase.HBaseClusterTestCase in org.apache.hadoop.hbase has been deprecated
[WARNING] <http://hudson.zones.apache.org/hudson/job/HBase-Patch/ws/trunk/contrib/transactional/src/test/java/org/apache/hadoop/hbase/client/transactional/StressTestTransactions.java>:[53,44] [deprecation] org.apache.hadoop.hbase.HBaseClusterTestCase in org.apache.hadoop.hbase has been deprecated
[WARNING] <http://hudson.zones.apache.org/hudson/job/HBase-Patch/ws/trunk/contrib/transactional/src/test/java/org/apache/hadoop/hbase/regionserver/transactional/TestTHLog.java>:[27,30] [deprecation] org.apache.hadoop.hbase.HBaseTestCase in org.apache.hadoop.hbase has been deprecated
[WARNING] <http://hudson.zones.apache.org/hudson/job/HBase-Patch/ws/trunk/contrib/transactional/src/test/java/org/apache/hadoop/hbase/regionserver/transactional/TestTHLog.java>:[37,31] [deprecation] org.apache.hadoop.hbase.HBaseTestCase in org.apache.hadoop.hbase has been deprecated
[INFO] [surefire:test {execution: default-test}]
[INFO] Surefire report directory: <http://hudson.zones.apache.org/hudson/job/HBase-Patch/ws/trunk/contrib/transactional/target/surefire-reports>
-------------------------------------------------------
T E S T S
-------------------------------------------------------
Running org.apache.hadoop.hbase.client.tableindexed.TestIndexedTable
Tests run: 7, Failures: 0, Errors: 7, Skipped: 0, Time elapsed: 2.756 sec <<< FAILURE!
Running org.apache.hadoop.hbase.regionserver.transactional.TestTHLog
Tests run: 5, Failures: 0, Errors: 5, Skipped: 0, Time elapsed: 1.841 sec <<< FAILURE!
Running org.apache.hadoop.hbase.client.transactional.TestTransactions
Tests run: 7, Failures: 0, Errors: 7, Skipped: 0, Time elapsed: 2.056 sec <<< FAILURE!
Running org.apache.hadoop.hbase.regionserver.transactional.TestTHLogRecovery
Tests run: 2, Failures: 0, Errors: 0, Skipped: 0, Time elapsed: 505.368 sec
Results :
Tests in error:
testInitialWrites(org.apache.hadoop.hbase.client.tableindexed.TestIndexedTable)
testMultipleWrites(org.apache.hadoop.hbase.client.tableindexed.TestIndexedTable)
testDelete(org.apache.hadoop.hbase.client.tableindexed.TestIndexedTable)
testRowUpdate(org.apache.hadoop.hbase.client.tableindexed.TestIndexedTable)
testLockedRowUpdate(org.apache.hadoop.hbase.client.tableindexed.TestIndexedTable)
testLockedRowUpdateNoAutoFlush(org.apache.hadoop.hbase.client.tableindexed.TestIndexedTable)
testLockedRowDelete(org.apache.hadoop.hbase.client.tableindexed.TestIndexedTable)
testSingleCommit(org.apache.hadoop.hbase.regionserver.transactional.TestTHLog)
testSingleAbort(org.apache.hadoop.hbase.regionserver.transactional.TestTHLog)
testInterlievedCommits(org.apache.hadoop.hbase.regionserver.transactional.TestTHLog)
testInterlievedAbortCommit(org.apache.hadoop.hbase.regionserver.transactional.TestTHLog)
testInterlievedCommitAbort(org.apache.hadoop.hbase.regionserver.transactional.TestTHLog)
testSimpleTransaction(org.apache.hadoop.hbase.client.transactional.TestTransactions)
testTwoTransactionsWithoutConflict(org.apache.hadoop.hbase.client.transactional.TestTransactions)
testTwoTransactionsWithConflict(org.apache.hadoop.hbase.client.transactional.TestTransactions)
testGetAfterPut(org.apache.hadoop.hbase.client.transactional.TestTransactions)
testScanAfterUpdatePut(org.apache.hadoop.hbase.client.transactional.TestTransactions)
testScanAfterNewPut(org.apache.hadoop.hbase.client.transactional.TestTransactions)
testPutPutScan(org.apache.hadoop.hbase.client.transactional.TestTransactions)
Tests run: 21, Failures: 0, Errors: 19, Skipped: 0
[INFO] ------------------------------------------------------------------------
[ERROR] BUILD FAILURE
[INFO] ------------------------------------------------------------------------
[INFO] There are test failures.
Please refer to <http://hudson.zones.apache.org/hudson/job/HBase-Patch/ws/trunk/contrib/transactional/target/surefire-reports> for the individual test results.
[INFO] ------------------------------------------------------------------------
[INFO] For more information, run Maven with the -e switch
[INFO] ------------------------------------------------------------------------
[INFO] Total time: 41 minutes 51 seconds
[INFO] Finished at: Fri Feb 26 01:57:45 UTC 2010
[INFO] Final Memory: 71M/129M
[INFO] ------------------------------------------------------------------------
[locks-and-latches] Releasing all the locks
[locks-and-latches] All the locks released
Archiving artifacts
Recording test results
Build failed in Hudson: HBase-Patch #1129
Posted by Apache Hudson Server <hu...@hudson.zones.apache.org>.
See <http://hudson.zones.apache.org/hudson/job/HBase-Patch/1129/changes>
Changes:
[apurtell] HBASE-2268 [stargate] Failed tests and DEBUG output is dumped to console since move to Mavenized build
------------------------------------------
[...truncated 606 lines...]
Running org.apache.hadoop.hbase.filter.TestFilter
Tests run: 14, Failures: 0, Errors: 0, Skipped: 0, Time elapsed: 2.899 sec
Running org.apache.hadoop.hbase.regionserver.TestWideScanner
Tests run: 1, Failures: 0, Errors: 0, Skipped: 0, Time elapsed: 5.879 sec
Running org.apache.hadoop.hbase.regionserver.wal.TestHLog
Tests run: 4, Failures: 0, Errors: 0, Skipped: 0, Time elapsed: 19.36 sec
Running org.apache.hadoop.hbase.client.TestTimestamp
Tests run: 1, Failures: 0, Errors: 0, Skipped: 0, Time elapsed: 17.45 sec
Running org.apache.hadoop.hbase.TestScanMultipleVersions
Tests run: 1, Failures: 0, Errors: 0, Skipped: 0, Time elapsed: 26.909 sec
Running org.apache.hadoop.hbase.TestMergeTable
Tests run: 1, Failures: 0, Errors: 0, Skipped: 0, Time elapsed: 44.126 sec
Running org.apache.hadoop.hbase.regionserver.TestGetClosestAtOrBefore
Tests run: 3, Failures: 0, Errors: 0, Skipped: 0, Time elapsed: 6.676 sec
Results :
Tests run: 314, Failures: 0, Errors: 0, Skipped: 4
[INFO] [jar:jar {execution: default-jar}]
[INFO] Building jar: <http://hudson.zones.apache.org/hudson/job/HBase-Patch/ws/trunk/core/target/hbase-core-0.21.0-SNAPSHOT.jar>
[INFO] [jar:test-jar {execution: default}]
[INFO] Building jar: <http://hudson.zones.apache.org/hudson/job/HBase-Patch/ws/trunk/core/target/hbase-core-0.21.0-SNAPSHOT-tests.jar>
[INFO] [source:jar-no-fork {execution: attach-sources}]
[INFO] Building jar: <http://hudson.zones.apache.org/hudson/job/HBase-Patch/ws/trunk/core/target/hbase-core-0.21.0-SNAPSHOT-sources.jar>
[INFO] [install:install {execution: default-install}]
[INFO] Installing <http://hudson.zones.apache.org/hudson/job/HBase-Patch/ws/trunk/core/target/hbase-core-0.21.0-SNAPSHOT.jar> to /home/hudson/.m2/repository/org/apache/hbase/hbase-core/0.21.0-SNAPSHOT/hbase-core-0.21.0-SNAPSHOT.jar
[INFO] Installing <http://hudson.zones.apache.org/hudson/job/HBase-Patch/ws/trunk/core/target/hbase-core-0.21.0-SNAPSHOT-tests.jar> to /home/hudson/.m2/repository/org/apache/hbase/hbase-core/0.21.0-SNAPSHOT/hbase-core-0.21.0-SNAPSHOT-tests.jar
[INFO] Installing <http://hudson.zones.apache.org/hudson/job/HBase-Patch/ws/trunk/core/target/hbase-core-0.21.0-SNAPSHOT-sources.jar> to /home/hudson/.m2/repository/org/apache/hbase/hbase-core/0.21.0-SNAPSHOT/hbase-core-0.21.0-SNAPSHOT-sources.jar
[INFO] ------------------------------------------------------------------------
[INFO] Building HBase Contrib
[INFO] task-segment: [clean, install]
[INFO] ------------------------------------------------------------------------
[INFO] [clean:clean {execution: default-clean}]
[INFO] [site:attach-descriptor {execution: default-attach-descriptor}]
[INFO] [install:install {execution: default-install}]
[INFO] Installing <http://hudson.zones.apache.org/hudson/job/HBase-Patch/ws/trunk/contrib/pom.xml> to /home/hudson/.m2/repository/org/apache/hbase/hbase-contrib/0.21.0-SNAPSHOT/hbase-contrib-0.21.0-SNAPSHOT.pom
[INFO] ------------------------------------------------------------------------
[INFO] Building HBase Contrib - Multi Datacenter Replication
[INFO] task-segment: [clean, install]
[INFO] ------------------------------------------------------------------------
[INFO] [clean:clean {execution: default-clean}]
[INFO] Deleting directory <http://hudson.zones.apache.org/hudson/job/HBase-Patch/ws/trunk/contrib/mdc_replication/target>
[INFO] [resources:resources {execution: default-resources}]
[INFO] Using 'UTF-8' encoding to copy filtered resources.
[INFO] skip non existing resourceDirectory <http://hudson.zones.apache.org/hudson/job/HBase-Patch/ws/trunk/contrib/mdc_replication/src/main/resources>
[INFO] [compiler:compile {execution: default-compile}]
[INFO] Compiling 8 source files to <http://hudson.zones.apache.org/hudson/job/HBase-Patch/ws/trunk/contrib/mdc_replication/target/classes>
[INFO] [resources:testResources {execution: default-testResources}]
[INFO] Using 'UTF-8' encoding to copy filtered resources.
[INFO] skip non existing resourceDirectory <http://hudson.zones.apache.org/hudson/job/HBase-Patch/ws/trunk/contrib/mdc_replication/src/test/resources>
[INFO] [compiler:testCompile {execution: default-testCompile}]
[INFO] Compiling 2 source files to <http://hudson.zones.apache.org/hudson/job/HBase-Patch/ws/trunk/contrib/mdc_replication/target/test-classes>
[INFO] [surefire:test {execution: default-test}]
[INFO] Surefire report directory: <http://hudson.zones.apache.org/hudson/job/HBase-Patch/ws/trunk/contrib/mdc_replication/target/surefire-reports>
-------------------------------------------------------
T E S T S
-------------------------------------------------------
Running org.apache.hadoop.hbase.replication.TestReplication
Tests run: 2, Failures: 0, Errors: 0, Skipped: 0, Time elapsed: 60.308 sec
Running org.apache.hadoop.hbase.regionserver.replication.TestReplicationSink
Tests run: 5, Failures: 0, Errors: 0, Skipped: 0, Time elapsed: 31.996 sec
Results :
Tests run: 7, Failures: 0, Errors: 0, Skipped: 0
[INFO] [jar:jar {execution: default-jar}]
[INFO] Building jar: <http://hudson.zones.apache.org/hudson/job/HBase-Patch/ws/trunk/contrib/mdc_replication/target/hbase-contrib-mdc_replication-0.21.0-SNAPSHOT.jar>
[INFO] [install:install {execution: default-install}]
[INFO] Installing <http://hudson.zones.apache.org/hudson/job/HBase-Patch/ws/trunk/contrib/mdc_replication/target/hbase-contrib-mdc_replication-0.21.0-SNAPSHOT.jar> to /home/hudson/.m2/repository/org/apache/hbase/hbase-contrib-mdc_replication/0.21.0-SNAPSHOT/hbase-contrib-mdc_replication-0.21.0-SNAPSHOT.jar
[INFO] ------------------------------------------------------------------------
[INFO] Building HBase Contrib - Stargate
[INFO] task-segment: [clean, install]
[INFO] ------------------------------------------------------------------------
[INFO] [clean:clean {execution: default-clean}]
[INFO] Deleting directory <http://hudson.zones.apache.org/hudson/job/HBase-Patch/ws/trunk/contrib/stargate/target>
[INFO] [resources:resources {execution: default-resources}]
[INFO] Using 'UTF-8' encoding to copy filtered resources.
[INFO] Copying 10 resources
[INFO] [compiler:compile {execution: default-compile}]
[INFO] Compiling 53 source files to <http://hudson.zones.apache.org/hudson/job/HBase-Patch/ws/trunk/contrib/stargate/target/classes>
[INFO] [resources:testResources {execution: default-testResources}]
[INFO] Using 'UTF-8' encoding to copy filtered resources.
[INFO] skip non existing resourceDirectory <http://hudson.zones.apache.org/hudson/job/HBase-Patch/ws/trunk/contrib/stargate/src/test/resources>
[INFO] [compiler:testCompile {execution: default-testCompile}]
[INFO] Compiling 23 source files to <http://hudson.zones.apache.org/hudson/job/HBase-Patch/ws/trunk/contrib/stargate/target/test-classes>
[INFO] [surefire:test {execution: default-test}]
[INFO] Surefire report directory: <http://hudson.zones.apache.org/hudson/job/HBase-Patch/ws/trunk/contrib/stargate/target/surefire-reports>
-------------------------------------------------------
T E S T S
-------------------------------------------------------
Running org.apache.hadoop.hbase.stargate.model.TestScannerModel
Tests run: 3, Failures: 0, Errors: 0, Skipped: 0, Time elapsed: 0.511 sec
Running org.apache.hadoop.hbase.stargate.model.TestTableSchemaModel
Tests run: 3, Failures: 0, Errors: 0, Skipped: 0, Time elapsed: 0.039 sec
Running org.apache.hadoop.hbase.stargate.model.TestStorageClusterVersionModel
Tests run: 2, Failures: 0, Errors: 0, Skipped: 0, Time elapsed: 0.013 sec
Running org.apache.hadoop.hbase.stargate.TestRowResource
Tests run: 8, Failures: 0, Errors: 0, Skipped: 0, Time elapsed: 20.59 sec
Running org.apache.hadoop.hbase.stargate.model.TestTableInfoModel
Tests run: 3, Failures: 0, Errors: 0, Skipped: 0, Time elapsed: 0.027 sec
Running org.apache.hadoop.hbase.stargate.TestStatusResource
Tests run: 2, Failures: 0, Errors: 0, Skipped: 0, Time elapsed: 0.059 sec
Running org.apache.hadoop.hbase.stargate.auth.TestHTableAuthenticator
Tests run: 4, Failures: 0, Errors: 0, Skipped: 0, Time elapsed: 5.313 sec
Running org.apache.hadoop.hbase.stargate.TestSchemaResource
Tests run: 2, Failures: 0, Errors: 0, Skipped: 0, Time elapsed: 20.948 sec
Running org.apache.hadoop.hbase.stargate.auth.TestJDBCAuthenticator
Tests run: 4, Failures: 0, Errors: 0, Skipped: 0, Time elapsed: 0.146 sec
Running org.apache.hadoop.hbase.stargate.Test00MiniCluster
Tests run: 4, Failures: 0, Errors: 0, Skipped: 0, Time elapsed: 0.004 sec
Running org.apache.hadoop.hbase.stargate.TestVersionResource
Tests run: 7, Failures: 0, Errors: 0, Skipped: 0, Time elapsed: 0.07 sec
Running org.apache.hadoop.hbase.stargate.model.TestTableListModel
Tests run: 3, Failures: 0, Errors: 0, Skipped: 0, Time elapsed: 0.014 sec
Running org.apache.hadoop.hbase.stargate.model.TestVersionModel
Tests run: 3, Failures: 0, Errors: 0, Skipped: 0, Time elapsed: 0.015 sec
Running org.apache.hadoop.hbase.stargate.auth.TestHBCAuthenticator
Tests run: 4, Failures: 0, Errors: 0, Skipped: 0, Time elapsed: 0.014 sec
Running org.apache.hadoop.hbase.stargate.model.TestStorageClusterStatusModel
Tests run: 3, Failures: 0, Errors: 0, Skipped: 0, Time elapsed: 0.059 sec
Running org.apache.hadoop.hbase.stargate.model.TestCellModel
Tests run: 3, Failures: 0, Errors: 0, Skipped: 0, Time elapsed: 0.012 sec
Running org.apache.hadoop.hbase.stargate.TestScannerResource
Tests run: 4, Failures: 0, Errors: 0, Skipped: 0, Time elapsed: 22.402 sec
Running org.apache.hadoop.hbase.stargate.model.TestCellSetModel
Tests run: 3, Failures: 0, Errors: 0, Skipped: 0, Time elapsed: 0.02 sec
Running org.apache.hadoop.hbase.stargate.model.TestTableRegionModel
Tests run: 2, Failures: 0, Errors: 0, Skipped: 0, Time elapsed: 0.012 sec
Running org.apache.hadoop.hbase.stargate.model.TestColumnSchemaModel
Tests run: 2, Failures: 0, Errors: 0, Skipped: 0, Time elapsed: 0.006 sec
Running org.apache.hadoop.hbase.stargate.model.TestRowModel
Tests run: 2, Failures: 0, Errors: 0, Skipped: 0, Time elapsed: 0.015 sec
Running org.apache.hadoop.hbase.stargate.TestTableResource
Tests run: 4, Failures: 0, Errors: 0, Skipped: 0, Time elapsed: 5.546 sec
Results :
Tests run: 75, Failures: 0, Errors: 0, Skipped: 0
[INFO] [war:war {execution: default-war}]
[INFO] Packaging webapp
[INFO] Assembling webapp[hbase-contrib-stargate] in [<http://hudson.zones.apache.org/hudson/job/HBase-Patch/ws/trunk/contrib/stargate/target/hbase-contrib-stargate-0.21.0-SNAPSHOT]>
[INFO] Processing war project
[INFO] Webapp assembled in[650 msecs]
[INFO] Building war: <http://hudson.zones.apache.org/hudson/job/HBase-Patch/ws/trunk/contrib/stargate/target/hbase-contrib-stargate-0.21.0-SNAPSHOT.war>
[INFO] [install:install {execution: default-install}]
[INFO] Installing <http://hudson.zones.apache.org/hudson/job/HBase-Patch/ws/trunk/contrib/stargate/target/hbase-contrib-stargate-0.21.0-SNAPSHOT.war> to /home/hudson/.m2/repository/org/apache/hbase/hbase-contrib-stargate/0.21.0-SNAPSHOT/hbase-contrib-stargate-0.21.0-SNAPSHOT.war
[INFO] ------------------------------------------------------------------------
[INFO] Building HBase Contrib - Transactional
[INFO] task-segment: [clean, install]
[INFO] ------------------------------------------------------------------------
[INFO] [clean:clean {execution: default-clean}]
[INFO] [resources:resources {execution: default-resources}]
[INFO] Using 'UTF-8' encoding to copy filtered resources.
[INFO] skip non existing resourceDirectory <http://hudson.zones.apache.org/hudson/job/HBase-Patch/ws/trunk/contrib/transactional/src/main/resources>
[INFO] [compiler:compile {execution: default-compile}]
[INFO] Compiling 31 source files to <http://hudson.zones.apache.org/hudson/job/HBase-Patch/ws/trunk/contrib/transactional/target/classes>
[WARNING] <http://hudson.zones.apache.org/hudson/job/HBase-Patch/ws/trunk/contrib/transactional/src/main/java/org/apache/hadoop/hbase/client/transactional/HBaseBackedTransactionLogger.java>:[56,38] [deprecation] HBaseConfiguration() in org.apache.hadoop.hbase.HBaseConfiguration has been deprecated
[WARNING] <http://hudson.zones.apache.org/hudson/job/HBase-Patch/ws/trunk/contrib/transactional/src/main/java/org/apache/hadoop/hbase/client/transactional/HBaseBackedTransactionLogger.java>:[68,38] [deprecation] HBaseConfiguration() in org.apache.hadoop.hbase.HBaseConfiguration has been deprecated
[WARNING] <http://hudson.zones.apache.org/hudson/job/HBase-Patch/ws/trunk/contrib/transactional/src/main/java/org/apache/hadoop/hbase/client/tableindexed/IndexSpecification.java>:[154,49] [deprecation] HBaseConfiguration() in org.apache.hadoop.hbase.HBaseConfiguration has been deprecated
[INFO] [resources:testResources {execution: default-testResources}]
[INFO] Using 'UTF-8' encoding to copy filtered resources.
[INFO] skip non existing resourceDirectory <http://hudson.zones.apache.org/hudson/job/HBase-Patch/ws/trunk/contrib/transactional/src/test/resources>
[INFO] [compiler:testCompile {execution: default-testCompile}]
[INFO] Compiling 7 source files to <http://hudson.zones.apache.org/hudson/job/HBase-Patch/ws/trunk/contrib/transactional/target/test-classes>
[WARNING] <http://hudson.zones.apache.org/hudson/job/HBase-Patch/ws/trunk/contrib/transactional/src/test/java/org/apache/hadoop/hbase/client/tableindexed/TestIndexedTable.java>:[29,30] [deprecation] org.apache.hadoop.hbase.HBaseClusterTestCase in org.apache.hadoop.hbase has been deprecated
[WARNING] <http://hudson.zones.apache.org/hudson/job/HBase-Patch/ws/trunk/contrib/transactional/src/test/java/org/apache/hadoop/hbase/client/tableindexed/TestIndexedTable.java>:[43,38] [deprecation] org.apache.hadoop.hbase.HBaseClusterTestCase in org.apache.hadoop.hbase has been deprecated
[WARNING] <http://hudson.zones.apache.org/hudson/job/HBase-Patch/ws/trunk/contrib/transactional/src/test/java/org/apache/hadoop/hbase/client/transactional/TestTransactions.java>:[26,30] [deprecation] org.apache.hadoop.hbase.HBaseClusterTestCase in org.apache.hadoop.hbase has been deprecated
[WARNING] <http://hudson.zones.apache.org/hudson/job/HBase-Patch/ws/trunk/contrib/transactional/src/test/java/org/apache/hadoop/hbase/client/transactional/TestTransactions.java>:[44,38] [deprecation] org.apache.hadoop.hbase.HBaseClusterTestCase in org.apache.hadoop.hbase has been deprecated
[WARNING] <http://hudson.zones.apache.org/hudson/job/HBase-Patch/ws/trunk/contrib/transactional/src/test/java/org/apache/hadoop/hbase/regionserver/transactional/TestTHLogRecovery.java>:[30,30] [deprecation] org.apache.hadoop.hbase.HBaseClusterTestCase in org.apache.hadoop.hbase has been deprecated
[WARNING] <http://hudson.zones.apache.org/hudson/job/HBase-Patch/ws/trunk/contrib/transactional/src/test/java/org/apache/hadoop/hbase/regionserver/transactional/TestTHLogRecovery.java>:[51,39] [deprecation] org.apache.hadoop.hbase.HBaseClusterTestCase in org.apache.hadoop.hbase has been deprecated
[WARNING] <http://hudson.zones.apache.org/hudson/job/HBase-Patch/ws/trunk/contrib/transactional/src/test/java/org/apache/hadoop/hbase/client/transactional/StressTestTransactions.java>:[32,30] [deprecation] org.apache.hadoop.hbase.HBaseClusterTestCase in org.apache.hadoop.hbase has been deprecated
[WARNING] <http://hudson.zones.apache.org/hudson/job/HBase-Patch/ws/trunk/contrib/transactional/src/test/java/org/apache/hadoop/hbase/client/transactional/StressTestTransactions.java>:[53,44] [deprecation] org.apache.hadoop.hbase.HBaseClusterTestCase in org.apache.hadoop.hbase has been deprecated
[WARNING] <http://hudson.zones.apache.org/hudson/job/HBase-Patch/ws/trunk/contrib/transactional/src/test/java/org/apache/hadoop/hbase/regionserver/transactional/TestTHLog.java>:[27,30] [deprecation] org.apache.hadoop.hbase.HBaseTestCase in org.apache.hadoop.hbase has been deprecated
[WARNING] <http://hudson.zones.apache.org/hudson/job/HBase-Patch/ws/trunk/contrib/transactional/src/test/java/org/apache/hadoop/hbase/regionserver/transactional/TestTHLog.java>:[37,31] [deprecation] org.apache.hadoop.hbase.HBaseTestCase in org.apache.hadoop.hbase has been deprecated
[INFO] [surefire:test {execution: default-test}]
[INFO] Surefire report directory: <http://hudson.zones.apache.org/hudson/job/HBase-Patch/ws/trunk/contrib/transactional/target/surefire-reports>
-------------------------------------------------------
T E S T S
-------------------------------------------------------
Running org.apache.hadoop.hbase.client.tableindexed.TestIndexedTable
Tests run: 7, Failures: 0, Errors: 7, Skipped: 0, Time elapsed: 5.132 sec <<< FAILURE!
Running org.apache.hadoop.hbase.regionserver.transactional.TestTHLog
Tests run: 5, Failures: 0, Errors: 5, Skipped: 0, Time elapsed: 1.504 sec <<< FAILURE!
Running org.apache.hadoop.hbase.client.transactional.TestTransactions
Tests run: 7, Failures: 0, Errors: 7, Skipped: 0, Time elapsed: 2.12 sec <<< FAILURE!
Running org.apache.hadoop.hbase.regionserver.transactional.TestTHLogRecovery
Tests run: 2, Failures: 0, Errors: 0, Skipped: 0, Time elapsed: 522.251 sec
Results :
Tests in error:
testInitialWrites(org.apache.hadoop.hbase.client.tableindexed.TestIndexedTable)
testMultipleWrites(org.apache.hadoop.hbase.client.tableindexed.TestIndexedTable)
testDelete(org.apache.hadoop.hbase.client.tableindexed.TestIndexedTable)
testRowUpdate(org.apache.hadoop.hbase.client.tableindexed.TestIndexedTable)
testLockedRowUpdate(org.apache.hadoop.hbase.client.tableindexed.TestIndexedTable)
testLockedRowUpdateNoAutoFlush(org.apache.hadoop.hbase.client.tableindexed.TestIndexedTable)
testLockedRowDelete(org.apache.hadoop.hbase.client.tableindexed.TestIndexedTable)
testSingleCommit(org.apache.hadoop.hbase.regionserver.transactional.TestTHLog)
testSingleAbort(org.apache.hadoop.hbase.regionserver.transactional.TestTHLog)
testInterlievedCommits(org.apache.hadoop.hbase.regionserver.transactional.TestTHLog)
testInterlievedAbortCommit(org.apache.hadoop.hbase.regionserver.transactional.TestTHLog)
testInterlievedCommitAbort(org.apache.hadoop.hbase.regionserver.transactional.TestTHLog)
testSimpleTransaction(org.apache.hadoop.hbase.client.transactional.TestTransactions)
testTwoTransactionsWithoutConflict(org.apache.hadoop.hbase.client.transactional.TestTransactions)
testTwoTransactionsWithConflict(org.apache.hadoop.hbase.client.transactional.TestTransactions)
testGetAfterPut(org.apache.hadoop.hbase.client.transactional.TestTransactions)
testScanAfterUpdatePut(org.apache.hadoop.hbase.client.transactional.TestTransactions)
testScanAfterNewPut(org.apache.hadoop.hbase.client.transactional.TestTransactions)
testPutPutScan(org.apache.hadoop.hbase.client.transactional.TestTransactions)
Tests run: 21, Failures: 0, Errors: 19, Skipped: 0
[INFO] ------------------------------------------------------------------------
[ERROR] BUILD FAILURE
[INFO] ------------------------------------------------------------------------
[INFO] There are test failures.
Please refer to <http://hudson.zones.apache.org/hudson/job/HBase-Patch/ws/trunk/contrib/transactional/target/surefire-reports> for the individual test results.
[INFO] ------------------------------------------------------------------------
[INFO] For more information, run Maven with the -e switch
[INFO] ------------------------------------------------------------------------
[INFO] Total time: 37 minutes 37 seconds
[INFO] Finished at: Thu Feb 25 23:56:07 UTC 2010
[INFO] Final Memory: 75M/122M
[INFO] ------------------------------------------------------------------------
[locks-and-latches] Releasing all the locks
[locks-and-latches] All the locks released
Archiving artifacts
Recording test results