You are viewing a plain text version of this content. The canonical link for it is here.
Posted to builds@solr.apache.org by Apache Jenkins Server <je...@builds.apache.org> on 2026/09/15 10:53:07 UTC
[JENKINS] Solr » Solr-Test-10.0 - Build # 2497 - Unstable!
Build: https://ci-builds.apache.org/job/Solr/job/Solr-Test-10.0/2497/
1 tests failed.
FAILED: org.apache.solr.cloud.LeaderTragicEventTest.classMethod
Error Message:
java.lang.Exception: Error shutting down MiniSolrCloudCluster
Stack Trace:
java.lang.Exception: Error shutting down MiniSolrCloudCluster
at __randomizedtesting.SeedInfo.seed([CFD08609E6849D8D]:0)
at org.apache.solr.cloud.MiniSolrCloudCluster.checkForExceptions(MiniSolrCloudCluster.java:767)
at org.apache.solr.cloud.MiniSolrCloudCluster.shutdown(MiniSolrCloudCluster.java:677)
at org.apache.solr.cloud.SolrCloudTestCase.shutdownCluster(SolrCloudTestCase.java:144)
at java.base/jdk.internal.reflect.DirectMethodHandleAccessor.invoke(DirectMethodHandleAccessor.java:103)
at java.base/java.lang.reflect.Method.invoke(Method.java:580)
at com.carrotsearch.randomizedtesting.RandomizedRunner.invoke(RandomizedRunner.java:1763)
at com.carrotsearch.randomizedtesting.RandomizedRunner$7.evaluate(RandomizedRunner.java:909)
at com.carrotsearch.randomizedtesting.rules.StatementAdapter.evaluate(StatementAdapter.java:36)
at com.carrotsearch.randomizedtesting.rules.StatementAdapter.evaluate(StatementAdapter.java:36)
at org.apache.lucene.tests.util.AbstractBeforeAfterRule$1.evaluate(AbstractBeforeAfterRule.java:43)
at com.carrotsearch.randomizedtesting.rules.SystemPropertiesRestoreRule$1.evaluate(SystemPropertiesRestoreRule.java:80)
at org.junit.rules.RunRules.evaluate(RunRules.java:20)
at org.apache.lucene.tests.util.AbstractBeforeAfterRule$1.evaluate(AbstractBeforeAfterRule.java:43)
at com.carrotsearch.randomizedtesting.rules.StatementAdapter.evaluate(StatementAdapter.java:36)
at org.apache.lucene.tests.util.TestRuleStoreClassName$1.evaluate(TestRuleStoreClassName.java:38)
at com.carrotsearch.randomizedtesting.rules.NoShadowingOrOverridesOnMethodsRule$1.evaluate(NoShadowingOrOverridesOnMethodsRule.java:40)
at com.carrotsearch.randomizedtesting.rules.NoShadowingOrOverridesOnMethodsRule$1.evaluate(NoShadowingOrOverridesOnMethodsRule.java:40)
at com.carrotsearch.randomizedtesting.rules.StatementAdapter.evaluate(StatementAdapter.java:36)
at com.carrotsearch.randomizedtesting.rules.StatementAdapter.evaluate(StatementAdapter.java:36)
at org.apache.lucene.tests.util.TestRuleAssertionsRequired$1.evaluate(TestRuleAssertionsRequired.java:53)
at org.apache.lucene.tests.util.AbstractBeforeAfterRule$1.evaluate(AbstractBeforeAfterRule.java:43)
at org.apache.lucene.tests.util.TestRuleMarkFailure$1.evaluate(TestRuleMarkFailure.java:44)
at org.apache.lucene.tests.util.TestRuleIgnoreAfterMaxFailures$1.evaluate(TestRuleIgnoreAfterMaxFailures.java:60)
at org.apache.lucene.tests.util.TestRuleIgnoreTestSuites$1.evaluate(TestRuleIgnoreTestSuites.java:47)
at org.junit.rules.RunRules.evaluate(RunRules.java:20)
at com.carrotsearch.randomizedtesting.rules.StatementAdapter.evaluate(StatementAdapter.java:36)
at com.carrotsearch.randomizedtesting.ThreadLeakControl$StatementRunner.run(ThreadLeakControl.java:390)
at com.carrotsearch.randomizedtesting.ThreadLeakControl.lambda$forkTimeoutingTask$0(ThreadLeakControl.java:850)
at java.base/java.lang.Thread.run(Thread.java:1583)
Suppressed: java.util.concurrent.TimeoutException
at java.base/java.util.concurrent.CompletableFuture.timedGet(CompletableFuture.java:1960)
at java.base/java.util.concurrent.CompletableFuture.get(CompletableFuture.java:2095)
at org.eclipse.jetty.server.Server.doStop(Server.java:663)
at org.eclipse.jetty.util.component.AbstractLifeCycle.stop(AbstractLifeCycle.java:132)
at org.apache.solr.embedded.JettySolrRunner.stop(JettySolrRunner.java:630)
at org.apache.solr.cloud.MiniSolrCloudCluster.stopJettySolrRunner(MiniSolrCloudCluster.java:562)
at org.apache.solr.cloud.MiniSolrCloudCluster.lambda$shutdown$5(MiniSolrCloudCluster.java:669)
at java.base/java.util.concurrent.FutureTask.run(FutureTask.java:317)
at org.apache.solr.common.util.ExecutorUtil$MDCAwareThreadPoolExecutor.lambda$execute$0(ExecutorUtil.java:381)
at java.base/java.util.concurrent.ThreadPoolExecutor.runWorker(ThreadPoolExecutor.java:1144)
at java.base/java.util.concurrent.ThreadPoolExecutor$Worker.run(ThreadPoolExecutor.java:642)
... 1 more
Build Log:
[...truncated 11 lines...]
ERROR: Workspace has a .git repository, but it appears to be corrupt.
hudson.plugins.git.GitException: Command "git rev-parse --resolve-git-dir /home/jenkins/jenkins-agent/workspace/Solr/Solr-Test-10.0/.git" returned status code 128:
stdout:
stderr: fatal: not a gitdir '/home/jenkins/jenkins-agent/workspace/Solr/Solr-Test-10.0/.git'
at PluginClassLoader for git-client//org.jenkinsci.plugins.gitclient.CliGitAPIImpl.launchCommandIn(CliGitAPIImpl.java:2848)
at PluginClassLoader for git-client//org.jenkinsci.plugins.gitclient.CliGitAPIImpl.launchCommandIn(CliGitAPIImpl.java:2768)
at PluginClassLoader for git-client//org.jenkinsci.plugins.gitclient.CliGitAPIImpl.launchCommandIn(CliGitAPIImpl.java:2763)
at PluginClassLoader for git-client//org.jenkinsci.plugins.gitclient.CliGitAPIImpl.launchCommand(CliGitAPIImpl.java:2052)
at PluginClassLoader for git-client//org.jenkinsci.plugins.gitclient.CliGitAPIImpl.launchCommand(CliGitAPIImpl.java:2064)
at PluginClassLoader for git-client//org.jenkinsci.plugins.gitclient.CliGitAPIImpl.hasGitRepo(CliGitAPIImpl.java:404)
at PluginClassLoader for git-client//hudson.plugins.git.GitAPI.hasGitRepo(GitAPI.java:281)
at jdk.internal.reflect.GeneratedMethodAccessor31.invoke(Unknown Source)
at java.base/jdk.internal.reflect.DelegatingMethodAccessorImpl.invoke(DelegatingMethodAccessorImpl.java:43)
at java.base/java.lang.reflect.Method.invoke(Method.java:569)
at hudson.remoting.RemoteInvocationHandler$RPCRequest.perform(RemoteInvocationHandler.java:986)
at hudson.remoting.RemoteInvocationHandler$RPCRequest.call(RemoteInvocationHandler.java:961)
at hudson.remoting.RemoteInvocationHandler$RPCRequest.call(RemoteInvocationHandler.java:907)
at hudson.remoting.UserRequest.perform(UserRequest.java:225)
at hudson.remoting.UserRequest.perform(UserRequest.java:50)
at hudson.remoting.Request$2.run(Request.java:391)
at hudson.remoting.InterceptingExecutorService.lambda$wrap$0(InterceptingExecutorService.java:81)
at java.base/java.util.concurrent.FutureTask.run(FutureTask.java:264)
at java.base/java.util.concurrent.ThreadPoolExecutor.runWorker(ThreadPoolExecutor.java:1136)
at java.base/java.util.concurrent.ThreadPoolExecutor$Worker.run(ThreadPoolExecutor.java:635)
at java.base/java.lang.Thread.run(Thread.java:840)
Cloning the remote Git repository
Cloning repository https://gitbox.apache.org/repos/asf/solr.git
> git init /home/jenkins/jenkins-agent/workspace/Solr/Solr-Test-10.0 # timeout=10
Fetching upstream changes from https://gitbox.apache.org/repos/asf/solr.git
> git --version # timeout=10
> git --version # 'git version 2.43.0'
> git fetch --tags --force --progress -- https://gitbox.apache.org/repos/asf/solr.git +refs/heads/*:refs/remotes/origin/* # timeout=10
> git config remote.origin.url https://gitbox.apache.org/repos/asf/solr.git # timeout=10
> git config --add remote.origin.fetch +refs/heads/*:refs/remotes/origin/* # timeout=10
Avoid second fetch
> git rev-parse refs/remotes/origin/branch_10_0^{commit} # timeout=10
Checking out Revision 93068d1dfbc48816caac29c5b3aba3bf884aea85 (refs/remotes/origin/branch_10_0)
> git config core.sparsecheckout # timeout=10
> git checkout -f 93068d1dfbc48816caac29c5b3aba3bf884aea85 # timeout=10
> git branch -a -v --no-abbrev # timeout=10
> git checkout -b branch_10_0 93068d1dfbc48816caac29c5b3aba3bf884aea85 # timeout=10
Commit message: "Ref Guide - Change component name to Apache Solr (#4521)"
> git rev-list --no-walk 93068d1dfbc48816caac29c5b3aba3bf884aea85 # timeout=10
No emails were triggered.
provisioning config files...
copy managed file [gradle.properties] to file:/home/jenkins/jenkins-agent/workspace/Solr/Solr-Test-10.0/gradle.properties
[Gradle] - Launching build.
[Solr-Test-10.0] $ /home/jenkins/jenkins-agent/workspace/Solr/Solr-Test-10.0/gradlew -Dtests.haltonfailure=false -Dtests.badapples=false --continue test
Downloading gradle-wrapper.jar from https://raw.githubusercontent.com/gradle/gradle/v8.10.2/gradle/wrapper/gradle-wrapper.jar
To honour the JVM settings for this build a single-use Daemon process will be forked. For more on this, please refer to https://docs.gradle.org/8.10/userguide/gradle_daemon.html#sec:disabling_the_daemon in the Gradle documentation.
Daemon will be stopped at the end of the build
> Task :build-infra:compileJava
Note: /home/jenkins/jenkins-agent/workspace/Solr/Solr-Test-10.0/build-tools/build-infra/src/main/java/org/apache/lucene/gradle/Checksum.java uses or overrides a deprecated API.
Note: Recompile with -Xlint:deprecation for details.
> Task :build-infra:pluginDescriptors
> Task :build-infra:processResources
> Task :build-infra:classes
> Task :build-infra:jar
> Task :gitStatus
> Task :checkJdkInternalsExportedToGradle
> Task :solr:api:compileJava
Note: Some input files use or override a deprecated API.
Note: Recompile with -Xlint:deprecation for details.
> Task :solr:api:processResources NO-SOURCE
> Task :solr:api:classes
> Task :solr:api:jar
> Task :randomizationInfo
Running tests with randomization seed: tests.seed=CFD08609E6849D8D
> Task :solr:api:resolve
SLF4J(W): No SLF4J providers were found.
SLF4J(W): Defaulting to no-operation (NOP) logger implementation
SLF4J(W): See https://www.slf4j.org/codes.html#noProviders for further details.
> Task :solr:solrj:openApiGenerate
Cleaned up output directory /home/jenkins/jenkins-agent/workspace/Solr/Solr-Test-10.0/solr/solrj/build/generated/ before code generation (cleanupOutput set to true).
No application/json content media type found in response. Response examples can currently only be generated for application/json media type.
############################################################################################
# Thanks for using OpenAPI Generator. #
# We appreciate your support! Please consider donation to help us maintain this project. #
# https://opencollective.com/openapi_generator/donate #
############################################################################################
Successfully generated code to /home/jenkins/jenkins-agent/workspace/Solr/Solr-Test-10.0/solr/solrj/build/generated/
> Task :spotlessInternalRegisterDependencies
> Task :solr:solrj:generatedSpotlessHelper
> Task :solr:solrj:generatedSpotless
> Task :solr:solrj:compileJava
Note: Some input files use or override a deprecated API.
Note: Recompile with -Xlint:deprecation for details.
> Task :solr:solrj-jetty:compileJava
Note: /home/jenkins/jenkins-agent/workspace/Solr/Solr-Test-10.0/solr/solrj-jetty/src/java/org/apache/solr/client/solrj/jetty/HttpJettySolrClient.java uses or overrides a deprecated API.
Note: Recompile with -Xlint:deprecation for details.
> Task :solr:solrj-streaming:compileJava
Note: Some input files use or override a deprecated API.
Note: Recompile with -Xlint:deprecation for details.
> Task :solr:solrj-zookeeper:compileJava
Note: Some input files use or override a deprecated API.
Note: Recompile with -Xlint:deprecation for details.
> Task :solr:core:compileJava
Note: Some input files use or override a deprecated API.
Note: Recompile with -Xlint:deprecation for details.
> Task :solr:test-framework:compileJava
Note: Some input files use or override a deprecated API.
Note: Recompile with -Xlint:deprecation for details.
> Task :solr:api:compileTestJava
> Task :solr:api:processTestResources
> Task :solr:api:testClasses
> Task :solr:core:processResources
> Task :solr:core:classes
> Task :solr:core:jar
> Task :solr:solrj:processResources
> Task :solr:solrj:classes
> Task :solr:solrj:jar
> Task :solr:solrj-jetty:processResources NO-SOURCE
> Task :solr:solrj-jetty:classes
> Task :solr:solrj-jetty:jar
> Task :solr:solrj-streaming:processResources
> Task :solr:solrj-streaming:classes
> Task :solr:solrj-streaming:jar
> Task :solr:solrj-zookeeper:processResources NO-SOURCE
> Task :solr:solrj-zookeeper:classes
> Task :solr:solrj-zookeeper:jar
> Task :solr:test-framework:processResources
> Task :solr:test-framework:classes
> Task :solr:test-framework:jar
> Task :solr:api:test
WARNING: Using incubator modules: jdk.incubator.vector
WARNING: Using incubator modules: jdk.incubator.vector
WARNING: A command line option has enabled the Security Manager
WARNING: The Security Manager is deprecated and will be removed in a future release
WARNING: A command line option has enabled the Security Manager
WARNING: The Security Manager is deprecated and will be removed in a future release
java.security.policy: error adding Permission, java.net.URLPermission:
java.util.ServiceConfigurationError: Locale provider adapter "CLDR"cannot be instantiated.
java.security.policy: error adding Permission, java.net.URLPermission:
java.util.ServiceConfigurationError: Locale provider adapter "CLDR"cannot be instantiated.
java.security.policy: error adding Permission, java.net.URLPermission:
java.util.ServiceConfigurationError: Locale provider adapter "CLDR"cannot be instantiated.
java.security.policy: error adding Permission, java.net.URLPermission:
java.util.ServiceConfigurationError: Locale provider adapter "CLDR"cannot be instantiated.
java.security.policy: error adding Permission, java.net.URLPermission:
java.util.ServiceConfigurationError: Locale provider adapter "CLDR"cannot be instantiated.
java.security.policy: error adding Permission, java.net.URLPermission:
java.util.ServiceConfigurationError: Locale provider adapter "CLDR"cannot be instantiated.
:solr:api:test (SUCCESS): 19 test(s)
> Task :solr:api:wipeTaskTemp
> Task :solr:benchmark:compileJava
> Task :solr:benchmark:processResources
> Task :solr:benchmark:classes
> Task :solr:benchmark:compileTestJava
> Task :solr:benchmark:processTestResources
> Task :solr:benchmark:testClasses
> Task :solr:benchmark:test
WARNING: Using incubator modules: jdk.incubator.vector
WARNING: Using incubator modules: jdk.incubator.vector
WARNING: Using incubator modules: jdk.incubator.vector
WARNING: A command line option has enabled the Security Manager
WARNING: The Security Manager is deprecated and will be removed in a future release
WARNING: A command line option has enabled the Security Manager
WARNING: The Security Manager is deprecated and will be removed in a future release
WARNING: A command line option has enabled the Security Manager
WARNING: The Security Manager is deprecated and will be removed in a future release
java.security.policy: error adding Permission, java.net.URLPermission:
java.util.ServiceConfigurationError: Locale provider adapter "CLDR"cannot be instantiated.
java.security.policy: error adding Permission, java.net.URLPermission:
java.util.ServiceConfigurationError: Locale provider adapter "CLDR"cannot be instantiated.
java.security.policy: error adding Permission, java.net.URLPermission:
java.util.ServiceConfigurationError: Locale provider adapter "CLDR"cannot be instantiated.
java.security.policy: error adding Permission, java.net.URLPermission:
java.util.ServiceConfigurationError: Locale provider adapter "CLDR"cannot be instantiated.
java.security.policy: error adding Permission, java.net.URLPermission:
java.util.ServiceConfigurationError: Locale provider adapter "CLDR"cannot be instantiated.
java.security.policy: error adding Permission, java.net.URLPermission:
java.util.ServiceConfigurationError: Locale provider adapter "CLDR"cannot be instantiated.
java.security.policy: error adding Permission, java.net.URLPermission:
java.util.ServiceConfigurationError: Locale provider adapter "CLDR"cannot be instantiated.
java.security.policy: error adding Permission, java.net.URLPermission:
java.util.ServiceConfigurationError: Locale provider adapter "CLDR"cannot be instantiated.
java.security.policy: error adding Permission, java.net.URLPermission:
java.util.ServiceConfigurationError: Locale provider adapter "CLDR"cannot be instantiated.
:solr:benchmark:test (SUCCESS): 10 test(s)
> Task :solr:benchmark:wipeTaskTemp
> Task :solr:core:compileTestJava
Note: Some input files use or override a deprecated API.
Note: Recompile with -Xlint:deprecation for details.
> Task :solr:core:processTestResources
> Task :solr:core:testClasses
> Task :solr:modules:analysis-extras:compileJava
Note: /home/jenkins/jenkins-agent/workspace/Solr/Solr-Test-10.0/solr/modules/analysis-extras/src/java/org/apache/solr/schema/ICUCollationField.java uses or overrides a deprecated API.
Note: Recompile with -Xlint:deprecation for details.
> Task :solr:modules:analysis-extras:processResources NO-SOURCE
> Task :solr:modules:analysis-extras:classes
> Task :solr:modules:analysis-extras:jar
> Task :solr:core:test
WARNING: Using incubator modules: jdk.incubator.vector
WARNING: Using incubator modules: jdk.incubator.vector
WARNING: Using incubator modules: jdk.incubator.vector
WARNING: Using incubator modules: jdk.incubator.vector
WARNING: A command line option has enabled the Security Manager
WARNING: The Security Manager is deprecated and will be removed in a future release
WARNING: A command line option has enabled the Security Manager
WARNING: The Security Manager is deprecated and will be removed in a future release
WARNING: A command line option has enabled the Security Manager
WARNING: The Security Manager is deprecated and will be removed in a future release
WARNING: A command line option has enabled the Security Manager
WARNING: The Security Manager is deprecated and will be removed in a future release
java.security.policy: error adding Permission, java.net.URLPermission:
java.security.policy: error adding Permission, java.net.URLPermission:
java.util.ServiceConfigurationError: Locale provider adapter "CLDR"cannot be instantiated.
java.util.ServiceConfigurationError: Locale provider adapter "CLDR"cannot be instantiated.
java.security.policy: error adding Permission, java.net.URLPermission:
java.util.ServiceConfigurationError: Locale provider adapter "CLDR"cannot be instantiated.
java.security.policy: error adding Permission, java.net.URLPermission:
java.util.ServiceConfigurationError: Locale provider adapter "CLDR"cannot be instantiated.
java.security.policy: error adding Permission, java.net.URLPermission:
java.util.ServiceConfigurationError: Locale provider adapter "CLDR"cannot be instantiated.
java.security.policy: error adding Permission, java.net.URLPermission:
java.util.ServiceConfigurationError: Locale provider adapter "CLDR"cannot be instantiated.
java.security.policy: error adding Permission, java.net.URLPermission:
java.util.ServiceConfigurationError: Locale provider adapter "CLDR"cannot be instantiated.
java.security.policy: error adding Permission, java.net.URLPermission:
java.util.ServiceConfigurationError: Locale provider adapter "CLDR"cannot be instantiated.
java.security.policy: error adding Permission, java.net.URLPermission:
java.util.ServiceConfigurationError: Locale provider adapter "CLDR"cannot be instantiated.
java.security.policy: error adding Permission, java.net.URLPermission:
java.util.ServiceConfigurationError: Locale provider adapter "CLDR"cannot be instantiated.
java.security.policy: error adding Permission, java.net.URLPermission:
java.util.ServiceConfigurationError: Locale provider adapter "CLDR"cannot be instantiated.
java.security.policy: error adding Permission, java.net.URLPermission:
java.util.ServiceConfigurationError: Locale provider adapter "CLDR"cannot be instantiated.
WARNING: Test org.apache.solr.TestRandomDVFaceting wrote 13,658,869 bytes of output.
WARNING: Test org.apache.solr.TestRandomFaceting wrote 34,466,761 bytes of output.
LeaderTragicEventTest > classMethod FAILED
java.lang.Exception: Error shutting down MiniSolrCloudCluster
at __randomizedtesting.SeedInfo.seed([CFD08609E6849D8D]:0)
at org.apache.solr.cloud.MiniSolrCloudCluster.checkForExceptions(MiniSolrCloudCluster.java:767)
at org.apache.solr.cloud.MiniSolrCloudCluster.shutdown(MiniSolrCloudCluster.java:677)
at org.apache.solr.cloud.SolrCloudTestCase.shutdownCluster(SolrCloudTestCase.java:144)
at java.base/jdk.internal.reflect.DirectMethodHandleAccessor.invoke(DirectMethodHandleAccessor.java:103)
at java.base/java.lang.reflect.Method.invoke(Method.java:580)
at com.carrotsearch.randomizedtesting.RandomizedRunner.invoke(RandomizedRunner.java:1763)
at com.carrotsearch.randomizedtesting.RandomizedRunner$7.evaluate(RandomizedRunner.java:909)
at com.carrotsearch.randomizedtesting.rules.StatementAdapter.evaluate(StatementAdapter.java:36)
at com.carrotsearch.randomizedtesting.rules.StatementAdapter.evaluate(StatementAdapter.java:36)
at org.apache.lucene.tests.util.AbstractBeforeAfterRule$1.evaluate(AbstractBeforeAfterRule.java:43)
at com.carrotsearch.randomizedtesting.rules.SystemPropertiesRestoreRule$1.evaluate(SystemPropertiesRestoreRule.java:80)
at org.junit.rules.RunRules.evaluate(RunRules.java:20)
at org.apache.lucene.tests.util.AbstractBeforeAfterRule$1.evaluate(AbstractBeforeAfterRule.java:43)
at com.carrotsearch.randomizedtesting.rules.StatementAdapter.evaluate(StatementAdapter.java:36)
at org.apache.lucene.tests.util.TestRuleStoreClassName$1.evaluate(TestRuleStoreClassName.java:38)
at com.carrotsearch.randomizedtesting.rules.NoShadowingOrOverridesOnMethodsRule$1.evaluate(NoShadowingOrOverridesOnMethodsRule.java:40)
at com.carrotsearch.randomizedtesting.rules.NoShadowingOrOverridesOnMethodsRule$1.evaluate(NoShadowingOrOverridesOnMethodsRule.java:40)
at com.carrotsearch.randomizedtesting.rules.StatementAdapter.evaluate(StatementAdapter.java:36)
at com.carrotsearch.randomizedtesting.rules.StatementAdapter.evaluate(StatementAdapter.java:36)
at org.apache.lucene.tests.util.TestRuleAssertionsRequired$1.evaluate(TestRuleAssertionsRequired.java:53)
at org.apache.lucene.tests.util.AbstractBeforeAfterRule$1.evaluate(AbstractBeforeAfterRule.java:43)
at org.apache.lucene.tests.util.TestRuleMarkFailure$1.evaluate(TestRuleMarkFailure.java:44)
at org.apache.lucene.tests.util.TestRuleIgnoreAfterMaxFailures$1.evaluate(TestRuleIgnoreAfterMaxFailures.java:60)
at org.apache.lucene.tests.util.TestRuleIgnoreTestSuites$1.evaluate(TestRuleIgnoreTestSuites.java:47)
at org.junit.rules.RunRules.evaluate(RunRules.java:20)
at com.carrotsearch.randomizedtesting.rules.StatementAdapter.evaluate(StatementAdapter.java:36)
at com.carrotsearch.randomizedtesting.ThreadLeakControl$StatementRunner.run(ThreadLeakControl.java:390)
at com.carrotsearch.randomizedtesting.ThreadLeakControl.lambda$forkTimeoutingTask$0(ThreadLeakControl.java:850)
at java.base/java.lang.Thread.run(Thread.java:1583)
org.apache.solr.cloud.LeaderTragicEventTest > test suite's output saved to /home/jenkins/jenkins-agent/workspace/Solr/Solr-Test-10.0/solr/core/build/test-results/test/outputs/OUTPUT-org.apache.solr.cloud.LeaderTragicEventTest.txt, copied below:
2> 216021 INFO (SUITE-LeaderTragicEventTest-seed#[CFD08609E6849D8D]-worker) [] o.a.s.SolrTestCase Setting 'solr.configset.default.confdir' system property to test-framework derived value of '/home/jenkins/jenkins-agent/workspace/Solr/Solr-Test-10.0/solr/server/solr/configsets/_default/conf'
2> 216021 INFO (SUITE-LeaderTragicEventTest-seed#[CFD08609E6849D8D]-worker) [] o.a.s.SolrTestCaseJ4 SecureRandom sanity checks: test.solr.allowed.securerandom=null & java.security.egd=file:/dev/./urandom
2> 216022 INFO (SUITE-LeaderTragicEventTest-seed#[CFD08609E6849D8D]-worker) [] o.a.s.u.ErrorLogMuter Closing ErrorLogMuter-regex-64 after mutting 0 log messages
2> 216022 INFO (SUITE-LeaderTragicEventTest-seed#[CFD08609E6849D8D]-worker) [] o.a.s.u.ErrorLogMuter Creating ErrorLogMuter-regex-65 for ERROR logs matching regex: ignore_exception
2> 216023 INFO (SUITE-LeaderTragicEventTest-seed#[CFD08609E6849D8D]-worker) [] o.a.s.SolrTestCaseJ4 Created dataDir: /home/jenkins/jenkins-agent/workspace/Solr/Solr-Test-10.0/build/tmp/tests-tmp/org.apache.solr.cloud.LeaderTragicEventTest_CFD08609E6849D8D-001/data-dir-28-001
2> 216023 WARN (SUITE-LeaderTragicEventTest-seed#[CFD08609E6849D8D]-worker) [] o.a.s.SolrTestCaseJ4 startTrackingSearchers: numOpens=16 numCloses=16
2> 216023 INFO (SUITE-LeaderTragicEventTest-seed#[CFD08609E6849D8D]-worker) [] o.a.s.SolrTestCaseJ4 Using PointFields (NUMERIC_POINTS_SYSPROP=true) w/NUMERIC_DOCVALUES_SYSPROP=true
2> 216023 INFO (SUITE-LeaderTragicEventTest-seed#[CFD08609E6849D8D]-worker) [] o.a.s.SolrTestCaseJ4 Randomized ssl (false) and clientAuth (true) via: @org.apache.solr.util.RandomizeSSL(reason="", value=0.0/0.0, ssl=0.0/0.0, clientAuth=0.0/0.0)
2> 216024 INFO (SUITE-LeaderTragicEventTest-seed#[CFD08609E6849D8D]-worker) [] o.a.s.c.OpenTelemetryConfigurator OpenTelemetry tracer enabled with simple propagation only.
2> 216024 INFO (SUITE-LeaderTragicEventTest-seed#[CFD08609E6849D8D]-worker) [] o.a.s.c.MiniSolrCloudCluster Starting cluster of 2 servers in /home/jenkins/jenkins-agent/workspace/Solr/Solr-Test-10.0/build/tmp/tests-tmp/org.apache.solr.cloud.LeaderTragicEventTest_CFD08609E6849D8D-001/tempDir-001
2> 216024 INFO (SUITE-LeaderTragicEventTest-seed#[CFD08609E6849D8D]-worker) [] o.a.s.c.ZkTestServer STARTING ZK TEST SERVER
2> 216024 INFO (ZkTestServer Run Thread) [] o.a.s.c.ZkTestServer client port: /127.0.0.1:0
2> 216024 INFO (ZkTestServer Run Thread) [] o.a.s.c.ZkTestServer Starting server
2> 216025 WARN (ZkTestServer Run Thread) [] o.a.z.s.ServerCnxnFactory maxCnxns is not configured, using default value 0.
2> 216124 INFO (SUITE-LeaderTragicEventTest-seed#[CFD08609E6849D8D]-worker) [] o.a.s.c.ZkTestServer start zk server on port: 34687
2> 216125 WARN (SUITE-LeaderTragicEventTest-seed#[CFD08609E6849D8D]-worker) [] o.a.s.c.c.SolrZkClient Using default ZkCredentialsInjector. ZkCredentialsInjector is not secure, it creates an empty list of credentials which leads to 'OPEN_ACL_UNSAFE' ACLs to Zookeeper nodes
2> 216126 WARN (SUITE-LeaderTragicEventTest-seed#[CFD08609E6849D8D]-worker) [] o.a.s.c.c.SolrZkClient Using default ZkACLProvider. DefaultZkACLProvider is not secure, it creates 'OPEN_ACL_UNSAFE' ACLs to Zookeeper nodes
2> 216126 INFO (SUITE-LeaderTragicEventTest-seed#[CFD08609E6849D8D]-worker) [] o.a.c.f.i.CuratorFrameworkImpl Starting
2> 216127 INFO (SUITE-LeaderTragicEventTest-seed#[CFD08609E6849D8D]-worker) [] o.a.c.f.i.CuratorFrameworkImpl Default schema
2> 216128 INFO (SUITE-LeaderTragicEventTest-seed#[CFD08609E6849D8D]-worker-EventThread) [] o.a.c.f.s.ConnectionStateManager State change: CONNECTED
2> 216129 INFO (SUITE-LeaderTragicEventTest-seed#[CFD08609E6849D8D]-worker-EventThread) [] o.a.c.f.i.EnsembleTracker New config event received: {}
2> 216129 INFO (SUITE-LeaderTragicEventTest-seed#[CFD08609E6849D8D]-worker-EventThread) [] o.a.c.f.i.EnsembleTracker New config event received: {}
2> 216130 WARN (SUITE-LeaderTragicEventTest-seed#[CFD08609E6849D8D]-worker) [] o.a.s.c.c.SolrZkClient Using default ZkCredentialsInjector. ZkCredentialsInjector is not secure, it creates an empty list of credentials which leads to 'OPEN_ACL_UNSAFE' ACLs to Zookeeper nodes
2> 216130 WARN (SUITE-LeaderTragicEventTest-seed#[CFD08609E6849D8D]-worker) [] o.a.s.c.c.SolrZkClient Using default ZkACLProvider. DefaultZkACLProvider is not secure, it creates 'OPEN_ACL_UNSAFE' ACLs to Zookeeper nodes
2> 216130 INFO (SUITE-LeaderTragicEventTest-seed#[CFD08609E6849D8D]-worker) [] o.a.c.f.i.CuratorFrameworkImpl Starting
2> 216131 INFO (SUITE-LeaderTragicEventTest-seed#[CFD08609E6849D8D]-worker) [] o.a.c.f.i.CuratorFrameworkImpl Default schema
2> 216132 INFO (SUITE-LeaderTragicEventTest-seed#[CFD08609E6849D8D]-worker-EventThread) [] o.a.c.f.s.ConnectionStateManager State change: CONNECTED
2> 216132 WARN (SUITE-LeaderTragicEventTest-seed#[CFD08609E6849D8D]-worker) [] o.a.s.c.c.SolrZkClient Using default ZkCredentialsInjector. ZkCredentialsInjector is not secure, it creates an empty list of credentials which leads to 'OPEN_ACL_UNSAFE' ACLs to Zookeeper nodes
2> 216132 WARN (SUITE-LeaderTragicEventTest-seed#[CFD08609E6849D8D]-worker) [] o.a.s.c.c.SolrZkClient Using default ZkACLProvider. DefaultZkACLProvider is not secure, it creates 'OPEN_ACL_UNSAFE' ACLs to Zookeeper nodes
2> 216132 INFO (SUITE-LeaderTragicEventTest-seed#[CFD08609E6849D8D]-worker) [] o.a.c.f.i.CuratorFrameworkImpl Starting
2> 216132 INFO (SUITE-LeaderTragicEventTest-seed#[CFD08609E6849D8D]-worker-EventThread) [] o.a.c.f.i.EnsembleTracker New config event received: {}
2> 216132 INFO (SUITE-LeaderTragicEventTest-seed#[CFD08609E6849D8D]-worker-EventThread) [] o.a.c.f.i.EnsembleTracker New config event received: {}
2> 216133 INFO (SUITE-LeaderTragicEventTest-seed#[CFD08609E6849D8D]-worker) [] o.a.c.f.i.CuratorFrameworkImpl Default schema
2> 216134 INFO (SUITE-LeaderTragicEventTest-seed#[CFD08609E6849D8D]-worker-EventThread) [] o.a.c.f.s.ConnectionStateManager State change: CONNECTED
2> 216134 INFO (SUITE-LeaderTragicEventTest-seed#[CFD08609E6849D8D]-worker-EventThread) [] o.a.c.f.i.EnsembleTracker New config event received: {}
2> 216134 INFO (SUITE-LeaderTragicEventTest-seed#[CFD08609E6849D8D]-worker-EventThread) [] o.a.c.f.i.EnsembleTracker New config event received: {}
2> 216135 INFO (Curator-Framework-0) [] o.a.c.f.i.CuratorFrameworkImpl backgroundOperationsLoop exiting
2> 216237 INFO (jetty-launcher-2757-thread-1) [] o.a.s.e.JettySolrRunner Start Jetty (configured port=0, binding port=0)
2> 216237 INFO (jetty-launcher-2757-thread-1) [] o.a.s.e.JettySolrRunner Trying to start Jetty on port 0 try number 2 ...
2> 216237 INFO (jetty-launcher-2757-thread-2) [] o.a.s.e.JettySolrRunner Start Jetty (configured port=0, binding port=0)
2> 216237 INFO (jetty-launcher-2757-thread-1) [] o.e.j.s.Server jetty-12.0.27; built: 2025-09-10T23:47:49.595Z; git: 3569a3e83ad136ee44e26b370b74c1c5e9f33e61; jvm 21.0.4+7-LTS
2> 216237 INFO (jetty-launcher-2757-thread-2) [] o.a.s.e.JettySolrRunner Trying to start Jetty on port 0 try number 2 ...
2> 216237 INFO (jetty-launcher-2757-thread-2) [] o.e.j.s.Server jetty-12.0.27; built: 2025-09-10T23:47:49.595Z; git: 3569a3e83ad136ee44e26b370b74c1c5e9f33e61; jvm 21.0.4+7-LTS
2> 216238 INFO (jetty-launcher-2757-thread-1) [] o.e.j.s.DefaultSessionIdManager Session workerName=node0
2> 216238 INFO (jetty-launcher-2757-thread-2) [] o.e.j.s.DefaultSessionIdManager Session workerName=node0
2> 216239 WARN (jetty-launcher-2757-thread-1) [] o.e.j.e.s.ServletContextHandler BaseResource file:///home/jenkins/jenkins-agent/workspace/Solr/Solr-Test-10.0/solr/core/build/tmp/tests-cwd/./ is aliased to file:///home/jenkins/jenkins-agent/workspace/Solr/Solr-Test-10.0/solr/core/build/tmp/tests-cwd/ in oeje10s.ServletContextHandler@683af489{/solr,/solr,b=file:///home/jenkins/jenkins-agent/workspace/Solr/Solr-Test-10.0/solr/core/build/tmp/tests-cwd/./,a=STOPPED,h=oeje10s.SessionHandler@133cea8b{STOPPED}}. May not be supported in future releases.
2> 216239 WARN (jetty-launcher-2757-thread-2) [] o.e.j.e.s.ServletContextHandler BaseResource file:///home/jenkins/jenkins-agent/workspace/Solr/Solr-Test-10.0/solr/core/build/tmp/tests-cwd/./ is aliased to file:///home/jenkins/jenkins-agent/workspace/Solr/Solr-Test-10.0/solr/core/build/tmp/tests-cwd/ in oeje10s.ServletContextHandler@bedba07{/solr,/solr,b=file:///home/jenkins/jenkins-agent/workspace/Solr/Solr-Test-10.0/solr/core/build/tmp/tests-cwd/./,a=STOPPED,h=oeje10s.SessionHandler@147399af{STOPPED}}. May not be supported in future releases.
2> 216239 INFO (jetty-launcher-2757-thread-1) [] o.e.j.s.h.ContextHandler /solr Base Resource is an alias: file:///home/jenkins/jenkins-agent/workspace/Solr/Solr-Test-10.0/solr/core/build/tmp/tests-cwd/./ -> file:///home/jenkins/jenkins-agent/workspace/Solr/Solr-Test-10.0/solr/core/build/tmp/tests-cwd/
2> 216239 INFO (jetty-launcher-2757-thread-2) [] o.e.j.s.h.ContextHandler /solr Base Resource is an alias: file:///home/jenkins/jenkins-agent/workspace/Solr/Solr-Test-10.0/solr/core/build/tmp/tests-cwd/./ -> file:///home/jenkins/jenkins-agent/workspace/Solr/Solr-Test-10.0/solr/core/build/tmp/tests-cwd/
2> 216239 INFO (jetty-launcher-2757-thread-1) [] o.e.j.s.h.ContextHandler Started oeje10s.ServletContextHandler@683af489{/solr,/solr,b=file:///home/jenkins/jenkins-agent/workspace/Solr/Solr-Test-10.0/solr/core/build/tmp/tests-cwd/,a=AVAILABLE,h=oeje10s.SessionHandler@133cea8b{STARTED}}
2> 216239 INFO (jetty-launcher-2757-thread-2) [] o.e.j.s.h.ContextHandler Started oeje10s.ServletContextHandler@bedba07{/solr,/solr,b=file:///home/jenkins/jenkins-agent/workspace/Solr/Solr-Test-10.0/solr/core/build/tmp/tests-cwd/,a=AVAILABLE,h=oeje10s.SessionHandler@147399af{STARTED}}
2> 216239 INFO (jetty-launcher-2757-thread-1) [] o.a.s.e.JettySolrRunner Jetty properties: {hostPort=41577, zkHost=127.0.0.1:34687/solr}
2> 216239 INFO (jetty-launcher-2757-thread-2) [] o.a.s.e.JettySolrRunner Jetty properties: {hostPort=36415, zkHost=127.0.0.1:34687/solr}
2> 216239 ERROR (jetty-launcher-2757-thread-1) [] o.a.s.u.StartupLoggingUtils Missing Java Option solr.logs.dir. Logging may be missing or incomplete.
2> 216239 ERROR (jetty-launcher-2757-thread-2) [] o.a.s.u.StartupLoggingUtils Missing Java Option solr.logs.dir. Logging may be missing or incomplete.
2> 216239 INFO (jetty-launcher-2757-thread-1) [] o.a.s.s.CoreContainerProvider Using logger factory org.apache.logging.slf4j.Log4jLoggerFactory
2> 216239 INFO (jetty-launcher-2757-thread-2) [] o.a.s.s.CoreContainerProvider Using logger factory org.apache.logging.slf4j.Log4jLoggerFactory
2> 216239 INFO (jetty-launcher-2757-thread-2) [] o.a.s.s.CoreContainerProvider ___ _ Welcome to Apache Solr™ version 10.0.1
2> 216239 INFO (jetty-launcher-2757-thread-1) [] o.a.s.s.CoreContainerProvider ___ _ Welcome to Apache Solr™ version 10.0.1
2> 216239 INFO (jetty-launcher-2757-thread-2) [] o.a.s.s.CoreContainerProvider / __| ___| |_ _ Starting in cloud mode on port null
2> 216239 INFO (jetty-launcher-2757-thread-1) [] o.a.s.s.CoreContainerProvider / __| ___| |_ _ Starting in cloud mode on port null
2> 216239 INFO (jetty-launcher-2757-thread-2) [] o.a.s.s.CoreContainerProvider \__ \/ _ \ | '_| Install dir: /home/jenkins/jenkins-agent/workspace/Solr/Solr-Test-10.0/solr
2> 216239 INFO (jetty-launcher-2757-thread-1) [] o.a.s.s.CoreContainerProvider \__ \/ _ \ | '_| Install dir: /home/jenkins/jenkins-agent/workspace/Solr/Solr-Test-10.0/solr
2> 216239 INFO (jetty-launcher-2757-thread-2) [] o.a.s.s.CoreContainerProvider |___/\___/_|_| Start time: 2026-09-15T10:20:21.951925975Z
2> 216239 INFO (jetty-launcher-2757-thread-1) [] o.a.s.s.CoreContainerProvider |___/\___/_|_| Start time: 2026-09-15T10:20:21.951930664Z
2> 216240 INFO (jetty-launcher-2757-thread-2) [] o.a.s.s.CoreContainerProvider Solr Home: /home/jenkins/jenkins-agent/workspace/Solr/Solr-Test-10.0/build/tmp/tests-tmp/org.apache.solr.cloud.LeaderTragicEventTest_CFD08609E6849D8D-001/tempDir-001/node2 (source: servlet config: solr.solr.home)
2> 216240 INFO (jetty-launcher-2757-thread-1) [] o.a.s.s.CoreContainerProvider Solr Home: /home/jenkins/jenkins-agent/workspace/Solr/Solr-Test-10.0/build/tmp/tests-tmp/org.apache.solr.cloud.LeaderTragicEventTest_CFD08609E6849D8D-001/tempDir-001/node1 (source: servlet config: solr.solr.home)
2> 216240 WARN (jetty-launcher-2757-thread-2) [] o.a.s.c.c.SolrZkClient Using default ZkCredentialsInjector. ZkCredentialsInjector is not secure, it creates an empty list of credentials which leads to 'OPEN_ACL_UNSAFE' ACLs to Zookeeper nodes
2> 216240 WARN (jetty-launcher-2757-thread-1) [] o.a.s.c.c.SolrZkClient Using default ZkCredentialsInjector. ZkCredentialsInjector is not secure, it creates an empty list of credentials which leads to 'OPEN_ACL_UNSAFE' ACLs to Zookeeper nodes
2> 216240 WARN (jetty-launcher-2757-thread-2) [] o.a.s.c.c.SolrZkClient Using default ZkACLProvider. DefaultZkACLProvider is not secure, it creates 'OPEN_ACL_UNSAFE' ACLs to Zookeeper nodes
2> 216240 WARN (jetty-launcher-2757-thread-1) [] o.a.s.c.c.SolrZkClient Using default ZkACLProvider. DefaultZkACLProvider is not secure, it creates 'OPEN_ACL_UNSAFE' ACLs to Zookeeper nodes
2> 216240 INFO (jetty-launcher-2757-thread-2) [] o.a.c.f.i.CuratorFrameworkImpl Starting
2> 216240 INFO (jetty-launcher-2757-thread-1) [] o.a.c.f.i.CuratorFrameworkImpl Starting
2> 216241 INFO (jetty-launcher-2757-thread-2) [] o.a.c.f.i.CuratorFrameworkImpl Default schema
2> 216242 INFO (jetty-launcher-2757-thread-1) [] o.a.c.f.i.CuratorFrameworkImpl Default schema
2> 216242 INFO (jetty-launcher-2757-thread-2-EventThread) [] o.a.c.f.s.ConnectionStateManager State change: CONNECTED
2> 216242 INFO (jetty-launcher-2757-thread-1-EventThread) [] o.a.c.f.s.ConnectionStateManager State change: CONNECTED
2> 216243 INFO (jetty-launcher-2757-thread-1-EventThread) [] o.a.c.f.i.EnsembleTracker New config event received: {}
2> 216243 INFO (jetty-launcher-2757-thread-1-EventThread) [] o.a.c.f.i.EnsembleTracker New config event received: {}
2> 216243 INFO (jetty-launcher-2757-thread-2-EventThread) [] o.a.c.f.i.EnsembleTracker New config event received: {}
2> 216243 INFO (jetty-launcher-2757-thread-2-EventThread) [] o.a.c.f.i.EnsembleTracker New config event received: {}
2> 216243 INFO (Curator-Framework-0) [] o.a.c.f.i.CuratorFrameworkImpl backgroundOperationsLoop exiting
2> 216243 INFO (Curator-Framework-0) [] o.a.c.f.i.CuratorFrameworkImpl backgroundOperationsLoop exiting
2> 216344 INFO (jetty-launcher-2757-thread-1) [] o.a.s.c.SolrXmlConfig Loading solr.xml from /home/jenkins/jenkins-agent/workspace/Solr/Solr-Test-10.0/build/tmp/tests-tmp/org.apache.solr.cloud.LeaderTragicEventTest_CFD08609E6849D8D-001/tempDir-001/node1/solr.xml
2> 216344 INFO (jetty-launcher-2757-thread-2) [] o.a.s.c.SolrXmlConfig Loading solr.xml from /home/jenkins/jenkins-agent/workspace/Solr/Solr-Test-10.0/build/tmp/tests-tmp/org.apache.solr.cloud.LeaderTragicEventTest_CFD08609E6849D8D-001/tempDir-001/node2/solr.xml
2> 216346 INFO (jetty-launcher-2757-thread-1) [] o.a.s.c.SolrXmlConfig Metrics collection is disabled.
2> 216346 INFO (jetty-launcher-2757-thread-2) [] o.a.s.c.SolrXmlConfig Metrics collection is disabled.
2> 216353 INFO (jetty-launcher-2757-thread-1) [] o.a.s.c.ZkContainer Zookeeper client=127.0.0.1:34687/solr
2> 216353 WARN (jetty-launcher-2757-thread-1) [] o.a.s.c.c.SolrZkClient Using default ZkCredentialsInjector. ZkCredentialsInjector is not secure, it creates an empty list of credentials which leads to 'OPEN_ACL_UNSAFE' ACLs to Zookeeper nodes
2> 216353 WARN (jetty-launcher-2757-thread-1) [] o.a.s.c.c.SolrZkClient Using default ZkACLProvider. DefaultZkACLProvider is not secure, it creates 'OPEN_ACL_UNSAFE' ACLs to Zookeeper nodes
2> 216353 INFO (jetty-launcher-2757-thread-2) [] o.a.s.c.ZkContainer Zookeeper client=127.0.0.1:34687/solr
2> 216353 WARN (jetty-launcher-2757-thread-2) [] o.a.s.c.c.SolrZkClient Using default ZkCredentialsInjector. ZkCredentialsInjector is not secure, it creates an empty list of credentials which leads to 'OPEN_ACL_UNSAFE' ACLs to Zookeeper nodes
2> 216353 INFO (jetty-launcher-2757-thread-1) [] o.a.c.f.i.CuratorFrameworkImpl Starting
2> 216353 WARN (jetty-launcher-2757-thread-2) [] o.a.s.c.c.SolrZkClient Using default ZkACLProvider. DefaultZkACLProvider is not secure, it creates 'OPEN_ACL_UNSAFE' ACLs to Zookeeper nodes
2> 216354 INFO (jetty-launcher-2757-thread-2) [] o.a.c.f.i.CuratorFrameworkImpl Starting
2> 216355 INFO (jetty-launcher-2757-thread-1) [] o.a.c.f.i.CuratorFrameworkImpl Default schema
2> 216355 INFO (jetty-launcher-2757-thread-2) [] o.a.c.f.i.CuratorFrameworkImpl Default schema
2> 216356 INFO (jetty-launcher-2757-thread-1-EventThread) [] o.a.c.f.s.ConnectionStateManager State change: CONNECTED
2> 216356 INFO (jetty-launcher-2757-thread-2-EventThread) [] o.a.c.f.s.ConnectionStateManager State change: CONNECTED
2> 216356 INFO (jetty-launcher-2757-thread-1-EventThread) [] o.a.c.f.i.EnsembleTracker New config event received: {}
2> 216356 INFO (jetty-launcher-2757-thread-1-EventThread) [] o.a.c.f.i.EnsembleTracker New config event received: {}
2> 216356 INFO (jetty-launcher-2757-thread-2-EventThread) [] o.a.c.f.i.EnsembleTracker New config event received: {}
2> 216356 INFO (jetty-launcher-2757-thread-2-EventThread) [] o.a.c.f.i.EnsembleTracker New config event received: {}
2> 216356 INFO (Curator-Framework-0) [] o.a.c.f.i.CuratorFrameworkImpl backgroundOperationsLoop exiting
2> 216356 INFO (Curator-Framework-0) [] o.a.c.f.i.CuratorFrameworkImpl backgroundOperationsLoop exiting
2> 216458 INFO (jetty-launcher-2757-thread-1) [n:127.0.0.1:41577_solr] o.a.c.f.i.CuratorFrameworkImpl Starting
2> 216458 INFO (jetty-launcher-2757-thread-2) [n:127.0.0.1:36415_solr] o.a.c.f.i.CuratorFrameworkImpl Starting
2> 216459 INFO (jetty-launcher-2757-thread-1) [n:127.0.0.1:41577_solr] o.a.c.f.i.CuratorFrameworkImpl Default schema
2> 216459 INFO (jetty-launcher-2757-thread-2) [n:127.0.0.1:36415_solr] o.a.c.f.i.CuratorFrameworkImpl Default schema
2> 216460 INFO (jetty-launcher-2757-thread-1-EventThread) [] o.a.c.f.s.ConnectionStateManager State change: CONNECTED
2> 216460 INFO (jetty-launcher-2757-thread-2-EventThread) [] o.a.c.f.s.ConnectionStateManager State change: CONNECTED
2> 216460 INFO (jetty-launcher-2757-thread-1-EventThread) [] o.a.c.f.i.EnsembleTracker New config event received: {}
2> 216460 INFO (jetty-launcher-2757-thread-2-EventThread) [] o.a.c.f.i.EnsembleTracker New config event received: {}
2> 216460 INFO (jetty-launcher-2757-thread-1-EventThread) [] o.a.c.f.i.EnsembleTracker New config event received: {}
2> 216460 INFO (jetty-launcher-2757-thread-2-EventThread) [] o.a.c.f.i.EnsembleTracker New config event received: {}
2> 216475 WARN (jetty-launcher-2757-thread-1) [n:127.0.0.1:41577_solr] o.a.s.c.ZkController Contents of zookeeper /security.json are world-readable; consider setting up ACLs as described in https://solr.apache.org/guide/solr/latest/deployment-guide/zookeeper-access-control.html
2> 216476 WARN (jetty-launcher-2757-thread-2) [n:127.0.0.1:36415_solr] o.a.s.c.ZkController Contents of zookeeper /security.json are world-readable; consider setting up ACLs as described in https://solr.apache.org/guide/solr/latest/deployment-guide/zookeeper-access-control.html
2> 216478 INFO (jetty-launcher-2757-thread-2) [n:127.0.0.1:36415_solr] o.a.s.c.ZkController The Overseer is enabled. It will process all cluster commands & state updates.
2> 216478 INFO (jetty-launcher-2757-thread-1) [n:127.0.0.1:41577_solr] o.a.s.c.ZkController The Overseer is enabled. It will process all cluster commands & state updates.
2> 216481 INFO (jetty-launcher-2757-thread-2) [n:127.0.0.1:36415_solr] o.a.s.c.OverseerElectionContext I am going to be the leader 127.0.0.1:36415_solr
2> 216481 INFO (jetty-launcher-2757-thread-2) [n:127.0.0.1:36415_solr] o.a.s.c.Overseer Overseer (id=72081152449052680-127.0.0.1:36415_solr-n_0000000000) starting
2> 216481 INFO (jetty-launcher-2757-thread-1) [n:127.0.0.1:41577_solr] o.a.s.c.ZkController Register node as live in ZooKeeper: /live_nodes/127.0.0.1:41577_solr
2> 216483 INFO (zkCallback-2790-thread-1) [] o.a.s.c.c.ZkStateReader Updated live nodes from ZooKeeper... (0) -> (1)
2> 216483 INFO (zkCallback-2787-thread-1) [] o.a.s.c.c.ZkStateReader Updated live nodes from ZooKeeper... (0) -> (1)
2> 216485 INFO (OverseerStateUpdate-72081152449052680-127.0.0.1:36415_solr-n_0000000000) [n:127.0.0.1:36415_solr] o.a.s.c.Overseer Starting to work on the main queue : 127.0.0.1:36415_solr
2> 216485 INFO (jetty-launcher-2757-thread-2) [n:127.0.0.1:36415_solr] o.a.s.c.ZkController Publish node=127.0.0.1:36415_solr as DOWN
2> 216485 WARN (jetty-launcher-2757-thread-1) [n:127.0.0.1:41577_solr] o.a.s.c.CoreContainer Not all security plugins configured! authentication=disabled authorization=disabled. Solr is only as secure as you make it. Consider configuring authentication/authorization before exposing Solr to users internal or external. See https://s.apache.org/solrsecurity for more info
2> 216486 INFO (jetty-launcher-2757-thread-2) [n:127.0.0.1:36415_solr] o.a.s.c.ZkController Register node as live in ZooKeeper: /live_nodes/127.0.0.1:36415_solr
2> 216488 INFO (zkCallback-2787-thread-1) [] o.a.s.c.c.ZkStateReader Updated live nodes from ZooKeeper... (1) -> (2)
2> 216488 INFO (zkCallback-2790-thread-1) [] o.a.s.c.c.ZkStateReader Updated live nodes from ZooKeeper... (1) -> (2)
2> 216490 WARN (jetty-launcher-2757-thread-2) [n:127.0.0.1:36415_solr] o.a.s.c.CoreContainer Not all security plugins configured! authentication=disabled authorization=disabled. Solr is only as secure as you make it. Consider configuring authentication/authorization before exposing Solr to users internal or external. See https://s.apache.org/solrsecurity for more info
2> 216510 INFO (jetty-launcher-2757-thread-2) [n:127.0.0.1:36415_solr] o.a.s.c.CorePropertiesLocator Found 0 core definitions underneath /home/jenkins/jenkins-agent/workspace/Solr/Solr-Test-10.0/build/tmp/tests-tmp/org.apache.solr.cloud.LeaderTragicEventTest_CFD08609E6849D8D-001/tempDir-001/node2
2> 216582 INFO (jetty-launcher-2757-thread-2) [n:127.0.0.1:36415_solr] o.a.s.j.SolrRequestAuthorizer Creating a new SolrRequestAuthorizer
2> 216589 INFO (jetty-launcher-2757-thread-1) [n:127.0.0.1:41577_solr] o.a.s.c.CorePropertiesLocator Found 0 core definitions underneath /home/jenkins/jenkins-agent/workspace/Solr/Solr-Test-10.0/build/tmp/tests-tmp/org.apache.solr.cloud.LeaderTragicEventTest_CFD08609E6849D8D-001/tempDir-001/node1
2> 216595 INFO (jetty-launcher-2757-thread-2) [n:127.0.0.1:36415_solr] o.e.j.e.s.ServletContextHandler Started oeje10s.ServletContextHandler@bedba07{/solr,/solr,b=file:///home/jenkins/jenkins-agent/workspace/Solr/Solr-Test-10.0/solr/core/build/tmp/tests-cwd/,a=AVAILABLE,h=oeje10s.SessionHandler@147399af{STARTED}}
2> 216596 INFO (jetty-launcher-2757-thread-2) [n:127.0.0.1:36415_solr] o.e.j.s.AbstractConnector Started ServerConnector@171a5ca6{HTTP/1.1, (http/1.1, h2c)}{127.0.0.1:36415}
2> 216596 INFO (jetty-launcher-2757-thread-2) [n:127.0.0.1:36415_solr] o.e.j.s.Server Started oejs.Server@18caca7a{STARTING}[12.0.27,sto=15000] @216615ms
2> 216621 INFO (jetty-launcher-2757-thread-1) [n:127.0.0.1:41577_solr] o.a.s.j.SolrRequestAuthorizer Creating a new SolrRequestAuthorizer
2> 216634 INFO (jetty-launcher-2757-thread-1) [n:127.0.0.1:41577_solr] o.e.j.e.s.ServletContextHandler Started oeje10s.ServletContextHandler@683af489{/solr,/solr,b=file:///home/jenkins/jenkins-agent/workspace/Solr/Solr-Test-10.0/solr/core/build/tmp/tests-cwd/,a=AVAILABLE,h=oeje10s.SessionHandler@133cea8b{STARTED}}
2> 216635 INFO (jetty-launcher-2757-thread-1) [n:127.0.0.1:41577_solr] o.e.j.s.AbstractConnector Started ServerConnector@17dfcc4c{HTTP/1.1, (http/1.1, h2c)}{127.0.0.1:41577}
2> 216635 INFO (jetty-launcher-2757-thread-1) [n:127.0.0.1:41577_solr] o.e.j.s.Server Started oejs.Server@78473386{STARTING}[12.0.27,sto=15000] @216654ms
2> 216636 INFO (SUITE-LeaderTragicEventTest-seed#[CFD08609E6849D8D]-worker) [] o.a.s.c.MiniSolrCloudCluster waitForAllNodes: numServers=2
2> 216636 INFO (SUITE-LeaderTragicEventTest-seed#[CFD08609E6849D8D]-worker) [] o.a.s.c.MiniSolrCloudCluster waitForNode: 127.0.0.1:36415_solr
2> 216636 WARN (SUITE-LeaderTragicEventTest-seed#[CFD08609E6849D8D]-worker) [] o.a.s.c.c.SolrZkClient Using default ZkCredentialsInjector. ZkCredentialsInjector is not secure, it creates an empty list of credentials which leads to 'OPEN_ACL_UNSAFE' ACLs to Zookeeper nodes
2> 216636 WARN (SUITE-LeaderTragicEventTest-seed#[CFD08609E6849D8D]-worker) [] o.a.s.c.c.SolrZkClient Using default ZkACLProvider. DefaultZkACLProvider is not secure, it creates 'OPEN_ACL_UNSAFE' ACLs to Zookeeper nodes
2> 216636 INFO (SUITE-LeaderTragicEventTest-seed#[CFD08609E6849D8D]-worker) [] o.a.c.f.i.CuratorFrameworkImpl Starting
2> 216637 INFO (SUITE-LeaderTragicEventTest-seed#[CFD08609E6849D8D]-worker) [] o.a.c.f.i.CuratorFrameworkImpl Default schema
2> 216638 INFO (SUITE-LeaderTragicEventTest-seed#[CFD08609E6849D8D]-worker-EventThread) [] o.a.c.f.s.ConnectionStateManager State change: CONNECTED
2> 216639 INFO (SUITE-LeaderTragicEventTest-seed#[CFD08609E6849D8D]-worker-EventThread) [] o.a.c.f.i.EnsembleTracker New config event received: {}
2> 216639 INFO (SUITE-LeaderTragicEventTest-seed#[CFD08609E6849D8D]-worker-EventThread) [] o.a.c.f.i.EnsembleTracker New config event received: {}
2> 216640 INFO (SUITE-LeaderTragicEventTest-seed#[CFD08609E6849D8D]-worker) [] o.a.s.c.c.ZkStateReader Updated live nodes from ZooKeeper... (0) -> (2)
2> 216640 INFO (SUITE-LeaderTragicEventTest-seed#[CFD08609E6849D8D]-worker) [] o.a.s.c.s.i.ZkClientClusterStateProvider Cluster at 127.0.0.1:34687/solr ready
2> 216641 INFO (SUITE-LeaderTragicEventTest-seed#[CFD08609E6849D8D]-worker) [] o.a.s.c.MiniSolrCloudCluster waitForNode: 127.0.0.1:41577_solr
2> 216641 WARN (SUITE-LeaderTragicEventTest-seed#[CFD08609E6849D8D]-worker) [] o.a.s.c.c.SolrZkClient Using default ZkCredentialsInjector. ZkCredentialsInjector is not secure, it creates an empty list of credentials which leads to 'OPEN_ACL_UNSAFE' ACLs to Zookeeper nodes
2> 216641 WARN (SUITE-LeaderTragicEventTest-seed#[CFD08609E6849D8D]-worker) [] o.a.s.c.c.SolrZkClient Using default ZkACLProvider. DefaultZkACLProvider is not secure, it creates 'OPEN_ACL_UNSAFE' ACLs to Zookeeper nodes
2> 216641 INFO (SUITE-LeaderTragicEventTest-seed#[CFD08609E6849D8D]-worker) [] o.a.c.f.i.CuratorFrameworkImpl Starting
2> 216642 INFO (SUITE-LeaderTragicEventTest-seed#[CFD08609E6849D8D]-worker) [] o.a.c.f.i.CuratorFrameworkImpl Default schema
2> 216642 INFO (SUITE-LeaderTragicEventTest-seed#[CFD08609E6849D8D]-worker-EventThread) [] o.a.c.f.s.ConnectionStateManager State change: CONNECTED
2> 216643 INFO (SUITE-LeaderTragicEventTest-seed#[CFD08609E6849D8D]-worker-EventThread) [] o.a.c.f.i.EnsembleTracker New config event received: {}
2> 216643 INFO (SUITE-LeaderTragicEventTest-seed#[CFD08609E6849D8D]-worker-EventThread) [] o.a.c.f.i.EnsembleTracker New config event received: {}
2> 216646 INFO (Curator-Framework-0) [] o.a.c.f.i.CuratorFrameworkImpl backgroundOperationsLoop exiting
2> 216752 INFO (TEST-LeaderTragicEventTest.testOtherReplicasAreNotActive-seed#[CFD08609E6849D8D]) [] o.a.s.SolrTestCaseJ4 ###Starting testOtherReplicasAreNotActive
2> 216758 INFO (OverseerThreadFactory-2798-thread-1) [ c:testOtherReplicasAreNotActive t:null-13579] o.a.s.c.a.c.CreateCollectionCmd Create collection testOtherReplicasAreNotActive
2> 216758 INFO (OverseerThreadFactory-2798-thread-1) [ c:testOtherReplicasAreNotActive t:null-13579] o.a.s.c.a.c.CreateCollectionCmd solr.cloud.prs.enabled : false and collection prs : null, isPRS : false
2> 216762 INFO (OverseerThreadFactory-2798-thread-1) [ c:testOtherReplicasAreNotActive t:null-13579] o.a.s.c.c.ZkStateReader /collections/testOtherReplicasAreNotActive/state.json is deleted, stop watching children
2> 216762 INFO (zkCallback-2790-thread-1) [] o.a.s.c.c.ZkStateReader A cluster state change: [WatchedEvent state:SyncConnected type:NodeCreated path:/collections/testOtherReplicasAreNotActive/state.json zxid: -1] for collection [testOtherReplicasAreNotActive] has occurred - updating... (live nodes size: [2])
2> 216768 INFO (OverseerStateUpdate-72081152449052680-127.0.0.1:36415_solr-n_0000000000) [n:127.0.0.1:36415_solr] o.a.s.c.o.SliceMutator createReplica() {
2> "core":"testOtherReplicasAreNotActive_shard1_replica_n1",
2> "node_name":"127.0.0.1:36415_solr",
2> "base_url":"http://127.0.0.1:36415/solr",
2> "collection":"testOtherReplicasAreNotActive",
2> "shard":"shard1",
2> "state":"down",
2> "type":"NRT",
2> "operation":"ADDREPLICA",
2> "waitForFinalState":"false"}
2> 216770 INFO (OverseerStateUpdate-72081152449052680-127.0.0.1:36415_solr-n_0000000000) [n:127.0.0.1:36415_solr] o.a.s.c.o.SliceMutator createReplica() {
2> "core":"testOtherReplicasAreNotActive_shard1_replica_n2",
2> "node_name":"127.0.0.1:41577_solr",
2> "base_url":"http://127.0.0.1:41577/solr",
2> "collection":"testOtherReplicasAreNotActive",
2> "shard":"shard1",
2> "state":"down",
2> "type":"NRT",
2> "operation":"ADDREPLICA",
2> "waitForFinalState":"false"}
2> 216873 INFO (zkCallback-2790-thread-2) [] o.a.s.c.c.ZkStateReader A cluster state change: [WatchedEvent state:SyncConnected type:NodeDataChanged path:/collections/testOtherReplicasAreNotActive/state.json zxid: -1] for collection [testOtherReplicasAreNotActive] has occurred - updating... (live nodes size: [2])
2> 216877 INFO (qtp2130036476-4748-null-13579) [n:127.0.0.1:36415_solr x:testOtherReplicasAreNotActive_shard1_replica_n1 t:null-13579] o.a.s.h.a.a.CreateCore core create command "org.apache.solr.client.api.model.CreateCoreParams@43ccba47"
2> 216877 INFO (qtp682135778-4743-null-13579) [n:127.0.0.1:41577_solr x:testOtherReplicasAreNotActive_shard1_replica_n2 t:null-13579] o.a.s.h.a.a.CreateCore core create command "org.apache.solr.client.api.model.CreateCoreParams@32bf6b47"
2> 216884 INFO (qtp2130036476-4748-null-13579) [n:127.0.0.1:36415_solr c:testOtherReplicasAreNotActive s:shard1 r:core_node3 x:testOtherReplicasAreNotActive_shard1_replica_n1 t:null-13579] o.a.s.c.SolrConfig Using Lucene MatchVersion: 10.3.2
2> 216884 INFO (qtp682135778-4743-null-13579) [n:127.0.0.1:41577_solr c:testOtherReplicasAreNotActive s:shard1 r:core_node4 x:testOtherReplicasAreNotActive_shard1_replica_n2 t:null-13579] o.a.s.c.SolrConfig Using Lucene MatchVersion: 10.3.2
2> 216886 INFO (qtp2130036476-4748-null-13579) [n:127.0.0.1:36415_solr c:testOtherReplicasAreNotActive s:shard1 r:core_node3 x:testOtherReplicasAreNotActive_shard1_replica_n1 t:null-13579] o.a.s.s.IndexSchema Schema name=minimal
2> 216886 INFO (qtp682135778-4743-null-13579) [n:127.0.0.1:41577_solr c:testOtherReplicasAreNotActive s:shard1 r:core_node4 x:testOtherReplicasAreNotActive_shard1_replica_n2 t:null-13579] o.a.s.s.IndexSchema Schema name=minimal
2> 216886 INFO (qtp2130036476-4748-null-13579) [n:127.0.0.1:36415_solr c:testOtherReplicasAreNotActive s:shard1 r:core_node3 x:testOtherReplicasAreNotActive_shard1_replica_n1 t:null-13579] o.a.s.s.IndexSchema Loaded schema minimal/1.7 with uniqueid field id
2> 216886 INFO (qtp2130036476-4748-null-13579) [n:127.0.0.1:36415_solr c:testOtherReplicasAreNotActive s:shard1 r:core_node3 x:testOtherReplicasAreNotActive_shard1_replica_n1 t:null-13579] o.a.s.c.CoreContainer Creating SolrCore 'testOtherReplicasAreNotActive_shard1_replica_n1' using configuration from configset config
2> 216886 INFO (qtp682135778-4743-null-13579) [n:127.0.0.1:41577_solr c:testOtherReplicasAreNotActive s:shard1 r:core_node4 x:testOtherReplicasAreNotActive_shard1_replica_n2 t:null-13579] o.a.s.s.IndexSchema Loaded schema minimal/1.7 with uniqueid field id
2> 216886 INFO (qtp682135778-4743-null-13579) [n:127.0.0.1:41577_solr c:testOtherReplicasAreNotActive s:shard1 r:core_node4 x:testOtherReplicasAreNotActive_shard1_replica_n2 t:null-13579] o.a.s.c.CoreContainer Creating SolrCore 'testOtherReplicasAreNotActive_shard1_replica_n2' using configuration from configset config
2> 216887 INFO (qtp682135778-4743-null-13579) [n:127.0.0.1:41577_solr c:testOtherReplicasAreNotActive s:shard1 r:core_node4 x:testOtherReplicasAreNotActive_shard1_replica_n2 t:null-13579] o.a.s.c.SolrCore Opening new SolrCore at [/home/jenkins/jenkins-agent/workspace/Solr/Solr-Test-10.0/build/tmp/tests-tmp/org.apache.solr.cloud.LeaderTragicEventTest_CFD08609E6849D8D-001/tempDir-001/node1/testOtherReplicasAreNotActive_shard1_replica_n2], dataDir=[/home/jenkins/jenkins-agent/workspace/Solr/Solr-Test-10.0/build/tmp/tests-tmp/org.apache.solr.cloud.LeaderTragicEventTest_CFD08609E6849D8D-001/tempDir-001/node1/testOtherReplicasAreNotActive_shard1_replica_n2/data/]
2> 216887 INFO (qtp2130036476-4748-null-13579) [n:127.0.0.1:36415_solr c:testOtherReplicasAreNotActive s:shard1 r:core_node3 x:testOtherReplicasAreNotActive_shard1_replica_n1 t:null-13579] o.a.s.c.SolrCore Opening new SolrCore at [/home/jenkins/jenkins-agent/workspace/Solr/Solr-Test-10.0/build/tmp/tests-tmp/org.apache.solr.cloud.LeaderTragicEventTest_CFD08609E6849D8D-001/tempDir-001/node2/testOtherReplicasAreNotActive_shard1_replica_n1], dataDir=[/home/jenkins/jenkins-agent/workspace/Solr/Solr-Test-10.0/build/tmp/tests-tmp/org.apache.solr.cloud.LeaderTragicEventTest_CFD08609E6849D8D-001/tempDir-001/node2/testOtherReplicasAreNotActive_shard1_replica_n1/data/]
2> 216916 INFO (qtp2130036476-4748-null-13579) [n:127.0.0.1:36415_solr c:testOtherReplicasAreNotActive s:shard1 r:core_node3 x:testOtherReplicasAreNotActive_shard1_replica_n1 t:null-13579] o.a.s.j.SolrRequestAuthorizer Creating a new SolrRequestAuthorizer
2> 216920 INFO (qtp2130036476-4748-null-13579) [n:127.0.0.1:36415_solr c:testOtherReplicasAreNotActive s:shard1 r:core_node3 x:testOtherReplicasAreNotActive_shard1_replica_n1 t:null-13579] o.a.s.u.UpdateHandler Using UpdateLog implementation: org.apache.solr.update.UpdateLog
2> 216920 INFO (qtp2130036476-4748-null-13579) [n:127.0.0.1:36415_solr c:testOtherReplicasAreNotActive s:shard1 r:core_node3 x:testOtherReplicasAreNotActive_shard1_replica_n1 t:null-13579] o.a.s.u.UpdateLog Initializing UpdateLog: dataDir=null defaultSyncLevel=FLUSH numRecordsToKeep=100 maxNumLogsToKeep=10
2> 216920 INFO (qtp2130036476-4748-null-13579) [n:127.0.0.1:36415_solr c:testOtherReplicasAreNotActive s:shard1 r:core_node3 x:testOtherReplicasAreNotActive_shard1_replica_n1 t:null-13579] o.a.s.u.CommitTracker Hard AutoCommit: disabled
2> 216920 INFO (qtp2130036476-4748-null-13579) [n:127.0.0.1:36415_solr c:testOtherReplicasAreNotActive s:shard1 r:core_node3 x:testOtherReplicasAreNotActive_shard1_replica_n1 t:null-13579] o.a.s.u.CommitTracker Soft AutoCommit: disabled
2> 216921 INFO (qtp682135778-4743-null-13579) [n:127.0.0.1:41577_solr c:testOtherReplicasAreNotActive s:shard1 r:core_node4 x:testOtherReplicasAreNotActive_shard1_replica_n2 t:null-13579] o.a.s.j.SolrRequestAuthorizer Creating a new SolrRequestAuthorizer
2> 216923 INFO (qtp2130036476-4748-null-13579) [n:127.0.0.1:36415_solr c:testOtherReplicasAreNotActive s:shard1 r:core_node3 x:testOtherReplicasAreNotActive_shard1_replica_n1 t:null-13579] o.a.s.r.ManagedResourceStorage Configured ZooKeeperStorageIO with znodeBase: /configs/config
2> 216924 INFO (qtp2130036476-4748-null-13579) [n:127.0.0.1:36415_solr c:testOtherReplicasAreNotActive s:shard1 r:core_node3 x:testOtherReplicasAreNotActive_shard1_replica_n1 t:null-13579] o.a.s.r.ManagedResourceStorage Loaded null at path _rest_managed.json using ZooKeeperStorageIO:path=/configs/config
2> 216924 INFO (qtp2130036476-4748-null-13579) [n:127.0.0.1:36415_solr c:testOtherReplicasAreNotActive s:shard1 r:core_node3 x:testOtherReplicasAreNotActive_shard1_replica_n1 t:null-13579] o.a.s.h.ReplicationHandler Commits will be reserved for 10000 ms
2> 216925 INFO (searcherExecutor-2814-thread-1-processing-127.0.0.1:36415_solr testOtherReplicasAreNotActive_shard1_replica_n1 null-13579 testOtherReplicasAreNotActive shard1 core_node3) [n:127.0.0.1:36415_solr c:testOtherReplicasAreNotActive s:shard1 r:core_node3 x:testOtherReplicasAreNotActive_shard1_replica_n1 t:null-13579] o.a.s.c.SolrCore Registered new searcher autowarm time: 0 ms
2> 216926 INFO (qtp682135778-4743-null-13579) [n:127.0.0.1:41577_solr c:testOtherReplicasAreNotActive s:shard1 r:core_node4 x:testOtherReplicasAreNotActive_shard1_replica_n2 t:null-13579] o.a.s.u.UpdateHandler Using UpdateLog implementation: org.apache.solr.update.UpdateLog
2> 216926 INFO (qtp682135778-4743-null-13579) [n:127.0.0.1:41577_solr c:testOtherReplicasAreNotActive s:shard1 r:core_node4 x:testOtherReplicasAreNotActive_shard1_replica_n2 t:null-13579] o.a.s.u.UpdateLog Initializing UpdateLog: dataDir=null defaultSyncLevel=FLUSH numRecordsToKeep=100 maxNumLogsToKeep=10
2> 216926 INFO (qtp682135778-4743-null-13579) [n:127.0.0.1:41577_solr c:testOtherReplicasAreNotActive s:shard1 r:core_node4 x:testOtherReplicasAreNotActive_shard1_replica_n2 t:null-13579] o.a.s.u.CommitTracker Hard AutoCommit: disabled
2> 216926 INFO (qtp682135778-4743-null-13579) [n:127.0.0.1:41577_solr c:testOtherReplicasAreNotActive s:shard1 r:core_node4 x:testOtherReplicasAreNotActive_shard1_replica_n2 t:null-13579] o.a.s.u.CommitTracker Soft AutoCommit: disabled
2> 216928 INFO (qtp2130036476-4748-null-13579) [n:127.0.0.1:36415_solr c:testOtherReplicasAreNotActive s:shard1 r:core_node3 x:testOtherReplicasAreNotActive_shard1_replica_n1 t:null-13579] o.a.s.c.ZkShardTerms Successful update of terms at /collections/testOtherReplicasAreNotActive/terms/shard1 to Terms{values={core_node3=0}, version=0} for registerTerm
2> 216928 INFO (qtp2130036476-4748-null-13579) [n:127.0.0.1:36415_solr c:testOtherReplicasAreNotActive s:shard1 r:core_node3 x:testOtherReplicasAreNotActive_shard1_replica_n1 t:null-13579] o.a.s.c.ShardLeaderElectionContextBase make sure parent is created /collections/testOtherReplicasAreNotActive/leaders/shard1
2> 216929 INFO (qtp682135778-4743-null-13579) [n:127.0.0.1:41577_solr c:testOtherReplicasAreNotActive s:shard1 r:core_node4 x:testOtherReplicasAreNotActive_shard1_replica_n2 t:null-13579] o.a.s.r.ManagedResourceStorage Configured ZooKeeperStorageIO with znodeBase: /configs/config
2> 216929 INFO (qtp682135778-4743-null-13579) [n:127.0.0.1:41577_solr c:testOtherReplicasAreNotActive s:shard1 r:core_node4 x:testOtherReplicasAreNotActive_shard1_replica_n2 t:null-13579] o.a.s.r.ManagedResourceStorage Loaded null at path _rest_managed.json using ZooKeeperStorageIO:path=/configs/config
2> 216929 INFO (qtp682135778-4743-null-13579) [n:127.0.0.1:41577_solr c:testOtherReplicasAreNotActive s:shard1 r:core_node4 x:testOtherReplicasAreNotActive_shard1_replica_n2 t:null-13579] o.a.s.h.ReplicationHandler Commits will be reserved for 10000 ms
2> 216930 INFO (searcherExecutor-2816-thread-1-processing-127.0.0.1:41577_solr testOtherReplicasAreNotActive_shard1_replica_n2 null-13579 testOtherReplicasAreNotActive shard1 core_node4) [n:127.0.0.1:41577_solr c:testOtherReplicasAreNotActive s:shard1 r:core_node4 x:testOtherReplicasAreNotActive_shard1_replica_n2 t:null-13579] o.a.s.c.SolrCore Registered new searcher autowarm time: 0 ms
2> 216932 INFO (qtp682135778-4743-null-13579) [n:127.0.0.1:41577_solr c:testOtherReplicasAreNotActive s:shard1 r:core_node4 x:testOtherReplicasAreNotActive_shard1_replica_n2 t:null-13579] o.a.s.c.ZkShardTerms Successful update of terms at /collections/testOtherReplicasAreNotActive/terms/shard1 to Terms{values={core_node3=0, core_node4=0}, version=1} for registerTerm
2> 216932 INFO (qtp682135778-4743-null-13579) [n:127.0.0.1:41577_solr c:testOtherReplicasAreNotActive s:shard1 r:core_node4 x:testOtherReplicasAreNotActive_shard1_replica_n2 t:null-13579] o.a.s.c.ShardLeaderElectionContextBase make sure parent is created /collections/testOtherReplicasAreNotActive/leaders/shard1
2> 216937 INFO (qtp2130036476-4748-null-13579) [n:127.0.0.1:36415_solr c:testOtherReplicasAreNotActive s:shard1 r:core_node3 x:testOtherReplicasAreNotActive_shard1_replica_n1 t:null-13579] o.a.s.c.ShardLeaderElectionContext Enough replicas found to continue.
2> 216937 INFO (qtp2130036476-4748-null-13579) [n:127.0.0.1:36415_solr c:testOtherReplicasAreNotActive s:shard1 r:core_node3 x:testOtherReplicasAreNotActive_shard1_replica_n1 t:null-13579] o.a.s.c.ShardLeaderElectionContext I may be the new leader - try and sync
2> 216937 INFO (qtp2130036476-4748-null-13579) [n:127.0.0.1:36415_solr c:testOtherReplicasAreNotActive s:shard1 r:core_node3 x:testOtherReplicasAreNotActive_shard1_replica_n1 t:null-13579] o.a.s.c.SyncStrategy Sync replicas to http://127.0.0.1:36415/solr/testOtherReplicasAreNotActive_shard1_replica_n1/
2> 216937 INFO (qtp2130036476-4748-null-13579) [n:127.0.0.1:36415_solr c:testOtherReplicasAreNotActive s:shard1 r:core_node3 x:testOtherReplicasAreNotActive_shard1_replica_n1 t:null-13579] o.a.s.u.PeerSync PeerSync: core=testOtherReplicasAreNotActive_shard1_replica_n1 url=http://127.0.0.1:36415/solr START replicas=[http://127.0.0.1:41577/solr/testOtherReplicasAreNotActive_shard1_replica_n2/] nUpdates=100
2> 216938 INFO (qtp2130036476-4748-null-13579) [n:127.0.0.1:36415_solr c:testOtherReplicasAreNotActive s:shard1 r:core_node3 x:testOtherReplicasAreNotActive_shard1_replica_n1 t:null-13579] o.a.s.u.PeerSync PeerSync: core=testOtherReplicasAreNotActive_shard1_replica_n1 url=http://127.0.0.1:36415/solr DONE. We have no versions. sync failed.
2> 216938 INFO (qtp682135778-4745-null-13579) [n:127.0.0.1:41577_solr c:testOtherReplicasAreNotActive s:shard1 r:core_node4 x:testOtherReplicasAreNotActive_shard1_replica_n2 t:null-13579] o.a.s.c.S.Request path=/get params={distrib=false&qt=/get&fingerprint=false&getVersions=100&wt=javabin} status=0 QTime=0
2> 216939 INFO (qtp2130036476-4748-null-13579) [n:127.0.0.1:36415_solr c:testOtherReplicasAreNotActive s:shard1 r:core_node3 x:testOtherReplicasAreNotActive_shard1_replica_n1 t:null-13579] o.a.s.c.SyncStrategy Leader's attempt to sync with shard failed, moving to the next candidate
2> 216939 INFO (qtp2130036476-4748-null-13579) [n:127.0.0.1:36415_solr c:testOtherReplicasAreNotActive s:shard1 r:core_node3 x:testOtherReplicasAreNotActive_shard1_replica_n1 t:null-13579] o.a.s.c.ShardLeaderElectionContext We failed sync, but we have no versions - we can't sync in that case - we were active before, so become leader anyway
2> 216939 INFO (qtp2130036476-4748-null-13579) [n:127.0.0.1:36415_solr c:testOtherReplicasAreNotActive s:shard1 r:core_node3 x:testOtherReplicasAreNotActive_shard1_replica_n1 t:null-13579] o.a.s.c.ShardLeaderElectionContextBase Creating leader registration node /collections/testOtherReplicasAreNotActive/leaders/shard1/leader after winning as /collections/testOtherReplicasAreNotActive/leader_elect/shard1/election/72081152449052680-core_node3-n_0000000000
2> 216941 INFO (qtp2130036476-4748-null-13579) [n:127.0.0.1:36415_solr c:testOtherReplicasAreNotActive s:shard1 r:core_node3 x:testOtherReplicasAreNotActive_shard1_replica_n1 t:null-13579] o.a.s.c.ShardLeaderElectionContext I am the new leader: http://127.0.0.1:36415/solr/testOtherReplicasAreNotActive_shard1_replica_n1/ shard1
2> 217043 INFO (zkCallback-2790-thread-1) [] o.a.s.c.c.ZkStateReader A cluster state change: [WatchedEvent state:SyncConnected type:NodeDataChanged path:/collections/testOtherReplicasAreNotActive/state.json zxid: -1] for collection [testOtherReplicasAreNotActive] has occurred - updating... (live nodes size: [2])
2> 217044 INFO (qtp2130036476-4748-null-13579) [n:127.0.0.1:36415_solr c:testOtherReplicasAreNotActive s:shard1 r:core_node3 x:testOtherReplicasAreNotActive_shard1_replica_n1 t:null-13579] o.a.s.c.ZkController I am the leader, no recovery necessary
2> 217047 INFO (qtp2130036476-4748-null-13579) [n:127.0.0.1:36415_solr t:null-13579] o.a.s.s.HttpSolrCall [admin] path=/admin/cores params={qt=/admin/cores&coreNodeName=core_node3&collection.configName=config&newCollection=true&name=testOtherReplicasAreNotActive_shard1_replica_n1&action=CREATE&numShards=1&collection=testOtherReplicasAreNotActive&shard=shard1&wt=javabin&replicaType=NRT} status=0 QTime=170
2> 217147 INFO (zkCallback-2790-thread-1) [] o.a.s.c.c.ZkStateReader A cluster state change: [WatchedEvent state:SyncConnected type:NodeDataChanged path:/collections/testOtherReplicasAreNotActive/state.json zxid: -1] for collection [testOtherReplicasAreNotActive] has occurred - updating... (live nodes size: [2])
2> 217941 INFO (qtp682135778-4743-null-13579) [n:127.0.0.1:41577_solr t:null-13579] o.a.s.s.HttpSolrCall [admin] path=/admin/cores params={qt=/admin/cores&coreNodeName=core_node4&collection.configName=config&newCollection=true&name=testOtherReplicasAreNotActive_shard1_replica_n2&action=CREATE&numShards=1&collection=testOtherReplicasAreNotActive&shard=shard1&wt=javabin&replicaType=NRT} status=0 QTime=1064
2> 217944 INFO (qtp2130036476-4742-null-13578) [n:127.0.0.1:36415_solr c:testOtherReplicasAreNotActive t:null-13578] o.a.s.h.a.CollectionsHandler Wait for new collection to be active for at most 45 seconds. Check all shard replicas
2> 218041 INFO (zkCallback-2790-thread-1) [] o.a.s.c.c.ZkStateReader A cluster state change: [WatchedEvent state:SyncConnected type:NodeDataChanged path:/collections/testOtherReplicasAreNotActive/state.json zxid: -1] for collection [testOtherReplicasAreNotActive] has occurred - updating... (live nodes size: [2])
2> 218041 INFO (zkCallback-2787-thread-1) [] o.a.s.c.c.ZkStateReader A cluster state change: [WatchedEvent state:SyncConnected type:NodeDataChanged path:/collections/testOtherReplicasAreNotActive/state.json zxid: -1] for collection [testOtherReplicasAreNotActive] has occurred - updating... (live nodes size: [2])
2> 218042 INFO (qtp2130036476-4742-null-13578) [n:127.0.0.1:36415_solr c:testOtherReplicasAreNotActive t:null-13578] o.a.s.s.HttpSolrCall [admin] path=/admin/collections params={collection.configName=config&name=testOtherReplicasAreNotActive&nrtReplicas=2&action=CREATE&numShards=1&wt=javabin} status=0 QTime=1288
2> 218043 INFO (TEST-LeaderTragicEventTest.testOtherReplicasAreNotActive-seed#[CFD08609E6849D8D]) [] o.a.s.c.MiniSolrCloudCluster waitForActiveCollection: testOtherReplicasAreNotActive
2> 218044 INFO (TEST-LeaderTragicEventTest.testOtherReplicasAreNotActive-seed#[CFD08609E6849D8D]) [] o.a.s.c.LeaderTragicEventTest Stop jetty node : http://127.0.0.1:41577/solr state:DocCollection(testOtherReplicasAreNotActive//collections/testOtherReplicasAreNotActive/state.json/4 )={
2> "pullReplicas":"0",
2> "configName":"config",
2> "nrtReplicas":2,
2> "replicationFactor":2,
2> "tlogReplicas":"0",
2> "router":{"name":"compositeId"},
2> "shards":{"shard1":{
2> "range":"80000000-7fffffff",
2> "replicas":{
2> "core_node3":{
2> "core":"testOtherReplicasAreNotActive_shard1_replica_n1",
2> "node_name":"127.0.0.1:36415_solr",
2> "type":"NRT",
2> "state":"active",
2> "leader":"true",
2> "force_set_state":"false",
2> "base_url":"http://127.0.0.1:36415/solr"},
2> "core_node4":{
2> "core":"testOtherReplicasAreNotActive_shard1_replica_n2",
2> "node_name":"127.0.0.1:41577_solr",
2> "type":"NRT",
2> "state":"active",
2> "force_set_state":"false",
2> "base_url":"http://127.0.0.1:41577/solr"}},
2> "state":"active"}}}
2> 218044 INFO (TEST-LeaderTragicEventTest.testOtherReplicasAreNotActive-seed#[CFD08609E6849D8D]) [] o.e.j.s.Server Stopped oejs.Server@78473386{STOPPING}[12.0.27,sto=15000]
2> 218044 INFO (TEST-LeaderTragicEventTest.testOtherReplicasAreNotActive-seed#[CFD08609E6849D8D]) [] o.e.j.s.Server Shutdown oejs.Server@78473386{STOPPING}[12.0.27,sto=15000]
2> 218045 INFO (TEST-LeaderTragicEventTest.testOtherReplicasAreNotActive-seed#[CFD08609E6849D8D]) [] o.e.j.s.AbstractConnector Stopped ServerConnector@17dfcc4c{HTTP/1.1, (http/1.1, h2c)}{127.0.0.1:0}
2> 218045 INFO (TEST-LeaderTragicEventTest.testOtherReplicasAreNotActive-seed#[CFD08609E6849D8D]) [] o.a.s.c.CoreContainer Shutting down CoreContainer instance=1369871553
2> 218045 INFO (TEST-LeaderTragicEventTest.testOtherReplicasAreNotActive-seed#[CFD08609E6849D8D]) [] o.a.s.c.ZkController Remove node as live in ZooKeeper:/live_nodes/127.0.0.1:41577_solr
2> 218046 INFO (zkCallback-2807-thread-1) [] o.a.s.c.c.ZkStateReader Updated live nodes from ZooKeeper... (2) -> (1)
2> 218046 INFO (zkCallback-2790-thread-1) [] o.a.s.c.c.ZkStateReader Updated live nodes from ZooKeeper... (2) -> (1)
2> 218046 INFO (zkCallback-2787-thread-1) [] o.a.s.c.c.ZkStateReader Updated live nodes from ZooKeeper... (2) -> (1)
2> 218047 INFO (TEST-LeaderTragicEventTest.testOtherReplicasAreNotActive-seed#[CFD08609E6849D8D]) [] o.a.s.c.ZkController Publish this node as DOWN...
2> 218047 INFO (TEST-LeaderTragicEventTest.testOtherReplicasAreNotActive-seed#[CFD08609E6849D8D]) [] o.a.s.c.ZkController Publish node=127.0.0.1:41577_solr as DOWN
2> 218049 INFO (TEST-LeaderTragicEventTest.testOtherReplicasAreNotActive-seed#[CFD08609E6849D8D]) [n:127.0.0.1:41577_solr] o.a.s.c.ShardLeaderElectionContextBase No version found for ephemeral leader parent node, won't remove previous leader registration.
2> Sep 15, 2026 10:20:23 AM io.opentelemetry.sdk.internal.ThrottlingLogger doLog
2> WARNING: CallbackRegistration{instrumentDescriptors=[InstrumentDescriptor{name=solr_node_executor_thread_pool_size, description=Thread pool size, unit=, type=OBSERVABLE_GAUGE, valueType=LONG, advice=Advice{explicitBucketBoundaries=null, attributes=null}}]} has called close() multiple times.
2> Sep 15, 2026 10:20:23 AM io.opentelemetry.sdk.internal.ThrottlingLogger doLog
2> WARNING: CallbackRegistration{instrumentDescriptors=[InstrumentDescriptor{name=solr_node_executor_thread_pool_tasks, description=Thread pool task counts, unit=, type=OBSERVABLE_GAUGE, valueType=LONG, advice=Advice{explicitBucketBoundaries=null, attributes=null}}]} has called close() multiple times.
2> 218050 INFO (coreCloseExecutor-2827-thread-1-processing-127.0.0.1:41577_solr) [n:127.0.0.1:41577_solr c:testOtherReplicasAreNotActive s:shard1 r:core_node4 x:testOtherReplicasAreNotActive_shard1_replica_n2] o.a.s.c.SolrCore CLOSING SolrCore org.apache.solr.core.SolrCore@4cf24699 testOtherReplicasAreNotActive_shard1_replica_n2
2> Sep 15, 2026 10:20:23 AM io.opentelemetry.sdk.internal.ThrottlingLogger doLog
2> WARNING: CallbackRegistration{instrumentDescriptors=[InstrumentDescriptor{name=solr_core_replication_index_version, description=Current index version, unit=, type=OBSERVABLE_GAUGE, valueType=LONG, advice=Advice{explicitBucketBoundaries=null, attributes=null}}, InstrumentDescriptor{name=solr_core_replication_is_polling_disabled, description=Whether polling is disabled (1) or not (0), unit=, type=OBSERVABLE_GAUGE, valueType=LONG, advice=Advice{explicitBucketBoundaries=null, attributes=null}}, InstrumentDescriptor{name=solr_core_replication_downloaded_size, description=Total bytes downloaded during replication, unit=By, type=OBSERVABLE_GAUGE, valueType=LONG, advice=Advice{explicitBucketBoundaries=null, attributes=null}}, InstrumentDescriptor{name=solr_core_replication_time_elapsed, description=Time elapsed during replication in seconds, unit=s, type=OBSERVABLE_GAUGE, valueType=LONG, advice=Advice{explicitBucketBoundaries=null, attributes=null}}, InstrumentDescriptor{name=solr_core_replication_index_size, description=Size of the index in megabytes, unit=MBy, type=OBSERVABLE_GAUGE, valueType=DOUBLE, advice=Advice{explicitBucketBoundaries=null, attributes=null}}, InstrumentDescriptor{name=solr_core_replication_index_generation, description=Current index generation, unit=, type=OBSERVABLE_GAUGE, valueType=LONG, advice=Advice{explicitBucketBoundaries=null, attributes=null}}, InstrumentDescriptor{name=solr_core_replication_is_enabled, description=Whether replication is enabled (1) or not (0), unit=, type=OBSERVABLE_GAUGE, valueType=LONG, advice=Advice{explicitBucketBoundaries=null, attributes=null}}, InstrumentDescriptor{name=solr_core_replication_is_follower, description=Whether this node is a follower (1) or not (0), unit=, type=OBSERVABLE_GAUGE, valueType=LONG, advice=Advice{explicitBucketBoundaries=null, attributes=null}}, InstrumentDescriptor{name=solr_core_replication_is_leader, description=Whether this node is a leader (1) or not (0), unit=, type=OBSERVABLE_GAUGE, valueType=LONG, advice=Advice{explicitBucketBoundaries=null, attributes=null}}, InstrumentDescriptor{name=solr_core_replication_is_replicating, description=Whether replication is in progress (1) or not (0), unit=, type=OBSERVABLE_GAUGE, valueType=LONG, advice=Advice{explicitBucketBoundaries=null, attributes=null}}, InstrumentDescriptor{name=solr_core_replication_download_speed, description=Download speed in bytes per second, unit=, type=OBSERVABLE_GAUGE, valueType=LONG, advice=Advice{explicitBucketBoundaries=null, attributes=null}}]} has called close() multiple times.
2> Sep 15, 2026 10:20:23 AM io.opentelemetry.sdk.internal.ThrottlingLogger doLog
2> WARNING: CallbackRegistration{instrumentDescriptors=[InstrumentDescriptor{name=solr_core_update_auto_commits, description=Current number of auto commits, unit=, type=OBSERVABLE_COUNTER, valueType=LONG, advice=Advice{explicitBucketBoundaries=null, attributes=null}}]} has called close() multiple times.
2> Sep 15, 2026 10:20:23 AM io.opentelemetry.sdk.internal.ThrottlingLogger doLog
2> WARNING: CallbackRegistration{instrumentDescriptors=[InstrumentDescriptor{name=solr_core_update_commit_stats, description=Metrics around commits, unit=, type=OBSERVABLE_GAUGE, valueType=LONG, advice=Advice{explicitBucketBoundaries=null, attributes=null}}]} has called close() multiple times.
2> Sep 15, 2026 10:20:23 AM io.opentelemetry.sdk.internal.ThrottlingLogger doLog
2> WARNING: CallbackRegistration{instrumentDescriptors=[InstrumentDescriptor{name=solr_core_update_docs_pending_commit, description=Current number of documents pending commit. Value is reset to 0 on commit., unit=, type=OBSERVABLE_GAUGE, valueType=LONG, advice=Advice{explicitBucketBoundaries=null, attributes=null}}]} has called close() multiple times.
2> 218051 INFO (coreCloseExecutor-2827-thread-1-processing-127.0.0.1:41577_solr) [n:127.0.0.1:41577_solr c:testOtherReplicasAreNotActive s:shard1 r:core_node4 x:testOtherReplicasAreNotActive_shard1_replica_n2] o.a.s.u.DirectUpdateHandler2 Committing on IndexWriter.close() ... SKIPPED (unnecessary).
2> Sep 15, 2026 10:20:23 AM io.opentelemetry.sdk.internal.ThrottlingLogger doLog
2> WARNING: CallbackRegistration{instrumentDescriptors=[InstrumentDescriptor{name=solr_core_indexsearcher_cache_size, description=Current number cache entries, unit=, type=OBSERVABLE_GAUGE, valueType=LONG, advice=Advice{explicitBucketBoundaries=null, attributes=null}}, InstrumentDescriptor{name=solr_core_indexsearcher_cache_lookups, description=Number of cumulative cache lookup results (hits and misses), unit=, type=OBSERVABLE_COUNTER, valueType=LONG, advice=Advice{explicitBucketBoundaries=null, attributes=null}}, InstrumentDescriptor{name=solr_core_indexsearcher_cache_ram_used, description=RAM bytes used by cache, unit=By, type=OBSERVABLE_GAUGE, valueType=LONG, advice=Advice{explicitBucketBoundaries=null, attributes=null}}, InstrumentDescriptor{name=solr_core_indexsearcher_cache_ops, description=Number of cumulative cache operations (inserts and evictions), unit=, type=OBSERVABLE_COUNTER, valueType=LONG, advice=Advice{explicitBucketBoundaries=null, attributes=null}}, InstrumentDescriptor{name=solr_core_indexsearcher_cache_warmup_time, description=Cache warmup time (most recent), unit=ms, type=OBSERVABLE_GAUGE, valueType=LONG, advice=Advice{explicitBucketBoundaries=null, attributes=null}}]} has called close() multiple times.
2> Sep 15, 2026 10:20:23 AM io.opentelemetry.sdk.internal.ThrottlingLogger doLog
2> WARNING: CallbackRegistration{instrumentDescriptors=[InstrumentDescriptor{name=solr_core_indexsearcher_termstats_cache, description=Operation counts for the searcher term statistics cache, reported per operation type, unit=, type=OBSERVABLE_GAUGE, valueType=LONG, advice=Advice{explicitBucketBoundaries=null, attributes=null}}]} has called close() multiple times.
2> Sep 15, 2026 10:20:23 AM io.opentelemetry.sdk.internal.ThrottlingLogger doLog
2> WARNING: CallbackRegistration{instrumentDescriptors=[InstrumentDescriptor{name=solr_core_indexsearcher_live_docs_cache, description=LiveDocs cache metrics, unit=, type=OBSERVABLE_COUNTER, valueType=LONG, advice=Advice{explicitBucketBoundaries=null, attributes=null}}]} has called close() multiple times.
2> Sep 15, 2026 10:20:23 AM io.opentelemetry.sdk.internal.ThrottlingLogger doLog
2> WARNING: CallbackRegistration{instrumentDescriptors=[InstrumentDescriptor{name=solr_core_indexsearcher_index_num_docs, description=Number of live docs in the index, unit=, type=OBSERVABLE_GAUGE, valueType=LONG, advice=Advice{explicitBucketBoundaries=null, attributes=null}}]} has called close() multiple times.
2> Sep 15, 2026 10:20:23 AM io.opentelemetry.sdk.internal.ThrottlingLogger doLog
2> WARNING: CallbackRegistration{instrumentDescriptors=[InstrumentDescriptor{name=solr_core_indexsearcher_index_docs, description=Total number of docs in the index (including deletions), unit=, type=OBSERVABLE_GAUGE, valueType=LONG, advice=Advice{explicitBucketBoundaries=null, attributes=null}}]} has called close() multiple times.
2> Sep 15, 2026 10:20:23 AM io.opentelemetry.sdk.internal.ThrottlingLogger doLog
2> WARNING: CallbackRegistration{instrumentDescriptors=[InstrumentDescriptor{name=solr_core_indexsearcher_index_version, description=Lucene index version, unit=, type=OBSERVABLE_GAUGE, valueType=LONG, advice=Advice{explicitBucketBoundaries=null, attributes=null}}]} has called close() multiple times.
2> Sep 15, 2026 10:20:23 AM io.opentelemetry.sdk.internal.ThrottlingLogger doLog
2> WARNING: CallbackRegistration{instrumentDescriptors=[InstrumentDescriptor{name=solr_core_ref_count, description=The current number of active references to a Solr core, unit=, type=OBSERVABLE_GAUGE, valueType=LONG, advice=Advice{explicitBucketBoundaries=null, attributes=null}}]} has called close() multiple times.
2> Sep 15, 2026 10:20:23 AM io.opentelemetry.sdk.internal.ThrottlingLogger doLog
2> WARNING: CallbackRegistration{instrumentDescriptors=[InstrumentDescriptor{name=solr_core_is_leader, description=Indicates whether this Solr core is currently the leader, unit=, type=OBSERVABLE_GAUGE, valueType=LONG, advice=Advice{explicitBucketBoundaries=null, attributes=null}}]} has called close() multiple times.
2> Sep 15, 2026 10:20:23 AM io.opentelemetry.sdk.internal.ThrottlingLogger doLog
2> WARNING: CallbackRegistration{instrumentDescriptors=[InstrumentDescriptor{name=solr_core_executor_thread_pool_size, description=Thread pool size, unit=, type=OBSERVABLE_GAUGE, valueType=LONG, advice=Advice{explicitBucketBoundaries=null, attributes=null}}]} has called close() multiple times.
2> Sep 15, 2026 10:20:23 AM io.opentelemetry.sdk.internal.ThrottlingLogger doLog
2> WARNING: CallbackRegistration{instrumentDescriptors=[InstrumentDescriptor{name=solr_core_executor_thread_pool_tasks, description=Thread pool task counts, unit=, type=OBSERVABLE_GAUGE, valueType=LONG, advice=Advice{explicitBucketBoundaries=null, attributes=null}}]} has called close() multiple times.
2> Sep 15, 2026 10:20:23 AM io.opentelemetry.sdk.internal.ThrottlingLogger doLog
2> WARNING: CallbackRegistration{instrumentDescriptors=[InstrumentDescriptor{name=solr_core_executor_thread_pool_size, description=Thread pool size, unit=, type=OBSERVABLE_GAUGE, valueType=LONG, advice=Advice{explicitBucketBoundaries=null, attributes=null}}]} has called close() multiple times.
2> Sep 15, 2026 10:20:23 AM io.opentelemetry.sdk.internal.ThrottlingLogger doLog
2> WARNING: CallbackRegistration{instrumentDescriptors=[InstrumentDescriptor{name=solr_core_executor_thread_pool_tasks, description=Thread pool task counts, unit=, type=OBSERVABLE_GAUGE, valueType=LONG, advice=Advice{explicitBucketBoundaries=null, attributes=null}}]} has called close() multiple times.
2> Sep 15, 2026 10:20:23 AM io.opentelemetry.sdk.internal.ThrottlingLogger doLog
2> WARNING: CallbackRegistration{instrumentDescriptors=[InstrumentDescriptor{name=solr_core_executor_thread_pool_size, description=Thread pool size, unit=, type=OBSERVABLE_GAUGE, valueType=LONG, advice=Advice{explicitBucketBoundaries=null, attributes=null}}]} has called close() multiple times.
2> Sep 15, 2026 10:20:23 AM io.opentelemetry.sdk.internal.ThrottlingLogger doLog
2> WARNING: CallbackRegistration{instrumentDescriptors=[InstrumentDescriptor{name=solr_core_executor_thread_pool_tasks, description=Thread pool task counts, unit=, type=OBSERVABLE_GAUGE, valueType=LONG, advice=Advice{explicitBucketBoundaries=null, attributes=null}}]} has called close() multiple times.
2> 218053 INFO (Curator-Framework-0) [] o.a.c.f.i.CuratorFrameworkImpl backgroundOperationsLoop exiting
2> 218151 INFO (zkCallback-2790-thread-1) [] o.a.s.c.c.ZkStateReader A cluster state change: [WatchedEvent state:SyncConnected type:NodeDataChanged path:/collections/testOtherReplicasAreNotActive/state.json zxid: -1] for collection [testOtherReplicasAreNotActive] has occurred - updating... (live nodes size: [1])
2> 218155 INFO (TEST-LeaderTragicEventTest.testOtherReplicasAreNotActive-seed#[CFD08609E6849D8D]) [n:127.0.0.1:41577_solr] o.e.j.e.s.ServletContextHandler Stopped oeje10s.ServletContextHandler@683af489{/solr,/solr,b=file:///home/jenkins/jenkins-agent/workspace/Solr/Solr-Test-10.0/solr/core/build/tmp/tests-cwd/./,a=AVAILABLE,h=oeje10s.SessionHandler@133cea8b{STOPPED}}
2> 218155 INFO (TEST-LeaderTragicEventTest.testOtherReplicasAreNotActive-seed#[CFD08609E6849D8D]) [] o.a.s.c.MiniSolrCloudCluster Cannot wait for Jetty with null node name
2> 218156 INFO (TEST-LeaderTragicEventTest.testOtherReplicasAreNotActive-seed#[CFD08609E6849D8D]) [] o.a.s.c.SolrCloudTestCase waitForState (testOtherReplicasAreNotActive): Timeout waiting for replica get down
2> 218157 INFO (TEST-LeaderTragicEventTest.testOtherReplicasAreNotActive-seed#[CFD08609E6849D8D]) [] o.a.s.c.LeaderTragicEventTest Will crash leader : core_node3:{
2> "core":"testOtherReplicasAreNotActive_shard1_replica_n1",
2> "leader":"true",
2> "node_name":"127.0.0.1:36415_solr",
2> "base_url":"http://127.0.0.1:36415/solr",
2> "state":"active",
2> "type":"NRT",
2> "force_set_state":"false"}
2> 218162 ERROR (qtp2130036476-4744-null-13580) [n:127.0.0.1:36415_solr c:testOtherReplicasAreNotActive s:shard1 r:core_node3 x:testOtherReplicasAreNotActive_shard1_replica_n1 t:null-13580] o.a.s.u.SolrIndexWriter Error closing IndexWriter
2> =>java.lang.IllegalStateException: this writer hit an unrecoverable error; cannot flush
2> at org.apache.lucene.index.IndexWriter.doFlush(IndexWriter.java:4288)
2>
2> 218163 INFO (qtp2130036476-4744-null-13580) [n:127.0.0.1:36415_solr c:testOtherReplicasAreNotActive s:shard1 r:core_node3 x:testOtherReplicasAreNotActive_shard1_replica_n1 t:null-13580] o.a.s.u.DefaultSolrCoreState New IndexWriter is ready to be used.
2> 218163 ERROR (qtp2130036476-4744-null-13580) [n:127.0.0.1:36415_solr c:testOtherReplicasAreNotActive s:shard1 r:core_node3 x:testOtherReplicasAreNotActive_shard1_replica_n1 t:null-13580] o.a.s.h.RequestHandlerBase Server exception
2> =>org.apache.solr.common.SolrException: Random tragedy fail
2> at org.apache.solr.util.TestInjection.injectLeaderTragedy(TestInjection.java:407)
2>
2> 218163 INFO (qtp2130036476-4744-null-13580) [n:127.0.0.1:36415_solr c:testOtherReplicasAreNotActive s:shard1 r:core_node3 x:testOtherReplicasAreNotActive_shard1_replica_n1 t:null-13580] o.a.s.c.S.Request path=/update params={commit=true&wt=javabin} status=500 QTime=2
2> 218163 ERROR (qtp2130036476-4744-null-13580) [n:127.0.0.1:36415_solr c:testOtherReplicasAreNotActive s:shard1 r:core_node3 x:testOtherReplicasAreNotActive_shard1_replica_n1 t:null-13580] o.a.s.s.HttpSolrCall 500 Exception
2> =>org.apache.solr.common.SolrException: Random tragedy fail
2> at org.apache.solr.util.TestInjection.injectLeaderTragedy(TestInjection.java:407)
2>
2> 218166 INFO (TEST-LeaderTragicEventTest.testOtherReplicasAreNotActive-seed#[CFD08609E6849D8D]) [] o.a.s.c.LeaderTragicEventTest Tragic event triggered on attempt 1
2> 218166 INFO (TEST-LeaderTragicEventTest.testOtherReplicasAreNotActive-seed#[CFD08609E6849D8D]) [] o.a.s.e.JettySolrRunner Start Jetty (configured port=0, binding port=41577)
2> 218166 INFO (TEST-LeaderTragicEventTest.testOtherReplicasAreNotActive-seed#[CFD08609E6849D8D]) [] o.a.s.e.JettySolrRunner Trying to start Jetty on port 41577 try number 2 ...
2> 218167 INFO (TEST-LeaderTragicEventTest.testOtherReplicasAreNotActive-seed#[CFD08609E6849D8D]) [] o.e.j.s.Server jetty-12.0.27; built: 2025-09-10T23:47:49.595Z; git: 3569a3e83ad136ee44e26b370b74c1c5e9f33e61; jvm 21.0.4+7-LTS
2> 218167 INFO (TEST-LeaderTragicEventTest.testOtherReplicasAreNotActive-seed#[CFD08609E6849D8D]) [] o.e.j.s.DefaultSessionIdManager Session workerName=node0
2> 218168 WARN (TEST-LeaderTragicEventTest.testOtherReplicasAreNotActive-seed#[CFD08609E6849D8D]) [] o.e.j.e.s.ServletContextHandler BaseResource file:///home/jenkins/jenkins-agent/workspace/Solr/Solr-Test-10.0/solr/core/build/tmp/tests-cwd/./ is aliased to file:///home/jenkins/jenkins-agent/workspace/Solr/Solr-Test-10.0/solr/core/build/tmp/tests-cwd/ in oeje10s.ServletContextHandler@3e2aa0f1{/solr,/solr,b=file:///home/jenkins/jenkins-agent/workspace/Solr/Solr-Test-10.0/solr/core/build/tmp/tests-cwd/./,a=STOPPED,h=oeje10s.SessionHandler@5d8ce829{STOPPED}}. May not be supported in future releases.
2> 218168 INFO (TEST-LeaderTragicEventTest.testOtherReplicasAreNotActive-seed#[CFD0860
[...truncated too long message...]
sion, java.net.URLPermission:
java.util.ServiceConfigurationError: Locale provider adapter "CLDR"cannot be instantiated.
java.security.policy: error adding Permission, java.net.URLPermission:
java.util.ServiceConfigurationError: Locale provider adapter "CLDR"cannot be instantiated.
java.security.policy: error adding Permission, java.net.URLPermission:
java.util.ServiceConfigurationError: Locale provider adapter "CLDR"cannot be instantiated.
java.security.policy: error adding Permission, java.net.URLPermission:
java.util.ServiceConfigurationError: Locale provider adapter "CLDR"cannot be instantiated.
java.security.policy: error adding Permission, java.net.URLPermission:
java.util.ServiceConfigurationError: Locale provider adapter "CLDR"cannot be instantiated.
java.security.policy: error adding Permission, java.net.URLPermission:
java.util.ServiceConfigurationError: Locale provider adapter "CLDR"cannot be instantiated.
:solr:modules:s3-repository:test (SUCCESS): 53 test(s), 1 skipped
> Task :solr:modules:s3-repository:wipeTaskTemp
> Task :solr:modules:scripting:compileJava
Note: Some input files use or override a deprecated API.
Note: Recompile with -Xlint:deprecation for details.
> Task :solr:modules:scripting:processResources NO-SOURCE
> Task :solr:modules:scripting:classes
> Task :solr:modules:scripting:compileTestJava
Note: Some input files use or override a deprecated API.
Note: Recompile with -Xlint:deprecation for details.
> Task :solr:modules:scripting:processTestResources
> Task :solr:modules:scripting:testClasses
> Task :solr:modules:scripting:test
WARNING: Using incubator modules: jdk.incubator.vector
WARNING: Using incubator modules: jdk.incubator.vector
WARNING: Using incubator modules: jdk.incubator.vector
WARNING: Using incubator modules: jdk.incubator.vector
WARNING: A command line option has enabled the Security Manager
WARNING: The Security Manager is deprecated and will be removed in a future release
WARNING: A command line option has enabled the Security Manager
WARNING: The Security Manager is deprecated and will be removed in a future release
WARNING: A command line option has enabled the Security Manager
WARNING: The Security Manager is deprecated and will be removed in a future release
WARNING: A command line option has enabled the Security Manager
WARNING: The Security Manager is deprecated and will be removed in a future release
java.security.policy: error adding Permission, java.net.URLPermission:
java.util.ServiceConfigurationError: Locale provider adapter "CLDR"cannot be instantiated.
java.security.policy: error adding Permission, java.net.URLPermission:
java.util.ServiceConfigurationError: Locale provider adapter "CLDR"cannot be instantiated.
java.security.policy: error adding Permission, java.net.URLPermission:
java.util.ServiceConfigurationError: Locale provider adapter "CLDR"cannot be instantiated.
java.security.policy: error adding Permission, java.net.URLPermission:
java.util.ServiceConfigurationError: Locale provider adapter "CLDR"cannot be instantiated.
java.security.policy: error adding Permission, java.net.URLPermission:
java.util.ServiceConfigurationError: Locale provider adapter "CLDR"cannot be instantiated.
java.security.policy: error adding Permission, java.net.URLPermission:
java.util.ServiceConfigurationError: Locale provider adapter "CLDR"cannot be instantiated.
java.security.policy: error adding Permission, java.net.URLPermission:
java.util.ServiceConfigurationError: Locale provider adapter "CLDR"cannot be instantiated.
java.security.policy: error adding Permission, java.net.URLPermission:
java.util.ServiceConfigurationError: Locale provider adapter "CLDR"cannot be instantiated.
java.security.policy: error adding Permission, java.net.URLPermission:
java.util.ServiceConfigurationError: Locale provider adapter "CLDR"cannot be instantiated.
java.security.policy: error adding Permission, java.net.URLPermission:
java.util.ServiceConfigurationError: Locale provider adapter "CLDR"cannot be instantiated.
java.security.policy: error adding Permission, java.net.URLPermission:
java.util.ServiceConfigurationError: Locale provider adapter "CLDR"cannot be instantiated.
java.security.policy: error adding Permission, java.net.URLPermission:
java.util.ServiceConfigurationError: Locale provider adapter "CLDR"cannot be instantiated.
:solr:modules:scripting:test (SUCCESS): 22 test(s), 17 skipped
> Task :solr:modules:scripting:wipeTaskTemp
> Task :solr:modules:sql:compileTestJava
Note: Some input files use or override a deprecated API.
Note: Recompile with -Xlint:deprecation for details.
> Task :solr:modules:sql:copySolrCoreTestResources
> Task :solr:modules:sql:processTestResources
> Task :solr:modules:sql:testClasses
> Task :solr:modules:sql:test
WARNING: Using incubator modules: jdk.incubator.vector
WARNING: Using incubator modules: jdk.incubator.vector
WARNING: Using incubator modules: jdk.incubator.vector
WARNING: A command line option has enabled the Security Manager
WARNING: The Security Manager is deprecated and will be removed in a future release
WARNING: A command line option has enabled the Security Manager
WARNING: The Security Manager is deprecated and will be removed in a future release
WARNING: A command line option has enabled the Security Manager
WARNING: The Security Manager is deprecated and will be removed in a future release
java.security.policy: error adding Permission, java.net.URLPermission:
java.util.ServiceConfigurationError: Locale provider adapter "CLDR"cannot be instantiated.
java.security.policy: error adding Permission, java.net.URLPermission:
java.security.policy: error adding Permission, java.net.URLPermission:
java.util.ServiceConfigurationError: Locale provider adapter "CLDR"cannot be instantiated.
java.util.ServiceConfigurationError: Locale provider adapter "CLDR"cannot be instantiated.
java.security.policy: error adding Permission, java.net.URLPermission:
java.util.ServiceConfigurationError: Locale provider adapter "CLDR"cannot be instantiated.
java.security.policy: error adding Permission, java.net.URLPermission:
java.util.ServiceConfigurationError: Locale provider adapter "CLDR"cannot be instantiated.
java.security.policy: error adding Permission, java.net.URLPermission:
java.util.ServiceConfigurationError: Locale provider adapter "CLDR"cannot be instantiated.
java.security.policy: error adding Permission, java.net.URLPermission:
java.util.ServiceConfigurationError: Locale provider adapter "CLDR"cannot be instantiated.
java.security.policy: error adding Permission, java.net.URLPermission:
java.util.ServiceConfigurationError: Locale provider adapter "CLDR"cannot be instantiated.
java.security.policy: error adding Permission, java.net.URLPermission:
java.util.ServiceConfigurationError: Locale provider adapter "CLDR"cannot be instantiated.
:solr:modules:sql:test (SUCCESS): 33 test(s)
> Task :solr:modules:sql:wipeTaskTemp
The slowest tests (exceeding 500 ms) during this run:
92.20s BasicDistributedZkTest.test (:solr:core)
66.76s TestCpuAllowedLimit.testDistribLimit (:solr:core)
54.36s TestCpuAllowedLimit.testDistribLimit2 (:solr:core)
50.74s TestRandomCollapseQParserPlugin.testRandomCollapseWithSort (:solr:core)
47.39s ReplicationFactorTest.test (:solr:core)
46.34s PeerSyncReplicationTest.test (:solr:core)
45.10s SyncSliceTest.test (:solr:core)
44.87s TestRandomFaceting.testRandomFaceting (:solr:core)
41.75s UnloadDistributedZkTest.test (:solr:core)
40.14s HttpJettySolrClientTest.testIdleTimeoutWithHttpClient (:solr:solrj-jetty)
The slowest suites (exceeding 1s) during this run:
126.96s TestCpuAllowedLimit (:solr:core)
92.56s BasicDistributedZkTest (:solr:core)
81.39s KnnQParserTest (:solr:core)
77.62s TestCoordinatorRole (:solr:core)
67.79s TestRangeQuery (:solr:core)
66.87s TestRecovery (:solr:core)
63.06s TestPullReplica (:solr:core)
62.65s TestTlogReplica (:solr:core)
60.85s TestCloudConsistency (:solr:core)
57.47s MultiThreadedOCPTest (:solr:core)
ERROR: The following test(s) have failed:
- org.apache.solr.cloud.LeaderTragicEventTest (:solr:core)
Test history: https://develocity.apache.org/scans/tests?search.rootProjectNames=solr-root&tests.container=org.apache.solr.cloud.LeaderTragicEventTest
Test output: /home/jenkins/jenkins-agent/workspace/Solr/Solr-Test-10.0/solr/core/build/test-results/test/outputs/OUTPUT-org.apache.solr.cloud.LeaderTragicEventTest.txt
Reproduce with: ./gradlew :solr:core:test --tests "org.apache.solr.cloud.LeaderTragicEventTest" -Ptests.haltonfailure=false "-Ptests.jvmargs=-XX:TieredStopAtLevel=1 -XX:+UseParallelGC -XX:ActiveProcessorCount=1 -XX:ReservedCodeCacheSize=120m" -Ptests.seed=CFD08609E6849D8D -Ptests.multiplier=2 -Ptests.useSecurityManager=true -Ptests.badapples=false -Ptests.file.encoding=ISO-8859-1
Deprecated Gradle features were used in this build, making it incompatible with Gradle 9.0.
You can use '--warning-mode all' to show the individual deprecation warnings and determine if they come from your own scripts or plugins.
For more on this, please refer to https://docs.gradle.org/8.10/userguide/command_line_interface.html#sec:command_line_warnings in the Gradle documentation.
BUILD SUCCESSFUL in 39m 31s
153 actionable tasks: 153 executed
Publishing build scan...
The Develocity server (develocity.apache.org) rejected the access key with prefix '7x3jzizm4zpygv7psbkg6byvm4'.
Your credential has expired.
Build step 'Invoke Gradle script' changed build result to SUCCESS
Archiving artifacts
‘**/*.events’ doesn’t match anything: ‘**’ exists but not ‘**/*.events’
No artifacts found that match the file pattern "**/*.events,heapdumps/**,**/hs_err_pid*". Configuration error?
Recording test results
[Checks API] No suitable checks publisher found.
Build step 'Publish JUnit test result report' changed build result to UNSTABLE
Email was triggered for: Unstable (Test Failures)
Sending email for trigger: Unstable (Test Failures)
[JENKINS] Solr » Solr-Test-10.0 - Build # 2498 - Still Unstable!
Posted by Apache Jenkins Server <je...@builds.apache.org>.
Build: https://ci-builds.apache.org/job/Solr/job/Solr-Test-10.0/2498/
1 tests failed.
FAILED: org.apache.solr.client.solrj.io.stream.StreamDecoratorTest.testParallelUpdateStream
Error Message:
java.io.IOException: java.io.IOException: --> http://127.0.0.1:39881/solr/collection1_shard2_replica_n2/:Error from server at http://127.0.0.1:37793/solr/parallelDestinationCollection_shard2_replica_n1/update?_stateVer_=parallelDestinationCollection%3A3&wt=javabin: Could not parse response with encoding ıso-8859-1
Stack Trace:
java.io.IOException: java.io.IOException: --> http://127.0.0.1:39881/solr/collection1_shard2_replica_n2/:Error from server at http://127.0.0.1:37793/solr/parallelDestinationCollection_shard2_replica_n1/update?_stateVer_=parallelDestinationCollection%3A3&wt=javabin: Could not parse response with encoding ıso-8859-1
at __randomizedtesting.SeedInfo.seed([7203DD009EBBF5D5:11ED9EE2C28F0EBE]:0)
at org.apache.solr.common.util.ExecutorUtil.submitAllAndAwaitAggregatingExceptions(ExecutorUtil.java:456)
at org.apache.solr.client.solrj.io.stream.StreamExecutorHelper.submitAllAndAwaitAggregatingExceptions(StreamExecutorHelper.java:47)
at org.apache.solr.client.solrj.io.stream.CloudSolrStream.openStreams(CloudSolrStream.java:424)
at org.apache.solr.client.solrj.io.stream.CloudSolrStream.open(CloudSolrStream.java:291)
at org.apache.solr.client.solrj.io.stream.StreamDecoratorTest.getTuples(StreamDecoratorTest.java:5299)
at org.apache.solr.client.solrj.io.stream.StreamDecoratorTest.testParallelUpdateStream(StreamDecoratorTest.java:3430)
at java.base/jdk.internal.reflect.DirectMethodHandleAccessor.invoke(DirectMethodHandleAccessor.java:103)
at java.base/java.lang.reflect.Method.invoke(Method.java:580)
at com.carrotsearch.randomizedtesting.RandomizedRunner.invoke(RandomizedRunner.java:1763)
at com.carrotsearch.randomizedtesting.RandomizedRunner$8.evaluate(RandomizedRunner.java:946)
at com.carrotsearch.randomizedtesting.RandomizedRunner$9.evaluate(RandomizedRunner.java:982)
at com.carrotsearch.randomizedtesting.RandomizedRunner$10.evaluate(RandomizedRunner.java:996)
at com.carrotsearch.randomizedtesting.rules.SystemPropertiesRestoreRule$1.evaluate(SystemPropertiesRestoreRule.java:80)
at org.junit.rules.RunRules.evaluate(RunRules.java:20)
at org.apache.lucene.tests.util.TestRuleSetupTeardownChained$1.evaluate(TestRuleSetupTeardownChained.java:48)
at org.apache.lucene.tests.util.AbstractBeforeAfterRule$1.evaluate(AbstractBeforeAfterRule.java:43)
at org.apache.lucene.tests.util.TestRuleThreadAndTestName$1.evaluate(TestRuleThreadAndTestName.java:45)
at org.apache.lucene.tests.util.TestRuleIgnoreAfterMaxFailures$1.evaluate(TestRuleIgnoreAfterMaxFailures.java:60)
at org.apache.lucene.tests.util.TestRuleMarkFailure$1.evaluate(TestRuleMarkFailure.java:44)
at org.junit.rules.RunRules.evaluate(RunRules.java:20)
at com.carrotsearch.randomizedtesting.rules.StatementAdapter.evaluate(StatementAdapter.java:36)
at com.carrotsearch.randomizedtesting.ThreadLeakControl$StatementRunner.run(ThreadLeakControl.java:390)
at com.carrotsearch.randomizedtesting.ThreadLeakControl.forkTimeoutingTask(ThreadLeakControl.java:843)
at com.carrotsearch.randomizedtesting.ThreadLeakControl$3.evaluate(ThreadLeakControl.java:490)
at com.carrotsearch.randomizedtesting.RandomizedRunner.runSingleTest(RandomizedRunner.java:955)
at com.carrotsearch.randomizedtesting.RandomizedRunner$5.evaluate(RandomizedRunner.java:840)
at com.carrotsearch.randomizedtesting.RandomizedRunner$6.evaluate(RandomizedRunner.java:891)
at com.carrotsearch.randomizedtesting.RandomizedRunner$7.evaluate(RandomizedRunner.java:902)
at com.carrotsearch.randomizedtesting.rules.StatementAdapter.evaluate(StatementAdapter.java:36)
at com.carrotsearch.randomizedtesting.rules.StatementAdapter.evaluate(StatementAdapter.java:36)
at org.apache.lucene.tests.util.AbstractBeforeAfterRule$1.evaluate(AbstractBeforeAfterRule.java:43)
at com.carrotsearch.randomizedtesting.rules.SystemPropertiesRestoreRule$1.evaluate(SystemPropertiesRestoreRule.java:80)
at org.junit.rules.RunRules.evaluate(RunRules.java:20)
at org.apache.lucene.tests.util.AbstractBeforeAfterRule$1.evaluate(AbstractBeforeAfterRule.java:43)
at com.carrotsearch.randomizedtesting.rules.StatementAdapter.evaluate(StatementAdapter.java:36)
at org.apache.lucene.tests.util.TestRuleStoreClassName$1.evaluate(TestRuleStoreClassName.java:38)
at com.carrotsearch.randomizedtesting.rules.NoShadowingOrOverridesOnMethodsRule$1.evaluate(NoShadowingOrOverridesOnMethodsRule.java:40)
at com.carrotsearch.randomizedtesting.rules.NoShadowingOrOverridesOnMethodsRule$1.evaluate(NoShadowingOrOverridesOnMethodsRule.java:40)
at com.carrotsearch.randomizedtesting.rules.StatementAdapter.evaluate(StatementAdapter.java:36)
at com.carrotsearch.randomizedtesting.rules.StatementAdapter.evaluate(StatementAdapter.java:36)
at org.apache.lucene.tests.util.TestRuleAssertionsRequired$1.evaluate(TestRuleAssertionsRequired.java:53)
at org.apache.lucene.tests.util.AbstractBeforeAfterRule$1.evaluate(AbstractBeforeAfterRule.java:43)
at org.apache.lucene.tests.util.TestRuleMarkFailure$1.evaluate(TestRuleMarkFailure.java:44)
at org.apache.lucene.tests.util.TestRuleIgnoreAfterMaxFailures$1.evaluate(TestRuleIgnoreAfterMaxFailures.java:60)
at org.apache.lucene.tests.util.TestRuleIgnoreTestSuites$1.evaluate(TestRuleIgnoreTestSuites.java:47)
at org.junit.rules.RunRules.evaluate(RunRules.java:20)
at com.carrotsearch.randomizedtesting.rules.StatementAdapter.evaluate(StatementAdapter.java:36)
at com.carrotsearch.randomizedtesting.ThreadLeakControl$StatementRunner.run(ThreadLeakControl.java:390)
at com.carrotsearch.randomizedtesting.ThreadLeakControl.lambda$forkTimeoutingTask$0(ThreadLeakControl.java:850)
at java.base/java.lang.Thread.run(Thread.java:1583)
Caused by: java.io.IOException: --> http://127.0.0.1:39881/solr/collection1_shard2_replica_n2/:Error from server at http://127.0.0.1:37793/solr/parallelDestinationCollection_shard2_replica_n1/update?_stateVer_=parallelDestinationCollection%3A3&wt=javabin: Could not parse response with encoding ıso-8859-1
at org.apache.solr.client.solrj.io.stream.SolrStream.read(SolrStream.java:224)
at org.apache.solr.client.solrj.io.stream.CloudSolrStream$TupleWrapper.next(CloudSolrStream.java:512)
at org.apache.solr.client.solrj.io.stream.CloudSolrStream$StreamOpener.call(CloudSolrStream.java:536)
at org.apache.solr.client.solrj.io.stream.CloudSolrStream$StreamOpener.call(CloudSolrStream.java:522)
at java.base/java.util.concurrent.FutureTask.run(FutureTask.java:317)
at org.apache.solr.common.util.ExecutorUtil$MDCAwareThreadPoolExecutor.lambda$execute$0(ExecutorUtil.java:381)
at java.base/java.util.concurrent.ThreadPoolExecutor.runWorker(ThreadPoolExecutor.java:1144)
at java.base/java.util.concurrent.ThreadPoolExecutor$Worker.run(ThreadPoolExecutor.java:642)
... 1 more
Build Log:
[...truncated 11 lines...]
ERROR: Workspace has a .git repository, but it appears to be corrupt.
hudson.plugins.git.GitException: Command "git rev-parse --resolve-git-dir /home/jenkins/jenkins-agent/workspace/Solr/Solr-Test-10.0/.git" returned status code 128:
stdout:
stderr: fatal: not a gitdir '/home/jenkins/jenkins-agent/workspace/Solr/Solr-Test-10.0/.git'
at PluginClassLoader for git-client//org.jenkinsci.plugins.gitclient.CliGitAPIImpl.launchCommandIn(CliGitAPIImpl.java:2848)
at PluginClassLoader for git-client//org.jenkinsci.plugins.gitclient.CliGitAPIImpl.launchCommandIn(CliGitAPIImpl.java:2768)
at PluginClassLoader for git-client//org.jenkinsci.plugins.gitclient.CliGitAPIImpl.launchCommandIn(CliGitAPIImpl.java:2763)
at PluginClassLoader for git-client//org.jenkinsci.plugins.gitclient.CliGitAPIImpl.launchCommand(CliGitAPIImpl.java:2052)
at PluginClassLoader for git-client//org.jenkinsci.plugins.gitclient.CliGitAPIImpl.launchCommand(CliGitAPIImpl.java:2064)
at PluginClassLoader for git-client//org.jenkinsci.plugins.gitclient.CliGitAPIImpl.hasGitRepo(CliGitAPIImpl.java:404)
at PluginClassLoader for git-client//hudson.plugins.git.GitAPI.hasGitRepo(GitAPI.java:281)
at jdk.internal.reflect.GeneratedMethodAccessor34.invoke(Unknown Source)
at java.base/jdk.internal.reflect.DelegatingMethodAccessorImpl.invoke(DelegatingMethodAccessorImpl.java:43)
at java.base/java.lang.reflect.Method.invoke(Method.java:569)
at hudson.remoting.RemoteInvocationHandler$RPCRequest.perform(RemoteInvocationHandler.java:986)
at hudson.remoting.RemoteInvocationHandler$RPCRequest.call(RemoteInvocationHandler.java:961)
at hudson.remoting.RemoteInvocationHandler$RPCRequest.call(RemoteInvocationHandler.java:907)
at hudson.remoting.UserRequest.perform(UserRequest.java:225)
at hudson.remoting.UserRequest.perform(UserRequest.java:50)
at hudson.remoting.Request$2.run(Request.java:391)
at hudson.remoting.InterceptingExecutorService.lambda$wrap$0(InterceptingExecutorService.java:81)
at java.base/java.util.concurrent.FutureTask.run(FutureTask.java:264)
at java.base/java.util.concurrent.ThreadPoolExecutor.runWorker(ThreadPoolExecutor.java:1136)
at java.base/java.util.concurrent.ThreadPoolExecutor$Worker.run(ThreadPoolExecutor.java:635)
at java.base/java.lang.Thread.run(Thread.java:840)
Cloning the remote Git repository
Cloning repository https://gitbox.apache.org/repos/asf/solr.git
> git init /home/jenkins/jenkins-agent/workspace/Solr/Solr-Test-10.0 # timeout=10
Fetching upstream changes from https://gitbox.apache.org/repos/asf/solr.git
> git --version # timeout=10
> git --version # 'git version 2.43.0'
> git fetch --tags --force --progress -- https://gitbox.apache.org/repos/asf/solr.git +refs/heads/*:refs/remotes/origin/* # timeout=10
> git config remote.origin.url https://gitbox.apache.org/repos/asf/solr.git # timeout=10
> git config --add remote.origin.fetch +refs/heads/*:refs/remotes/origin/* # timeout=10
Avoid second fetch
> git rev-parse refs/remotes/origin/branch_10_0^{commit} # timeout=10
Checking out Revision 93068d1dfbc48816caac29c5b3aba3bf884aea85 (refs/remotes/origin/branch_10_0)
> git config core.sparsecheckout # timeout=10
> git checkout -f 93068d1dfbc48816caac29c5b3aba3bf884aea85 # timeout=10
> git branch -a -v --no-abbrev # timeout=10
> git checkout -b branch_10_0 93068d1dfbc48816caac29c5b3aba3bf884aea85 # timeout=10
Commit message: "Ref Guide - Change component name to Apache Solr (#4521)"
> git rev-list --no-walk 93068d1dfbc48816caac29c5b3aba3bf884aea85 # timeout=10
No emails were triggered.
provisioning config files...
copy managed file [gradle.properties] to file:/home/jenkins/jenkins-agent/workspace/Solr/Solr-Test-10.0/gradle.properties
[Gradle] - Launching build.
[Solr-Test-10.0] $ /home/jenkins/jenkins-agent/workspace/Solr/Solr-Test-10.0/gradlew -Dtests.haltonfailure=false -Dtests.badapples=false --continue test
Downloading gradle-wrapper.jar from https://raw.githubusercontent.com/gradle/gradle/v8.10.2/gradle/wrapper/gradle-wrapper.jar
Downloading https://services.gradle.org/distributions/gradle-8.10-bin.zip
.............10%.............20%.............30%.............40%.............50%.............60%.............70%.............80%.............90%.............100%
To honour the JVM settings for this build a single-use Daemon process will be forked. For more on this, please refer to https://docs.gradle.org/8.10/userguide/gradle_daemon.html#sec:disabling_the_daemon in the Gradle documentation.
Daemon will be stopped at the end of the build
> Task :build-infra:compileJava
Note: /home/jenkins/jenkins-agent/workspace/Solr/Solr-Test-10.0/build-tools/build-infra/src/main/java/org/apache/lucene/gradle/Checksum.java uses or overrides a deprecated API.
Note: Recompile with -Xlint:deprecation for details.
> Task :build-infra:pluginDescriptors
> Task :build-infra:processResources
> Task :build-infra:classes
> Task :build-infra:jar
> Task :gitStatus
> Task :checkJdkInternalsExportedToGradle
> Task :solr:api:compileJava
Note: Some input files use or override a deprecated API.
Note: Recompile with -Xlint:deprecation for details.
> Task :solr:api:processResources NO-SOURCE
> Task :solr:api:classes
> Task :solr:api:jar
> Task :randomizationInfo
Running tests with randomization seed: tests.seed=7203DD009EBBF5D5
> Task :solr:api:resolve
SLF4J(W): No SLF4J providers were found.
SLF4J(W): Defaulting to no-operation (NOP) logger implementation
SLF4J(W): See https://www.slf4j.org/codes.html#noProviders for further details.
> Task :solr:solrj:openApiGenerate
Cleaned up output directory /home/jenkins/jenkins-agent/workspace/Solr/Solr-Test-10.0/solr/solrj/build/generated/ before code generation (cleanupOutput set to true).
No application/json content media type found in response. Response examples can currently only be generated for application/json media type.
############################################################################################
# Thanks for using OpenAPI Generator. #
# We appreciate your support! Please consider donation to help us maintain this project. #
# https://opencollective.com/openapi_generator/donate #
############################################################################################
Successfully generated code to /home/jenkins/jenkins-agent/workspace/Solr/Solr-Test-10.0/solr/solrj/build/generated/
> Task :spotlessInternalRegisterDependencies
> Task :solr:solrj:generatedSpotlessHelper
> Task :solr:solrj:generatedSpotless
> Task :solr:solrj:compileJava
Note: Some input files use or override a deprecated API.
Note: Recompile with -Xlint:deprecation for details.
> Task :solr:solrj-jetty:compileJava
Note: /home/jenkins/jenkins-agent/workspace/Solr/Solr-Test-10.0/solr/solrj-jetty/src/java/org/apache/solr/client/solrj/jetty/HttpJettySolrClient.java uses or overrides a deprecated API.
Note: Recompile with -Xlint:deprecation for details.
> Task :solr:solrj-streaming:compileJava
Note: Some input files use or override a deprecated API.
Note: Recompile with -Xlint:deprecation for details.
> Task :solr:solrj-zookeeper:compileJava
Note: Some input files use or override a deprecated API.
Note: Recompile with -Xlint:deprecation for details.
> Task :solr:core:compileJava
Note: Some input files use or override a deprecated API.
Note: Recompile with -Xlint:deprecation for details.
> Task :solr:test-framework:compileJava
Note: Some input files use or override a deprecated API.
Note: Recompile with -Xlint:deprecation for details.
> Task :solr:api:compileTestJava
> Task :solr:api:processTestResources
> Task :solr:api:testClasses
> Task :solr:core:processResources
> Task :solr:core:classes
> Task :solr:core:jar
> Task :solr:solrj:processResources
> Task :solr:solrj:classes
> Task :solr:solrj:jar
> Task :solr:solrj-jetty:processResources NO-SOURCE
> Task :solr:solrj-jetty:classes
> Task :solr:solrj-jetty:jar
> Task :solr:solrj-streaming:processResources
> Task :solr:solrj-streaming:classes
> Task :solr:solrj-streaming:jar
> Task :solr:solrj-zookeeper:processResources NO-SOURCE
> Task :solr:solrj-zookeeper:classes
> Task :solr:solrj-zookeeper:jar
> Task :solr:test-framework:processResources
> Task :solr:test-framework:classes
> Task :solr:test-framework:jar
> Task :solr:api:test
WARNING: Using incubator modules: jdk.incubator.vector
WARNING: Using incubator modules: jdk.incubator.vector
WARNING: A command line option has enabled the Security Manager
WARNING: The Security Manager is deprecated and will be removed in a future release
WARNING: A command line option has enabled the Security Manager
WARNING: The Security Manager is deprecated and will be removed in a future release
java.security.policy: error adding Permission, java.net.URLPermission:
java.util.ServiceConfigurationError: Locale provider adapter "CLDR"cannot be instantiated.
java.security.policy: error adding Permission, java.net.URLPermission:
java.util.ServiceConfigurationError: Locale provider adapter "CLDR"cannot be instantiated.
java.security.policy: error adding Permission, java.net.URLPermission:
java.util.ServiceConfigurationError: Locale provider adapter "CLDR"cannot be instantiated.
java.security.policy: error adding Permission, java.net.URLPermission:
java.util.ServiceConfigurationError: Locale provider adapter "CLDR"cannot be instantiated.
java.security.policy: error adding Permission, java.net.URLPermission:
java.util.ServiceConfigurationError: Locale provider adapter "CLDR"cannot be instantiated.
java.security.policy: error adding Permission, java.net.URLPermission:
java.util.ServiceConfigurationError: Locale provider adapter "CLDR"cannot be instantiated.
:solr:api:test (SUCCESS): 19 test(s)
> Task :solr:api:wipeTaskTemp
> Task :solr:benchmark:compileJava
> Task :solr:benchmark:processResources
> Task :solr:benchmark:classes
> Task :solr:benchmark:compileTestJava
> Task :solr:benchmark:processTestResources
> Task :solr:benchmark:testClasses
> Task :solr:benchmark:test
WARNING: Using incubator modules: jdk.incubator.vector
WARNING: Using incubator modules: jdk.incubator.vector
WARNING: Using incubator modules: jdk.incubator.vector
WARNING: A command line option has enabled the Security Manager
WARNING: The Security Manager is deprecated and will be removed in a future release
WARNING: A command line option has enabled the Security Manager
WARNING: The Security Manager is deprecated and will be removed in a future release
WARNING: A command line option has enabled the Security Manager
WARNING: The Security Manager is deprecated and will be removed in a future release
java.security.policy: error adding Permission, java.net.URLPermission:
java.util.ServiceConfigurationError: Locale provider adapter "CLDR"cannot be instantiated.
java.security.policy: error adding Permission, java.net.URLPermission:
java.util.ServiceConfigurationError: Locale provider adapter "CLDR"cannot be instantiated.
java.security.policy: error adding Permission, java.net.URLPermission:
java.util.ServiceConfigurationError: Locale provider adapter "CLDR"cannot be instantiated.
java.security.policy: error adding Permission, java.net.URLPermission:
java.security.policy: error adding Permission, java.net.URLPermission:
java.util.ServiceConfigurationError: Locale provider adapter "CLDR"cannot be instantiated.
java.util.ServiceConfigurationError: Locale provider adapter "CLDR"cannot be instantiated.
java.security.policy: error adding Permission, java.net.URLPermission:
java.security.policy: error adding Permission, java.net.URLPermission:
java.util.ServiceConfigurationError: Locale provider adapter "CLDR"cannot be instantiated.
java.util.ServiceConfigurationError: Locale provider adapter "CLDR"cannot be instantiated.
java.security.policy: error adding Permission, java.net.URLPermission:
java.util.ServiceConfigurationError: Locale provider adapter "CLDR"cannot be instantiated.
java.security.policy: error adding Permission, java.net.URLPermission:
java.util.ServiceConfigurationError: Locale provider adapter "CLDR"cannot be instantiated.
:solr:benchmark:test (SUCCESS): 10 test(s)
> Task :solr:benchmark:wipeTaskTemp
> Task :solr:core:compileTestJava
Note: Some input files use or override a deprecated API.
Note: Recompile with -Xlint:deprecation for details.
> Task :solr:core:processTestResources
> Task :solr:core:testClasses
> Task :solr:modules:analysis-extras:compileJava
Note: /home/jenkins/jenkins-agent/workspace/Solr/Solr-Test-10.0/solr/modules/analysis-extras/src/java/org/apache/solr/schema/ICUCollationField.java uses or overrides a deprecated API.
Note: Recompile with -Xlint:deprecation for details.
> Task :solr:modules:analysis-extras:processResources NO-SOURCE
> Task :solr:modules:analysis-extras:classes
> Task :solr:modules:analysis-extras:jar
> Task :solr:core:test
WARNING: Using incubator modules: jdk.incubator.vector
WARNING: Using incubator modules: jdk.incubator.vector
WARNING: Using incubator modules: jdk.incubator.vector
WARNING: A command line option has enabled the Security Manager
WARNING: The Security Manager is deprecated and will be removed in a future release
WARNING: Using incubator modules: jdk.incubator.vector
WARNING: A command line option has enabled the Security Manager
WARNING: The Security Manager is deprecated and will be removed in a future release
WARNING: A command line option has enabled the Security Manager
WARNING: The Security Manager is deprecated and will be removed in a future release
WARNING: A command line option has enabled the Security Manager
WARNING: The Security Manager is deprecated and will be removed in a future release
java.security.policy: error adding Permission, java.net.URLPermission:
java.util.ServiceConfigurationError: Locale provider adapter "CLDR"cannot be instantiated.
java.security.policy: error adding Permission, java.net.URLPermission:
java.util.ServiceConfigurationError: Locale provider adapter "CLDR"cannot be instantiated.
java.security.policy: error adding Permission, java.net.URLPermission:
java.util.ServiceConfigurationError: Locale provider adapter "CLDR"cannot be instantiated.
java.security.policy: error adding Permission, java.net.URLPermission:
java.util.ServiceConfigurationError: Locale provider adapter "CLDR"cannot be instantiated.
java.security.policy: error adding Permission, java.net.URLPermission:
java.util.ServiceConfigurationError: Locale provider adapter "CLDR"cannot be instantiated.
java.security.policy: error adding Permission, java.net.URLPermission:
java.util.ServiceConfigurationError: Locale provider adapter "CLDR"cannot be instantiated.
java.security.policy: error adding Permission, java.net.URLPermission:
java.util.ServiceConfigurationError: Locale provider adapter "CLDR"cannot be instantiated.
java.security.policy: error adding Permission, java.net.URLPermission:
java.util.ServiceConfigurationError: Locale provider adapter "CLDR"cannot be instantiated.
java.security.policy: error adding Permission, java.net.URLPermission:
java.util.ServiceConfigurationError: Locale provider adapter "CLDR"cannot be instantiated.
java.security.policy: error adding Permission, java.net.URLPermission:
java.util.ServiceConfigurationError: Locale provider adapter "CLDR"cannot be instantiated.
java.security.policy: error adding Permission, java.net.URLPermission:
java.util.ServiceConfigurationError: Locale provider adapter "CLDR"cannot be instantiated.
java.security.policy: error adding Permission, java.net.URLPermission:
java.util.ServiceConfigurationError: Locale provider adapter "CLDR"cannot be instantiated.
WARNING: Test org.apache.solr.TestRandomDVFaceting wrote 10,965,255 bytes of output.
WARNING: Test org.apache.solr.TestRandomFaceting wrote 32,615,741 bytes of output.
WARNING: Test org.apache.solr.cloud.TestStressCloudBlindAtomicUpdates wrote 13,367,990 bytes of output.
WARNING: Test org.apache.solr.cloud.TestRandomFlRTGCloud wrote 18,439,312 bytes of output.
WARNING: Test org.apache.solr.cloud.TestStressInPlaceUpdates wrote 15,691,038 bytes of output.
[636.497s][warning][jfr,system] Could not initialize JDK events. access denied ("java.lang.RuntimePermission" "accessClassInPackage.jdk.internal.event")
[668.050s][warning][jfr,system] Could not initialize JDK events. access denied ("java.lang.RuntimePermission" "accessClassInPackage.jdk.internal.event")
> Task :solr:core:test
WARNING: Test org.apache.solr.search.TestRealTimeGet wrote 12,570,244 bytes of output.
WARNING: Test org.apache.solr.search.facet.TestCloudJSONFacetSKGEquiv wrote 17,165,852 bytes of output.
[975.024s][warning][jfr,system] Could not initialize JDK events. access denied ("java.lang.RuntimePermission" "accessClassInPackage.jdk.internal.event")
> Task :solr:core:test
WARNING: Test org.apache.solr.search.TestRangeQuery wrote 14,496,398 bytes of output.
WARNING: Test org.apache.solr.search.TestRandomCollapseQParserPlugin wrote 22,657,521 bytes of output.
WARNING: Test org.apache.solr.schema.TestPointFields wrote 21,538,082 bytes of output.
WARNING: Test org.apache.solr.search.TestStressVersions wrote 11,498,405 bytes of output.
WARNING: Test org.apache.solr.search.TestStressReorder wrote 13,825,648 bytes of output.
WARNING: Test org.apache.solr.update.TestInPlaceUpdatesStandalone wrote 32,118,219 bytes of output.
WARNING: Test org.apache.solr.search.facet.TestCloudJSONFacetSKG wrote 55,455,720 bytes of output.
:solr:core:test (SUCCESS): 5176 test(s), 180 skipped
> Task :solr:core:wipeTaskTemp
> Task :solr:modules:cross-dc:compileJava
Note: Some input files use or override a deprecated API.
Note: Recompile with -Xlint:deprecation for details.
> Task :solr:cross-dc-manager:compileJava
Note: Some input files use or override a deprecated API.
Note: Recompile with -Xlint:deprecation for details.
> Task :solr:cross-dc-manager:processResources NO-SOURCE
> Task :solr:cross-dc-manager:classes
> Task :solr:cross-dc-manager:compileTestJava
Note: Some input files use or override a deprecated API.
Note: Recompile with -Xlint:deprecation for details.
> Task :solr:cross-dc-manager:processTestResources
> Task :solr:cross-dc-manager:testClasses
> Task :solr:modules:cross-dc:processResources NO-SOURCE
> Task :solr:modules:cross-dc:classes
> Task :solr:modules:cross-dc:jar
> Task :solr:cross-dc-manager:test
WARNING: Using incubator modules: jdk.incubator.vector
WARNING: Using incubator modules: jdk.incubator.vector
WARNING: Using incubator modules: jdk.incubator.vector
WARNING: Using incubator modules: jdk.incubator.vector
WARNING: A command line option has enabled the Security Manager
WARNING: The Security Manager is deprecated and will be removed in a future release
WARNING: A command line option has enabled the Security Manager
WARNING: The Security Manager is deprecated and will be removed in a future release
WARNING: A command line option has enabled the Security Manager
WARNING: The Security Manager is deprecated and will be removed in a future release
WARNING: A command line option has enabled the Security Manager
WARNING: The Security Manager is deprecated and will be removed in a future release
java.security.policy: error adding Permission, java.net.URLPermission:
java.security.policy: error adding Permission, java.net.URLPermission:
java.util.ServiceConfigurationError: Locale provider adapter "CLDR"cannot be instantiated.
java.util.ServiceConfigurationError: Locale provider adapter "CLDR"cannot be instantiated.
java.security.policy: error adding Permission, java.net.URLPermission:
java.security.policy: error adding Permission, java.net.URLPermission:
java.util.ServiceConfigurationError: Locale provider adapter "CLDR"cannot be instantiated.
java.util.ServiceConfigurationError: Locale provider adapter "CLDR"cannot be instantiated.
java.security.policy: error adding Permission, java.net.URLPermission:
java.util.ServiceConfigurationError: Locale provider adapter "CLDR"cannot be instantiated.
java.security.policy: error adding Permission, java.net.URLPermission:
java.util.ServiceConfigurationError: Locale provider adapter "CLDR"cannot be instantiated.
java.security.policy: error adding Permission, java.net.URLPermission:
java.util.ServiceConfigurationError: Locale provider adapter "CLDR"cannot be instantiated.
java.security.policy: error adding Permission, java.net.URLPermission:
java.util.ServiceConfigurationError: Locale provider adapter "CLDR"cannot be instantiated.
java.security.policy: error adding Permission, java.net.URLPermission:
java.util.ServiceConfigurationError: Locale provider adapter "CLDR"cannot be instantiated.
java.security.policy: error adding Permission, java.net.URLPermission:
java.util.ServiceConfigurationError: Locale provider adapter "CLDR"cannot be instantiated.
java.security.policy: error adding Permission, java.net.URLPermission:
java.util.ServiceConfigurationError: Locale provider adapter "CLDR"cannot be instantiated.
java.security.policy: error adding Permission, java.net.URLPermission:
java.util.ServiceConfigurationError: Locale provider adapter "CLDR"cannot be instantiated.
OpenJDK 64-Bit Server VM warning: Sharing is only supported for boot loader classes because bootstrap classpath has been appended
OpenJDK 64-Bit Server VM warning: Sharing is only supported for boot loader classes because bootstrap classpath has been appended
OpenJDK 64-Bit Server VM warning: Sharing is only supported for boot loader classes because bootstrap classpath has been appended
OpenJDK 64-Bit Server VM warning: Sharing is only supported for boot loader classes because bootstrap classpath has been appended
> Task :solr:cross-dc-manager:test
:solr:cross-dc-manager:test (SUCCESS): 38 test(s), 7 skipped
> Task :solr:cross-dc-manager:wipeTaskTemp
> Task :solr:server:compileJava SKIPPED
> Task :solr:server:processResources NO-SOURCE
> Task :solr:server:classes UP-TO-DATE
> Task :solr:server:compileTestJava NO-SOURCE
> Task :solr:server:processTestResources NO-SOURCE
> Task :solr:server:testClasses UP-TO-DATE
> Task :solr:server:test NO-SOURCE
> Task :solr:server:wipeTaskTemp
> Task :solr:solr-ref-guide:compileJava NO-SOURCE
> Task :solr:solr-ref-guide:processResources NO-SOURCE
> Task :solr:solr-ref-guide:classes UP-TO-DATE
> Task :solr:solr-ref-guide:compileTestJava
Note: /home/jenkins/jenkins-agent/workspace/Solr/Solr-Test-10.0/solr/solr-ref-guide/modules/indexing-guide/examples/IndexingNestedDocuments.java uses or overrides a deprecated API.
Note: Recompile with -Xlint:deprecation for details.
> Task :solr:solr-ref-guide:copySolrjTestResources
> Task :solr:solr-ref-guide:processTestResources NO-SOURCE
> Task :solr:solr-ref-guide:testClasses
> Task :solr:modules:sql:compileJava
Note: Some input files use or override a deprecated API.
Note: Recompile with -Xlint:deprecation for details.
> Task :solr:modules:sql:processResources
> Task :solr:modules:sql:classes
> Task :solr:modules:sql:jar
> Task :solr:solr-ref-guide:test
WARNING: Using incubator modules: jdk.incubator.vector
WARNING: Using incubator modules: jdk.incubator.vector
WARNING: Using incubator modules: jdk.incubator.vector
WARNING: Using incubator modules: jdk.incubator.vector
WARNING: A command line option has enabled the Security Manager
WARNING: The Security Manager is deprecated and will be removed in a future release
WARNING: A command line option has enabled the Security Manager
WARNING: The Security Manager is deprecated and will be removed in a future release
WARNING: A command line option has enabled the Security Manager
WARNING: The Security Manager is deprecated and will be removed in a future release
WARNING: A command line option has enabled the Security Manager
WARNING: The Security Manager is deprecated and will be removed in a future release
java.security.policy: error adding Permission, java.net.URLPermission:
java.util.ServiceConfigurationError: Locale provider adapter "CLDR"cannot be instantiated.
java.security.policy: error adding Permission, java.net.URLPermission:
java.util.ServiceConfigurationError: Locale provider adapter "CLDR"cannot be instantiated.
java.security.policy: error adding Permission, java.net.URLPermission:
java.util.ServiceConfigurationError: Locale provider adapter "CLDR"cannot be instantiated.
java.security.policy: error adding Permission, java.net.URLPermission:
java.util.ServiceConfigurationError: Locale provider adapter "CLDR"cannot be instantiated.
java.security.policy: error adding Permission, java.net.URLPermission:
java.util.ServiceConfigurationError: Locale provider adapter "CLDR"cannot be instantiated.
java.security.policy: error adding Permission, java.net.URLPermission:
java.util.ServiceConfigurationError: Locale provider adapter "CLDR"cannot be instantiated.
java.security.policy: error adding Permission, java.net.URLPermission:
java.util.ServiceConfigurationError: Locale provider adapter "CLDR"cannot be instantiated.
java.security.policy: error adding Permission, java.net.URLPermission:
java.util.ServiceConfigurationError: Locale provider adapter "CLDR"cannot be instantiated.
java.security.policy: error adding Permission, java.net.URLPermission:
java.util.ServiceConfigurationError: Locale provider adapter "CLDR"cannot be instantiated.
java.security.policy: error adding Permission, java.net.URLPermission:
java.util.ServiceConfigurationError: Locale provider adapter "CLDR"cannot be instantiated.
java.security.policy: error adding Permission, java.net.URLPermission:
java.util.ServiceConfigurationError: Locale provider adapter "CLDR"cannot be instantiated.
java.security.policy: error adding Permission, java.net.URLPermission:
java.util.ServiceConfigurationError: Locale provider adapter "CLDR"cannot be instantiated.
:solr:solr-ref-guide:test (SUCCESS): 34 test(s)
> Task :solr:solr-ref-guide:wipeTaskTemp
> Task :solr:solrj:compileTestJava
Note: Some input files use or override a deprecated API.
Note: Recompile with -Xlint:deprecation for details.
> Task :solr:solrj:processTestResources
> Task :solr:solrj:testClasses
> Task :solr:solrj:testJar
> Task :solr:solrj:test
WARNING: Using incubator modules: jdk.incubator.vector
WARNING: Using incubator modules: jdk.incubator.vector
WARNING: Using incubator modules: jdk.incubator.vector
WARNING: Using incubator modules: jdk.incubator.vector
WARNING: A command line option has enabled the Security Manager
WARNING: The Security Manager is deprecated and will be removed in a future release
WARNING: A command line option has enabled the Security Manager
WARNING: The Security Manager is deprecated and will be removed in a future release
WARNING: A command line option has enabled the Security Manager
WARNING: The Security Manager is deprecated and will be removed in a future release
WARNING: A command line option has enabled the Security Manager
WARNING: The Security Manager is deprecated and will be removed in a future release
java.security.policy: error adding Permission, java.net.URLPermission:
java.util.ServiceConfigurationError: Locale provider adapter "CLDR"cannot be instantiated.
java.security.policy: error adding Permission, java.net.URLPermission:
java.util.ServiceConfigurationError: Locale provider adapter "CLDR"cannot be instantiated.
java.security.policy: error adding Permission, java.net.URLPermission:
java.util.ServiceConfigurationError: Locale provider adapter "CLDR"cannot be instantiated.
java.security.policy: error adding Permission, java.net.URLPermission:
java.util.ServiceConfigurationError: Locale provider adapter "CLDR"cannot be instantiated.
java.security.policy: error adding Permission, java.net.URLPermission:
java.util.ServiceConfigurationError: Locale provider adapter "CLDR"cannot be instantiated.
java.security.policy: error adding Permission, java.net.URLPermission:
java.util.ServiceConfigurationError: Locale provider adapter "CLDR"cannot be instantiated.
java.security.policy: error adding Permission, java.net.URLPermission:
java.util.ServiceConfigurationError: Locale provider adapter "CLDR"cannot be instantiated.
java.security.policy: error adding Permission, java.net.URLPermission:
java.util.ServiceConfigurationError: Locale provider adapter "CLDR"cannot be instantiated.
java.security.policy: error adding Permission, java.net.URLPermission:
java.util.ServiceConfigurationError: Locale provider adapter "CLDR"cannot be instantiated.
java.security.policy: error adding Permission, java.net.URLPermission:
java.util.ServiceConfigurationError: Locale provider adapter "CLDR"cannot be instantiated.
java.security.policy: error adding Permission, java.net.URLPermission:
java.util.ServiceConfigurationError: Locale provider adapter "CLDR"cannot be instantiated.
java.security.policy: error adding Permission, java.net.URLPermission:
java.util.ServiceConfigurationError: Locale provider adapter "CLDR"cannot be instantiated.
[2.759s][warning][jfr,system] Could not initialize JDK events. access denied ("java.lang.RuntimePermission" "accessClassInPackage.jdk.internal.event")
[20.455s][warning][jfr,system] Could not initialize JDK events. access denied ("java.lang.RuntimePermission" "accessClassInPackage.jdk.internal.event")
[24.528s][warning][jfr,system] Could not initialize JDK events. access denied ("java.lang.RuntimePermission" "accessClassInPackage.jdk.internal.event")
[30.526s][warning][jfr,system] Could not initialize JDK events. access denied ("java.lang.RuntimePermission" "accessClassInPackage.jdk.internal.event")
> Task :solr:solrj:test
:solr:solrj:test (SUCCESS): 1176 test(s), 40 skipped
> Task :solr:solrj:wipeTaskTemp
> Task :solr:solrj-jetty:compileTestJava
Note: Some input files use or override a deprecated API.
Note: Recompile with -Xlint:deprecation for details.
> Task :solr:solrj-jetty:processTestResources
> Task :solr:solrj-jetty:testClasses
> Task :solr:solrj-jetty:test
WARNING: Using incubator modules: jdk.incubator.vector
WARNING: Using incubator modules: jdk.incubator.vector
WARNING: Using incubator modules: jdk.incubator.vector
WARNING: A command line option has enabled the Security Manager
WARNING: The Security Manager is deprecated and will be removed in a future release
WARNING: Using incubator modules: jdk.incubator.vector
WARNING: A command line option has enabled the Security Manager
WARNING: The Security Manager is deprecated and will be removed in a future release
WARNING: A command line option has enabled the Security Manager
WARNING: The Security Manager is deprecated and will be removed in a future release
WARNING: A command line option has enabled the Security Manager
WARNING: The Security Manager is deprecated and will be removed in a future release
java.security.policy: error adding Permission, java.net.URLPermission:
java.util.ServiceConfigurationError: Locale provider adapter "CLDR"cannot be instantiated.
java.security.policy: error adding Permission, java.net.URLPermission:
java.util.ServiceConfigurationError: Locale provider adapter "CLDR"cannot be instantiated.
java.security.policy: error adding Permission, java.net.URLPermission:
java.util.ServiceConfigurationError: Locale provider adapter "CLDR"cannot be instantiated.
java.security.policy: error adding Permission, java.net.URLPermission:
java.util.ServiceConfigurationError: Locale provider adapter "CLDR"cannot be instantiated.
java.security.policy: error adding Permission, java.net.URLPermission:
java.util.ServiceConfigurationError: Locale provider adapter "CLDR"cannot be instantiated.
java.security.policy: error adding Permission, java.net.URLPermission:
java.util.ServiceConfigurationError: Locale provider adapter "CLDR"cannot be instantiated.
java.security.policy: error adding Permission, java.net.URLPermission:
java.util.ServiceConfigurationError: Locale provider adapter "CLDR"cannot be instantiated.
java.security.policy: error adding Permission, java.net.URLPermission:
java.util.ServiceConfigurationError: Locale provider adapter "CLDR"cannot be instantiated.
java.security.policy: error adding Permission, java.net.URLPermission:
java.util.ServiceConfigurationError: Locale provider adapter "CLDR"cannot be instantiated.
java.security.policy: error adding Permission, java.net.URLPermission:
java.util.ServiceConfigurationError: Locale provider adapter "CLDR"cannot be instantiated.
java.security.policy: error adding Permission, java.net.URLPermission:
java.util.ServiceConfigurationError: Locale provider adapter "CLDR"cannot be instantiated.
java.security.policy: error adding Permission, java.net.URLPermission:
java.util.ServiceConfigurationError: Locale provider adapter "CLDR"cannot be instantiated.
:solr:solrj-jetty:test (SUCCESS): 53 test(s)
> Task :solr:solrj-jetty:wipeTaskTemp
> Task :solr:solrj-streaming:compileTestJava
Note: Some input files use or override a deprecated API.
Note: Recompile with -Xlint:deprecation for details.
> Task :solr:solrj-streaming:processTestResources
> Task :solr:solrj-streaming:testClasses
> Task :solr:solrj-streaming:test
WARNING: Using incubator modules: jdk.incubator.vector
WARNING: Using incubator modules: jdk.incubator.vector
WARNING: A command line option has enabled the Security Manager
WARNING: The Security Manager is deprecated and will be removed in a future release
WARNING: A command line option has enabled the Security Manager
WARNING: The Security Manager is deprecated and will be removed in a future release
WARNING: Using incubator modules: jdk.incubator.vector
WARNING: Using incubator modules: jdk.incubator.vector
WARNING: A command line option has enabled the Security Manager
WARNING: The Security Manager is deprecated and will be removed in a future release
WARNING: A command line option has enabled the Security Manager
WARNING: The Security Manager is deprecated and will be removed in a future release
java.security.policy: error adding Permission, java.net.URLPermission:
java.util.ServiceConfigurationError: Locale provider adapter "CLDR"cannot be instantiated.
java.security.policy: error adding Permission, java.net.URLPermission:
java.util.ServiceConfigurationError: Locale provider adapter "CLDR"cannot be instantiated.
java.security.policy: error adding Permission, java.net.URLPermission:
java.util.ServiceConfigurationError: Locale provider adapter "CLDR"cannot be instantiated.
java.security.policy: error adding Permission, java.net.URLPermission:
java.util.ServiceConfigurationError: Locale provider adapter "CLDR"cannot be instantiated.
java.security.policy: error adding Permission, java.net.URLPermission:
java.util.ServiceConfigurationError: Locale provider adapter "CLDR"cannot be instantiated.
java.security.policy: error adding Permission, java.net.URLPermission:
java.util.ServiceConfigurationError: Locale provider adapter "CLDR"cannot be instantiated.
java.security.policy: error adding Permission, java.net.URLPermission:
java.util.ServiceConfigurationError: Locale provider adapter "CLDR"cannot be instantiated.
java.security.policy: error adding Permission, java.net.URLPermission:
java.util.ServiceConfigurationError: Locale provider adapter "CLDR"cannot be instantiated.
java.security.policy: error adding Permission, java.net.URLPermission:
java.util.ServiceConfigurationError: Locale provider adapter "CLDR"cannot be instantiated.
java.security.policy: error adding Permission, java.net.URLPermission:
java.util.ServiceConfigurationError: Locale provider adapter "CLDR"cannot be instantiated.
java.security.policy: error adding Permission, java.net.URLPermission:
java.util.ServiceConfigurationError: Locale provider adapter "CLDR"cannot be instantiated.
java.security.policy: error adding Permission, java.net.URLPermission:
java.util.ServiceConfigurationError: Locale provider adapter "CLDR"cannot be instantiated.
StreamDecoratorTest > testParallelUpdateStream FAILED
java.io.IOException: java.io.IOException: --> http://127.0.0.1:39881/solr/collection1_shard2_replica_n2/:Error from server at http://127.0.0.1:37793/solr/parallelDestinationCollection_shard2_replica_n1/update?_stateVer_=parallelDestinationCollection%3A3&wt=javabin: Could not parse response with encoding ıso-8859-1
at __randomizedtesting.SeedInfo.seed([7203DD009EBBF5D5:11ED9EE2C28F0EBE]:0)
at org.apache.solr.common.util.ExecutorUtil.submitAllAndAwaitAggregatingExceptions(ExecutorUtil.java:456)
at org.apache.solr.client.solrj.io.stream.StreamExecutorHelper.submitAllAndAwaitAggregatingExceptions(StreamExecutorHelper.java:47)
at org.apache.solr.client.solrj.io.stream.CloudSolrStream.openStreams(CloudSolrStream.java:424)
at org.apache.solr.client.solrj.io.stream.CloudSolrStream.open(CloudSolrStream.java:291)
at org.apache.solr.client.solrj.io.stream.StreamDecoratorTest.getTuples(StreamDecoratorTest.java:5299)
at org.apache.solr.client.solrj.io.stream.StreamDecoratorTest.testParallelUpdateStream(StreamDecoratorTest.java:3430)
at java.base/jdk.internal.reflect.DirectMethodHandleAccessor.invoke(DirectMethodHandleAccessor.java:103)
at java.base/java.lang.reflect.Method.invoke(Method.java:580)
at com.carrotsearch.randomizedtesting.RandomizedRunner.invoke(RandomizedRunner.java:1763)
at com.carrotsearch.randomizedtesting.RandomizedRunner$8.evaluate(RandomizedRunner.java:946)
at com.carrotsearch.randomizedtesting.RandomizedRunner$9.evaluate(RandomizedRunner.java:982)
at com.carrotsearch.randomizedtesting.RandomizedRunner$10.evaluate(RandomizedRunner.java:996)
at com.carrotsearch.randomizedtesting.rules.SystemPropertiesRestoreRule$1.evaluate(SystemPropertiesRestoreRule.java:80)
at org.junit.rules.RunRules.evaluate(RunRules.java:20)
at org.apache.lucene.tests.util.TestRuleSetupTeardownChained$1.evaluate(TestRuleSetupTeardownChained.java:48)
at org.apache.lucene.tests.util.AbstractBeforeAfterRule$1.evaluate(AbstractBeforeAfterRule.java:43)
at org.apache.lucene.tests.util.TestRuleThreadAndTestName$1.evaluate(TestRuleThreadAndTestName.java:45)
at org.apache.lucene.tests.util.TestRuleIgnoreAfterMaxFailures$1.evaluate(TestRuleIgnoreAfterMaxFailures.java:60)
at org.apache.lucene.tests.util.TestRuleMarkFailure$1.evaluate(TestRuleMarkFailure.java:44)
at org.junit.rules.RunRules.evaluate(RunRules.java:20)
at com.carrotsearch.randomizedtesting.rules.StatementAdapter.evaluate(StatementAdapter.java:36)
at com.carrotsearch.randomizedtesting.ThreadLeakControl$StatementRunner.run(ThreadLeakControl.java:390)
at com.carrotsearch.randomizedtesting.ThreadLeakControl.forkTimeoutingTask(ThreadLeakControl.java:843)
at com.carrotsearch.randomizedtesting.ThreadLeakControl$3.evaluate(ThreadLeakControl.java:490)
at com.carrotsearch.randomizedtesting.RandomizedRunner.runSingleTest(RandomizedRunner.java:955)
at com.carrotsearch.randomizedtesting.RandomizedRunner$5.evaluate(RandomizedRunner.java:840)
at com.carrotsearch.randomizedtesting.RandomizedRunner$6.evaluate(RandomizedRunner.java:891)
at com.carrotsearch.randomizedtesting.RandomizedRunner$7.evaluate(RandomizedRunner.java:902)
at com.carrotsearch.randomizedtesting.rules.StatementAdapter.evaluate(StatementAdapter.java:36)
at com.carrotsearch.randomizedtesting.rules.StatementAdapter.evaluate(StatementAdapter.java:36)
at org.apache.lucene.tests.util.AbstractBeforeAfterRule$1.evaluate(AbstractBeforeAfterRule.java:43)
at com.carrotsearch.randomizedtesting.rules.SystemPropertiesRestoreRule$1.evaluate(SystemPropertiesRestoreRule.java:80)
at org.junit.rules.RunRules.evaluate(RunRules.java:20)
at org.apache.lucene.tests.util.AbstractBeforeAfterRule$1.evaluate(AbstractBeforeAfterRule.java:43)
at com.carrotsearch.randomizedtesting.rules.StatementAdapter.evaluate(StatementAdapter.java:36)
at org.apache.lucene.tests.util.TestRuleStoreClassName$1.evaluate(TestRuleStoreClassName.java:38)
at com.carrotsearch.randomizedtesting.rules.NoShadowingOrOverridesOnMethodsRule$1.evaluate(NoShadowingOrOverridesOnMethodsRule.java:40)
at com.carrotsearch.randomizedtesting.rules.NoShadowingOrOverridesOnMethodsRule$1.evaluate(NoShadowingOrOverridesOnMethodsRule.java:40)
at com.carrotsearch.randomizedtesting.rules.StatementAdapter.evaluate(StatementAdapter.java:36)
at com.carrotsearch.randomizedtesting.rules.StatementAdapter.evaluate(StatementAdapter.java:36)
at org.apache.lucene.tests.util.TestRuleAssertionsRequired$1.evaluate(TestRuleAssertionsRequired.java:53)
at org.apache.lucene.tests.util.AbstractBeforeAfterRule$1.evaluate(AbstractBeforeAfterRule.java:43)
at org.apache.lucene.tests.util.TestRuleMarkFailure$1.evaluate(TestRuleMarkFailure.java:44)
at org.apache.lucene.tests.util.TestRuleIgnoreAfterMaxFailures$1.evaluate(TestRuleIgnoreAfterMaxFailures.java:60)
at org.apache.lucene.tests.util.TestRuleIgnoreTestSuites$1.evaluate(TestRuleIgnoreTestSuites.java:47)
at org.junit.rules.RunRules.evaluate(RunRules.java:20)
at com.carrotsearch.randomizedtesting.rules.StatementAdapter.evaluate(StatementAdapter.java:36)
at com.carrotsearch.randomizedtesting.ThreadLeakControl$StatementRunner.run(ThreadLeakControl.java:390)
at com.carrotsearch.randomizedtesting.ThreadLeakControl.lambda$forkTimeoutingTask$0(ThreadLeakControl.java:850)
at java.base/java.lang.Thread.run(Thread.java:1583)
Caused by:
java.io.IOException: --> http://127.0.0.1:39881/solr/collection1_shard2_replica_n2/:Error from server at http://127.0.0.1:37793/solr/parallelDestinationCollection_shard2_replica_n1/update?_stateVer_=parallelDestinationCollection%3A3&wt=javabin: Could not parse response with encoding ıso-8859-1
at org.apache.solr.client.solrj.io.stream.SolrStream.read(SolrStream.java:224)
at org.apache.solr.client.solrj.io.stream.CloudSolrStream$TupleWrapper.next(CloudSolrStream.java:512)
at org.apache.solr.client.solrj.io.stream.CloudSolrStream$StreamOpener.call(CloudSolrStream.java:536)
at org.apache.solr.client.solrj.io.stream.CloudSolrStream$StreamOpener.call(CloudSolrStream.java:522)
at java.base/java.util.concurrent.FutureTask.run(FutureTask.java:317)
at org.apache.solr.common.util.ExecutorUtil$MDCAwareThreadPoolExecutor.lambda$execute$0(ExecutorUtil.java:381)
at java.base/java.util.concurrent.ThreadPoolExecutor.runWorker(ThreadPoolExecutor.java:1144)
at java.base/java.util.concurrent.ThreadPoolExecutor$Worker.run(ThreadPoolExecutor.java:642)
... 1 more
org.apache.solr.client.solrj.io.stream.StreamDecoratorTest > test suite's output saved to /home/jenkins/jenkins-agent/workspace/Solr/Solr-Test-10.0/solr/solrj-streaming/build/test-results/test/outputs/OUTPUT-org.apache.solr.client.solrj.io.stream.StreamDecoratorTest.txt, copied below:
2> 7721 INFO (SUITE-StreamDecoratorTest-seed#[7203DD009EBBF5D5]-worker) [] o.a.s.SolrTestCase Setting 'solr.configset.default.confdir' system property to test-framework derived value of '/home/jenkins/jenkins-agent/workspace/Solr/Solr-Test-10.0/solr/server/solr/configsets/_default/conf'
2> 7721 INFO (SUITE-StreamDecoratorTest-seed#[7203DD009EBBF5D5]-worker) [] o.a.s.SolrTestCaseJ4 SecureRandom sanity checks: test.solr.allowed.securerandom=null & java.security.egd=file:/dev/./urandom
2> 7722 INFO (SUITE-StreamDecoratorTest-seed#[7203DD009EBBF5D5]-worker) [] o.a.s.u.ErrorLogMuter Closing ErrorLogMuter-regex-4 after mutting 0 log messages
2> 7722 INFO (SUITE-StreamDecoratorTest-seed#[7203DD009EBBF5D5]-worker) [] o.a.s.u.ErrorLogMuter Creating ErrorLogMuter-regex-5 for ERROR logs matching regex: ignore_exception
2> 7723 INFO (SUITE-StreamDecoratorTest-seed#[7203DD009EBBF5D5]-worker) [] o.a.s.SolrTestCaseJ4 Created dataDir: /home/jenkins/jenkins-agent/workspace/Solr/Solr-Test-10.0/build/tmp/tests-tmp/org.apache.solr.client.solrj.io.stream.StreamDecoratorTest_7203DD009EBBF5D5-001/data-dir-3-001
2> 7723 WARN (SUITE-StreamDecoratorTest-seed#[7203DD009EBBF5D5]-worker) [] o.a.s.SolrTestCaseJ4 startTrackingSearchers: numOpens=23 numCloses=23
2> 7723 INFO (SUITE-StreamDecoratorTest-seed#[7203DD009EBBF5D5]-worker) [] o.a.s.SolrTestCaseJ4 Using PointFields (NUMERIC_POINTS_SYSPROP=true) w/NUMERIC_DOCVALUES_SYSPROP=false
2> 7724 INFO (SUITE-StreamDecoratorTest-seed#[7203DD009EBBF5D5]-worker) [] o.a.s.SolrTestCaseJ4 Randomized ssl (false) and clientAuth (false) via: @org.apache.solr.SolrTestCaseJ4.SuppressSSL(bugUrl="None")
2> 7725 INFO (SUITE-StreamDecoratorTest-seed#[7203DD009EBBF5D5]-worker) [] o.a.s.c.OpenTelemetryConfigurator OpenTelemetry tracer enabled with simple propagation only.
2> 7725 INFO (SUITE-StreamDecoratorTest-seed#[7203DD009EBBF5D5]-worker) [] o.a.s.c.MiniSolrCloudCluster Starting cluster of 4 servers in /home/jenkins/jenkins-agent/workspace/Solr/Solr-Test-10.0/build/tmp/tests-tmp/org.apache.solr.client.solrj.io.stream.StreamDecoratorTest_7203DD009EBBF5D5-001/tempDir-001
2> 7725 INFO (SUITE-StreamDecoratorTest-seed#[7203DD009EBBF5D5]-worker) [] o.a.s.c.ZkTestServer STARTING ZK TEST SERVER
2> 7725 INFO (ZkTestServer Run Thread) [] o.a.s.c.ZkTestServer client port: /127.0.0.1:0
2> 7725 INFO (ZkTestServer Run Thread) [] o.a.s.c.ZkTestServer Starting server
2> 7726 WARN (ZkTestServer Run Thread) [] o.a.z.s.ServerCnxnFactory maxCnxns is not configured, using default value 0.
2> 7825 INFO (SUITE-StreamDecoratorTest-seed#[7203DD009EBBF5D5]-worker) [] o.a.s.c.ZkTestServer start zk server on port: 43113
2> 7827 WARN (SUITE-StreamDecoratorTest-seed#[7203DD009EBBF5D5]-worker) [] o.a.s.c.c.SolrZkClient Using default ZkCredentialsInjector. ZkCredentialsInjector is not secure, it creates an empty list of credentials which leads to 'OPEN_ACL_UNSAFE' ACLs to Zookeeper nodes
2> 7827 WARN (SUITE-StreamDecoratorTest-seed#[7203DD009EBBF5D5]-worker) [] o.a.s.c.c.SolrZkClient Using default ZkACLProvider. DefaultZkACLProvider is not secure, it creates 'OPEN_ACL_UNSAFE' ACLs to Zookeeper nodes
2> 7827 INFO (SUITE-StreamDecoratorTest-seed#[7203DD009EBBF5D5]-worker) [] o.a.c.f.i.CuratorFrameworkImpl Starting
2> 7829 INFO (SUITE-StreamDecoratorTest-seed#[7203DD009EBBF5D5]-worker) [] o.a.c.f.i.CuratorFrameworkImpl Default schema
2> 7830 INFO (SUITE-StreamDecoratorTest-seed#[7203DD009EBBF5D5]-worker-EventThread) [] o.a.c.f.s.ConnectionStateManager State change: CONNECTED
2> 7831 INFO (SUITE-StreamDecoratorTest-seed#[7203DD009EBBF5D5]-worker-EventThread) [] o.a.c.f.i.EnsembleTracker New config event received: {}
2> 7832 INFO (SUITE-StreamDecoratorTest-seed#[7203DD009EBBF5D5]-worker-EventThread) [] o.a.c.f.i.EnsembleTracker New config event received: {}
2> 7833 WARN (SUITE-StreamDecoratorTest-seed#[7203DD009EBBF5D5]-worker) [] o.a.s.c.c.SolrZkClient Using default ZkCredentialsInjector. ZkCredentialsInjector is not secure, it creates an empty list of credentials which leads to 'OPEN_ACL_UNSAFE' ACLs to Zookeeper nodes
2> 7833 WARN (SUITE-StreamDecoratorTest-seed#[7203DD009EBBF5D5]-worker) [] o.a.s.c.c.SolrZkClient Using default ZkACLProvider. DefaultZkACLProvider is not secure, it creates 'OPEN_ACL_UNSAFE' ACLs to Zookeeper nodes
2> 7834 INFO (SUITE-StreamDecoratorTest-seed#[7203DD009EBBF5D5]-worker) [] o.a.c.f.i.CuratorFrameworkImpl Starting
2> 7835 INFO (SUITE-StreamDecoratorTest-seed#[7203DD009EBBF5D5]-worker) [] o.a.c.f.i.CuratorFrameworkImpl Default schema
2> 7836 INFO (SUITE-StreamDecoratorTest-seed#[7203DD009EBBF5D5]-worker-EventThread) [] o.a.c.f.s.ConnectionStateManager State change: CONNECTED
2> 7836 WARN (SUITE-StreamDecoratorTest-seed#[7203DD009EBBF5D5]-worker) [] o.a.s.c.c.SolrZkClient Using default ZkCredentialsInjector. ZkCredentialsInjector is not secure, it creates an empty list of credentials which leads to 'OPEN_ACL_UNSAFE' ACLs to Zookeeper nodes
2> 7836 WARN (SUITE-StreamDecoratorTest-seed#[7203DD009EBBF5D5]-worker) [] o.a.s.c.c.SolrZkClient Using default ZkACLProvider. DefaultZkACLProvider is not secure, it creates 'OPEN_ACL_UNSAFE' ACLs to Zookeeper nodes
2> 7836 INFO (SUITE-StreamDecoratorTest-seed#[7203DD009EBBF5D5]-worker) [] o.a.c.f.i.CuratorFrameworkImpl Starting
2> 7836 INFO (SUITE-StreamDecoratorTest-seed#[7203DD009EBBF5D5]-worker-EventThread) [] o.a.c.f.i.EnsembleTracker New config event received: {}
2> 7836 INFO (SUITE-StreamDecoratorTest-seed#[7203DD009EBBF5D5]-worker-EventThread) [] o.a.c.f.i.EnsembleTracker New config event received: {}
2> 7837 INFO (SUITE-StreamDecoratorTest-seed#[7203DD009EBBF5D5]-worker) [] o.a.c.f.i.CuratorFrameworkImpl Default schema
2> 7838 INFO (SUITE-StreamDecoratorTest-seed#[7203DD009EBBF5D5]-worker-EventThread) [] o.a.c.f.s.ConnectionStateManager State change: CONNECTED
2> 7839 INFO (SUITE-StreamDecoratorTest-seed#[7203DD009EBBF5D5]-worker-EventThread) [] o.a.c.f.i.EnsembleTracker New config event received: {}
2> 7839 INFO (SUITE-StreamDecoratorTest-seed#[7203DD009EBBF5D5]-worker-EventThread) [] o.a.c.f.i.EnsembleTracker New config event received: {}
2> 7840 INFO (Curator-Framework-0) [] o.a.c.f.i.CuratorFrameworkImpl backgroundOperationsLoop exiting
2> 7943 INFO (jetty-launcher-188-thread-4) [] o.a.s.e.JettySolrRunner Start Jetty (configured port=0, binding port=0)
2> 7943 INFO (jetty-launcher-188-thread-2) [] o.a.s.e.JettySolrRunner Start Jetty (configured port=0, binding port=0)
2> 7943 INFO (jetty-launcher-188-thread-1) [] o.a.s.e.JettySolrRunner Start Jetty (configured port=0, binding port=0)
2> 7943 INFO (jetty-launcher-188-thread-3) [] o.a.s.e.JettySolrRunner Start Jetty (configured port=0, binding port=0)
2> 7943 INFO (jetty-launcher-188-thread-3) [] o.a.s.e.JettySolrRunner Trying to start Jetty on port 0 try number 2 ...
2> 7943 INFO (jetty-launcher-188-thread-2) [] o.a.s.e.JettySolrRunner Trying to start Jetty on port 0 try number 2 ...
2> 7943 INFO (jetty-launcher-188-thread-1) [] o.a.s.e.JettySolrRunner Trying to start Jetty on port 0 try number 2 ...
2> 7943 INFO (jetty-launcher-188-thread-3) [] o.e.j.s.Server jetty-12.0.27; built: 2025-09-10T23:47:49.595Z; git: 3569a3e83ad136ee44e26b370b74c1c5e9f33e61; jvm 21.0.4+7-LTS
2> 7943 INFO (jetty-launcher-188-thread-4) [] o.a.s.e.JettySolrRunner Trying to start Jetty on port 0 try number 2 ...
2> 7944 INFO (jetty-launcher-188-thread-2) [] o.e.j.s.Server jetty-12.0.27; built: 2025-09-10T23:47:49.595Z; git: 3569a3e83ad136ee44e26b370b74c1c5e9f33e61; jvm 21.0.4+7-LTS
2> 7944 INFO (jetty-launcher-188-thread-1) [] o.e.j.s.Server jetty-12.0.27; built: 2025-09-10T23:47:49.595Z; git: 3569a3e83ad136ee44e26b370b74c1c5e9f33e61; jvm 21.0.4+7-LTS
2> 7944 INFO (jetty-launcher-188-thread-4) [] o.e.j.s.Server jetty-12.0.27; built: 2025-09-10T23:47:49.595Z; git: 3569a3e83ad136ee44e26b370b74c1c5e9f33e61; jvm 21.0.4+7-LTS
2> 7947 INFO (jetty-launcher-188-thread-3) [] o.e.j.s.DefaultSessionIdManager Session workerName=node0
2> 7947 INFO (jetty-launcher-188-thread-1) [] o.e.j.s.DefaultSessionIdManager Session workerName=node0
2> 7947 INFO (jetty-launcher-188-thread-2) [] o.e.j.s.DefaultSessionIdManager Session workerName=node0
2> 7947 WARN (jetty-launcher-188-thread-3) [] o.e.j.e.s.ServletContextHandler BaseResource file:///home/jenkins/jenkins-agent/workspace/Solr/Solr-Test-10.0/solr/solrj-streaming/build/tmp/tests-cwd/./ is aliased to file:///home/jenkins/jenkins-agent/workspace/Solr/Solr-Test-10.0/solr/solrj-streaming/build/tmp/tests-cwd/ in oeje10s.ServletContextHandler@70e38067{/solr,/solr,b=file:///home/jenkins/jenkins-agent/workspace/Solr/Solr-Test-10.0/solr/solrj-streaming/build/tmp/tests-cwd/./,a=STOPPED,h=oeje10s.SessionHandler@6c4b6a3b{STOPPED}}. May not be supported in future releases.
2> 7947 WARN (jetty-launcher-188-thread-1) [] o.e.j.e.s.ServletContextHandler BaseResource file:///home/jenkins/jenkins-agent/workspace/Solr/Solr-Test-10.0/solr/solrj-streaming/build/tmp/tests-cwd/./ is aliased to file:///home/jenkins/jenkins-agent/workspace/Solr/Solr-Test-10.0/solr/solrj-streaming/build/tmp/tests-cwd/ in oeje10s.ServletContextHandler@21faba5f{/solr,/solr,b=file:///home/jenkins/jenkins-agent/workspace/Solr/Solr-Test-10.0/solr/solrj-streaming/build/tmp/tests-cwd/./,a=STOPPED,h=oeje10s.SessionHandler@3b2d3817{STOPPED}}. May not be supported in future releases.
2> 7947 INFO (jetty-launcher-188-thread-1) [] o.e.j.s.h.ContextHandler /solr Base Resource is an alias: file:///home/jenkins/jenkins-agent/workspace/Solr/Solr-Test-10.0/solr/solrj-streaming/build/tmp/tests-cwd/./ -> file:///home/jenkins/jenkins-agent/workspace/Solr/Solr-Test-10.0/solr/solrj-streaming/build/tmp/tests-cwd/
2> 7947 INFO (jetty-launcher-188-thread-3) [] o.e.j.s.h.ContextHandler /solr Base Resource is an alias: file:///home/jenkins/jenkins-agent/workspace/Solr/Solr-Test-10.0/solr/solrj-streaming/build/tmp/tests-cwd/./ -> file:///home/jenkins/jenkins-agent/workspace/Solr/Solr-Test-10.0/solr/solrj-streaming/build/tmp/tests-cwd/
2> 7948 INFO (jetty-launcher-188-thread-3) [] o.e.j.s.h.ContextHandler Started oeje10s.ServletContextHandler@70e38067{/solr,/solr,b=file:///home/jenkins/jenkins-agent/workspace/Solr/Solr-Test-10.0/solr/solrj-streaming/build/tmp/tests-cwd/,a=AVAILABLE,h=oeje10s.SessionHandler@6c4b6a3b{STARTED}}
2> 7948 INFO (jetty-launcher-188-thread-4) [] o.e.j.s.DefaultSessionIdManager Session workerName=node0
2> 7948 INFO (jetty-launcher-188-thread-3) [] o.a.s.e.JettySolrRunner Jetty properties: {hostPort=37793, zkHost=127.0.0.1:43113/solr}
2> 7948 ERROR (jetty-launcher-188-thread-3) [] o.a.s.u.StartupLoggingUtils Missing Java Option solr.logs.dir. Logging may be missing or incomplete.
2> 7948 INFO (jetty-launcher-188-thread-3) [] o.a.s.s.CoreContainerProvider Using logger factory org.apache.logging.slf4j.Log4jLoggerFactory
2> 7948 INFO (jetty-launcher-188-thread-3) [] o.a.s.s.CoreContainerProvider ___ _ Welcome to Apache Solr™ version 10.0.1-SNAPSHOT 93068d1dfbc48816caac29c5b3aba3bf884aea85 [snapshot build, details omitted]
2> 7948 WARN (jetty-launcher-188-thread-2) [] o.e.j.e.s.ServletContextHandler BaseResource file:///home/jenkins/jenkins-agent/workspace/Solr/Solr-Test-10.0/solr/solrj-streaming/build/tmp/tests-cwd/./ is aliased to file:///home/jenkins/jenkins-agent/workspace/Solr/Solr-Test-10.0/solr/solrj-streaming/build/tmp/tests-cwd/ in oeje10s.ServletContextHandler@29aafdf9{/solr,/solr,b=file:///home/jenkins/jenkins-agent/workspace/Solr/Solr-Test-10.0/solr/solrj-streaming/build/tmp/tests-cwd/./,a=STOPPED,h=oeje10s.SessionHandler@79b872b7{STOPPED}}. May not be supported in future releases.
2> 7948 INFO (jetty-launcher-188-thread-3) [] o.a.s.s.CoreContainerProvider / __| ___| |_ _ Starting in cloud mode on port null
2> 7948 INFO (jetty-launcher-188-thread-3) [] o.a.s.s.CoreContainerProvider \__ \/ _ \ | '_| Install dir: /home/jenkins/jenkins-agent/workspace/Solr/Solr-Test-10.0/solr
2> 7948 WARN (jetty-launcher-188-thread-4) [] o.e.j.e.s.ServletContextHandler BaseResource file:///home/jenkins/jenkins-agent/workspace/Solr/Solr-Test-10.0/solr/solrj-streaming/build/tmp/tests-cwd/./ is aliased to file:///home/jenkins/jenkins-agent/workspace/Solr/Solr-Test-10.0/solr/solrj-streaming/build/tmp/tests-cwd/ in oeje10s.ServletContextHandler@153af9{/solr,/solr,b=file:///home/jenkins/jenkins-agent/workspace/Solr/Solr-Test-10.0/solr/solrj-streaming/build/tmp/tests-cwd/./,a=STOPPED,h=oeje10s.SessionHandler@d388674{STOPPED}}. May not be supported in future releases.
2> 7948 INFO (jetty-launcher-188-thread-3) [] o.a.s.s.CoreContainerProvider |___/\___/_|_| Start time: 2026-09-15T12:55:26.785744584Z
2> 7948 INFO (jetty-launcher-188-thread-2) [] o.e.j.s.h.ContextHandler /solr Base Resource is an alias: file:///home/jenkins/jenkins-agent/workspace/Solr/Solr-Test-10.0/solr/solrj-streaming/build/tmp/tests-cwd/./ -> file:///home/jenkins/jenkins-agent/workspace/Solr/Solr-Test-10.0/solr/solrj-streaming/build/tmp/tests-cwd/
2> 7948 INFO (jetty-launcher-188-thread-3) [] o.a.s.s.CoreContainerProvider Solr Home: /home/jenkins/jenkins-agent/workspace/Solr/Solr-Test-10.0/build/tmp/tests-tmp/org.apache.solr.client.solrj.io.stream.StreamDecoratorTest_7203DD009EBBF5D5-001/tempDir-001/node3 (source: servlet config: solr.solr.home)
2> 7949 INFO (jetty-launcher-188-thread-1) [] o.e.j.s.h.ContextHandler Started oeje10s.ServletContextHandler@21faba5f{/solr,/solr,b=file:///home/jenkins/jenkins-agent/workspace/Solr/Solr-Test-10.0/solr/solrj-streaming/build/tmp/tests-cwd/,a=AVAILABLE,h=oeje10s.SessionHandler@3b2d3817{STARTED}}
2> 7949 INFO (jetty-launcher-188-thread-2) [] o.e.j.s.h.ContextHandler Started oeje10s.ServletContextHandler@29aafdf9{/solr,/solr,b=file:///home/jenkins/jenkins-agent/workspace/Solr/Solr-Test-10.0/solr/solrj-streaming/build/tmp/tests-cwd/,a=AVAILABLE,h=oeje10s.SessionHandler@79b872b7{STARTED}}
2> 7949 INFO (jetty-launcher-188-thread-1) [] o.a.s.e.JettySolrRunner Jetty properties: {hostPort=42055, zkHost=127.0.0.1:43113/solr}
2> 7949 INFO (jetty-launcher-188-thread-2) [] o.a.s.e.JettySolrRunner Jetty properties: {hostPort=39881, zkHost=127.0.0.1:43113/solr}
2> 7949 ERROR (jetty-launcher-188-thread-1) [] o.a.s.u.StartupLoggingUtils Missing Java Option solr.logs.dir. Logging may be missing or incomplete.
2> 7948 INFO (jetty-launcher-188-thread-4) [] o.e.j.s.h.ContextHandler /solr Base Resource is an alias: file:///home/jenkins/jenkins-agent/workspace/Solr/Solr-Test-10.0/solr/solrj-streaming/build/tmp/tests-cwd/./ -> file:///home/jenkins/jenkins-agent/workspace/Solr/Solr-Test-10.0/solr/solrj-streaming/build/tmp/tests-cwd/
2> 7949 ERROR (jetty-launcher-188-thread-2) [] o.a.s.u.StartupLoggingUtils Missing Java Option solr.logs.dir. Logging may be missing or incomplete.
2> 7949 WARN (jetty-launcher-188-thread-3) [] o.a.s.c.c.SolrZkClient Using default ZkCredentialsInjector. ZkCredentialsInjector is not secure, it creates an empty list of credentials which leads to 'OPEN_ACL_UNSAFE' ACLs to Zookeeper nodes
2> 7949 INFO (jetty-launcher-188-thread-1) [] o.a.s.s.CoreContainerProvider Using logger factory org.apache.logging.slf4j.Log4jLoggerFactory
2> 7949 INFO (jetty-launcher-188-thread-2) [] o.a.s.s.CoreContainerProvider Using logger factory org.apache.logging.slf4j.Log4jLoggerFactory
2> 7949 INFO (jetty-launcher-188-thread-1) [] o.a.s.s.CoreContainerProvider ___ _ Welcome to Apache Solr™ version 10.0.1-SNAPSHOT 93068d1dfbc48816caac29c5b3aba3bf884aea85 [snapshot build, details omitted]
2> 7949 WARN (jetty-launcher-188-thread-3) [] o.a.s.c.c.SolrZkClient Using default ZkACLProvider. DefaultZkACLProvider is not secure, it creates 'OPEN_ACL_UNSAFE' ACLs to Zookeeper nodes
2> 7949 INFO (jetty-launcher-188-thread-2) [] o.a.s.s.CoreContainerProvider ___ _ Welcome to Apache Solr™ version 10.0.1-SNAPSHOT 93068d1dfbc48816caac29c5b3aba3bf884aea85 [snapshot build, details omitted]
2> 7949 INFO (jetty-launcher-188-thread-1) [] o.a.s.s.CoreContainerProvider / __| ___| |_ _ Starting in cloud mode on port null
2> 7949 INFO (jetty-launcher-188-thread-2) [] o.a.s.s.CoreContainerProvider / __| ___| |_ _ Starting in cloud mode on port null
2> 7949 INFO (jetty-launcher-188-thread-1) [] o.a.s.s.CoreContainerProvider \__ \/ _ \ | '_| Install dir: /home/jenkins/jenkins-agent/workspace/Solr/Solr-Test-10.0/solr
2> 7949 INFO (jetty-launcher-188-thread-2) [] o.a.s.s.CoreContainerProvider \__ \/ _ \ | '_| Install dir: /home/jenkins/jenkins-agent/workspace/Solr/Solr-Test-10.0/solr
2> 7949 INFO (jetty-launcher-188-thread-4) [] o.e.j.s.h.ContextHandler Started oeje10s.ServletContextHandler@153af9{/solr,/solr,b=file:///home/jenkins/jenkins-agent/workspace/Solr/Solr-Test-10.0/solr/solrj-streaming/build/tmp/tests-cwd/,a=AVAILABLE,h=oeje10s.SessionHandler@d388674{STARTED}}
2> 7949 INFO (jetty-launcher-188-thread-2) [] o.a.s.s.CoreContainerProvider |___/\___/_|_| Start time: 2026-09-15T12:55:26.786632549Z
2> 7949 INFO (jetty-launcher-188-thread-1) [] o.a.s.s.CoreContainerProvider |___/\___/_|_| Start time: 2026-09-15T12:55:26.786616587Z
2> 7949 INFO (jetty-launcher-188-thread-4) [] o.a.s.e.JettySolrRunner Jetty properties: {hostPort=40575, zkHost=127.0.0.1:43113/solr}
2> 7949 INFO (jetty-launcher-188-thread-2) [] o.a.s.s.CoreContainerProvider Solr Home: /home/jenkins/jenkins-agent/workspace/Solr/Solr-Test-10.0/build/tmp/tests-tmp/org.apache.solr.client.solrj.io.stream.StreamDecoratorTest_7203DD009EBBF5D5-001/tempDir-001/node2 (source: servlet config: solr.solr.home)
2> 7949 INFO (jetty-launcher-188-thread-1) [] o.a.s.s.CoreContainerProvider Solr Home: /home/jenkins/jenkins-agent/workspace/Solr/Solr-Test-10.0/build/tmp/tests-tmp/org.apache.solr.client.solrj.io.stream.StreamDecoratorTest_7203DD009EBBF5D5-001/tempDir-001/node1 (source: servlet config: solr.solr.home)
2> 7949 ERROR (jetty-launcher-188-thread-4) [] o.a.s.u.StartupLoggingUtils Missing Java Option solr.logs.dir. Logging may be missing or incomplete.
2> 7949 INFO (jetty-launcher-188-thread-3) [] o.a.c.f.i.CuratorFrameworkImpl Starting
2> 7949 INFO (jetty-launcher-188-thread-4) [] o.a.s.s.CoreContainerProvider Using logger factory org.apache.logging.slf4j.Log4jLoggerFactory
2> 7949 INFO (jetty-launcher-188-thread-4) [] o.a.s.s.CoreContainerProvider ___ _ Welcome to Apache Solr™ version 10.0.1-SNAPSHOT 93068d1dfbc48816caac29c5b3aba3bf884aea85 [snapshot build, details omitted]
2> 7949 WARN (jetty-launcher-188-thread-2) [] o.a.s.c.c.SolrZkClient Using default ZkCredentialsInjector. ZkCredentialsInjector is not secure, it creates an empty list of credentials which leads to 'OPEN_ACL_UNSAFE' ACLs to Zookeeper nodes
2> 7949 INFO (jetty-launcher-188-thread-4) [] o.a.s.s.CoreContainerProvider / __| ___| |_ _ Starting in cloud mode on port null
2> 7949 WARN (jetty-launcher-188-thread-1) [] o.a.s.c.c.SolrZkClient Using default ZkCredentialsInjector. ZkCredentialsInjector is not secure, it creates an empty list of credentials which leads to 'OPEN_ACL_UNSAFE' ACLs to Zookeeper nodes
2> 7950 INFO (jetty-launcher-188-thread-4) [] o.a.s.s.CoreContainerProvider \__ \/ _ \ | '_| Install dir: /home/jenkins/jenkins-agent/workspace/Solr/Solr-Test-10.0/solr
2> 7950 WARN (jetty-launcher-188-thread-2) [] o.a.s.c.c.SolrZkClient Using default ZkACLProvider. DefaultZkACLProvider is not secure, it creates 'OPEN_ACL_UNSAFE' ACLs to Zookeeper nodes
2> 7950 WARN (jetty-launcher-188-thread-1) [] o.a.s.c.c.SolrZkClient Using default ZkACLProvider. DefaultZkACLProvider is not secure, it creates 'OPEN_ACL_UNSAFE' ACLs to Zookeeper nodes
2> 7950 INFO (jetty-launcher-188-thread-4) [] o.a.s.s.CoreContainerProvider |___/\___/_|_| Start time: 2026-09-15T12:55:26.787057212Z
2> 7950 INFO (jetty-launcher-188-thread-4) [] o.a.s.s.CoreContainerProvider Solr Home: /home/jenkins/jenkins-agent/workspace/Solr/Solr-Test-10.0/build/tmp/tests-tmp/org.apache.solr.client.solrj.io.stream.StreamDecoratorTest_7203DD009EBBF5D5-001/tempDir-001/node4 (source: servlet config: solr.solr.home)
2> 7950 WARN (jetty-launcher-188-thread-4) [] o.a.s.c.c.SolrZkClient Using default ZkCredentialsInjector. ZkCredentialsInjector is not secure, it creates an empty list of credentials which leads to 'OPEN_ACL_UNSAFE' ACLs to Zookeeper nodes
2> 7950 INFO (jetty-launcher-188-thread-2) [] o.a.c.f.i.CuratorFrameworkImpl Starting
2> 7950 INFO (jetty-launcher-188-thread-1) [] o.a.c.f.i.CuratorFrameworkImpl Starting
2> 7950 WARN (jetty-launcher-188-thread-4) [] o.a.s.c.c.SolrZkClient Using default ZkACLProvider. DefaultZkACLProvider is not secure, it creates 'OPEN_ACL_UNSAFE' ACLs to Zookeeper nodes
2> 7950 INFO (jetty-launcher-188-thread-4) [] o.a.c.f.i.CuratorFrameworkImpl Starting
2> 7951 INFO (jetty-launcher-188-thread-3) [] o.a.c.f.i.CuratorFrameworkImpl Default schema
2> 7952 INFO (jetty-launcher-188-thread-2) [] o.a.c.f.i.CuratorFrameworkImpl Default schema
2> 7952 INFO (jetty-launcher-188-thread-1) [] o.a.c.f.i.CuratorFrameworkImpl Default schema
2> 7952 INFO (jetty-launcher-188-thread-4) [] o.a.c.f.i.CuratorFrameworkImpl Default schema
2> 7952 INFO (jetty-launcher-188-thread-3-EventThread) [] o.a.c.f.s.ConnectionStateManager State change: CONNECTED
2> 7953 INFO (jetty-launcher-188-thread-2-EventThread) [] o.a.c.f.s.ConnectionStateManager State change: CONNECTED
2> 7953 INFO (jetty-launcher-188-thread-1-EventThread) [] o.a.c.f.s.ConnectionStateManager State change: CONNECTED
2> 7953 INFO (jetty-launcher-188-thread-3-EventThread) [] o.a.c.f.i.EnsembleTracker New config event received: {}
2> 7953 INFO (jetty-launcher-188-thread-3-EventThread) [] o.a.c.f.i.EnsembleTracker New config event received: {}
2> 7953 INFO (jetty-launcher-188-thread-4-EventThread) [] o.a.c.f.s.ConnectionStateManager State change: CONNECTED
2> 7953 INFO (jetty-launcher-188-thread-2-EventThread) [] o.a.c.f.i.EnsembleTracker New config event received: {}
2> 7953 INFO (jetty-launcher-188-thread-2-EventThread) [] o.a.c.f.i.EnsembleTracker New config event received: {}
2> 7954 INFO (jetty-launcher-188-thread-1-EventThread) [] o.a.c.f.i.EnsembleTracker New config event received: {}
2> 7954 INFO (jetty-launcher-188-thread-1-EventThread) [] o.a.c.f.i.EnsembleTracker New config event received: {}
2> 7954 INFO (Curator-Framework-0) [] o.a.c.f.i.CuratorFrameworkImpl backgroundOperationsLoop exiting
2> 7954 INFO (jetty-launcher-188-thread-4-EventThread) [] o.a.c.f.i.EnsembleTracker New config event received: {}
2> 7954 INFO (Curator-Framework-0) [] o.a.c.f.i.CuratorFrameworkImpl backgroundOperationsLoop exiting
2> 7954 INFO (jetty-launcher-188-thread-4-EventThread) [] o.a.c.f.i.EnsembleTracker New config event received: {}
2> 7954 INFO (Curator-Framework-0) [] o.a.c.f.i.CuratorFrameworkImpl backgroundOperationsLoop exiting
2> 7955 INFO (Curator-Framework-0) [] o.a.c.f.i.CuratorFrameworkImpl backgroundOperationsLoop exiting
2> 8055 INFO (jetty-launcher-188-thread-3) [] o.a.s.c.SolrXmlConfig Loading solr.xml from /home/jenkins/jenkins-agent/workspace/Solr/Solr-Test-10.0/build/tmp/tests-tmp/org.apache.solr.client.solrj.io.stream.StreamDecoratorTest_7203DD009EBBF5D5-001/tempDir-001/node3/solr.xml
2> 8055 INFO (jetty-launcher-188-thread-2) [] o.a.s.c.SolrXmlConfig Loading solr.xml from /home/jenkins/jenkins-agent/workspace/Solr/Solr-Test-10.0/build/tmp/tests-tmp/org.apache.solr.client.solrj.io.stream.StreamDecoratorTest_7203DD009EBBF5D5-001/tempDir-001/node2/solr.xml
2> 8056 INFO (jetty-launcher-188-thread-4) [] o.a.s.c.SolrXmlConfig Loading solr.xml from /home/jenkins/jenkins-agent/workspace/Solr/Solr-Test-10.0/build/tmp/tests-tmp/org.apache.solr.client.solrj.io.stream.StreamDecoratorTest_7203DD009EBBF5D5-001/tempDir-001/node4/solr.xml
2> 8056 INFO (jetty-launcher-188-thread-1) [] o.a.s.c.SolrXmlConfig Loading solr.xml from /home/jenkins/jenkins-agent/workspace/Solr/Solr-Test-10.0/build/tmp/tests-tmp/org.apache.solr.client.solrj.io.stream.StreamDecoratorTest_7203DD009EBBF5D5-001/tempDir-001/node1/solr.xml
2> 8059 INFO (jetty-launcher-188-thread-2) [] o.a.s.c.SolrXmlConfig Metrics collection is disabled.
2> 8060 INFO (jetty-launcher-188-thread-4) [] o.a.s.c.SolrXmlConfig Metrics collection is disabled.
2> 8060 INFO (jetty-launcher-188-thread-1) [] o.a.s.c.SolrXmlConfig Metrics collection is disabled.
2> 8060 INFO (jetty-launcher-188-thread-3) [] o.a.s.c.SolrXmlConfig Metrics collection is disabled.
2> 8070 INFO (jetty-launcher-188-thread-4) [] o.a.s.c.ZkContainer Zookeeper client=127.0.0.1:43113/solr
2> 8070 INFO (jetty-launcher-188-thread-2) [] o.a.s.c.ZkContainer Zookeeper client=127.0.0.1:43113/solr
2> 8070 WARN (jetty-launcher-188-thread-4) [] o.a.s.c.c.SolrZkClient Using default ZkCredentialsInjector. ZkCredentialsInjector is not secure, it creates an empty list of credentials which leads to 'OPEN_ACL_UNSAFE' ACLs to Zookeeper nodes
2> 8070 WARN (jetty-launcher-188-thread-2) [] o.a.s.c.c.SolrZkClient Using default ZkCredentialsInjector. ZkCredentialsInjector is not secure, it creates an empty list of credentials which leads to 'OPEN_ACL_UNSAFE' ACLs to Zookeeper nodes
2> 8070 WARN (jetty-launcher-188-thread-4) [] o.a.s.c.c.SolrZkClient Using default ZkACLProvider. DefaultZkACLProvider is not secure, it creates 'OPEN_ACL_UNSAFE' ACLs to Zookeeper nodes
2> 8070 WARN (jetty-launcher-188-thread-2) [] o.a.s.c.c.SolrZkClient Using default ZkACLProvider. DefaultZkACLProvider is not secure, it creates 'OPEN_ACL_UNSAFE' ACLs to Zookeeper nodes
2> 8071 INFO (jetty-launcher-188-thread-1) [] o.a.s.c.ZkContainer Zookeeper client=127.0.0.1:43113/solr
2> 8071 INFO (jetty-launcher-188-thread-4) [] o.a.c.f.i.CuratorFrameworkImpl Starting
2> 8071 WARN (jetty-launcher-188-thread-1) [] o.a.s.c.c.SolrZkClient Using default ZkCredentialsInjector. ZkCredentialsInjector is not secure, it creates an empty list of credentials which leads to 'OPEN_ACL_UNSAFE' ACLs to Zookeeper nodes
2> 8071 INFO (jetty-launcher-188-thread-2) [] o.a.c.f.i.CuratorFrameworkImpl Starting
2> 8071 WARN (jetty-launcher-188-thread-1) [] o.a.s.c.c.SolrZkClient Using default ZkACLProvider. DefaultZkACLProvider is not secure, it creates 'OPEN_ACL_UNSAFE' ACLs to Zookeeper nodes
2> 8071 INFO (jetty-launcher-188-thread-1) [] o.a.c.f.i.CuratorFrameworkImpl Starting
2> 8072 INFO (jetty-launcher-188-thread-3) [] o.a.s.c.ZkContainer Zookeeper client=127.0.0.1:43113/solr
2> 8072 WARN (jetty-launcher-188-thread-3) [] o.a.s.c.c.SolrZkClient Using default ZkCredentialsInjector. ZkCredentialsInjector is not secure, it creates an empty list of credentials which leads to 'OPEN_ACL_UNSAFE' ACLs to Zookeeper nodes
2> 8072 WARN (jetty-launcher-188-thread-3) [] o.a.s.c.c.SolrZkClient Using default ZkACLProvider. DefaultZkACLProvider is not secure, it creates 'OPEN_ACL_UNSAFE' ACLs to Zookeeper nodes
2> 8073 INFO (jetty-launcher-188-thread-3) [] o.a.c.f.i.CuratorFrameworkImpl Starting
2> 8073 INFO (jetty-launcher-188-thread-4) [] o.a.c.f.i.CuratorFrameworkImpl Default schema
2> 8073 INFO (jetty-launcher-188-thread-2) [] o.a.c.f.i.CuratorFrameworkImpl Default schema
2> 8073 INFO (jetty-launcher-188-thread-1) [] o.a.c.f.i.CuratorFrameworkImpl Default schema
2> 8074 INFO (jetty-launcher-188-thread-4-EventThread) [] o.a.c.f.s.ConnectionStateManager State change: CONNECTED
2> 8074 INFO (jetty-launcher-188-thread-3) [] o.a.c.f.i.CuratorFrameworkImpl Default schema
2> 8074 INFO (jetty-launcher-188-thread-2-EventThread) [] o.a.c.f.s.ConnectionStateManager State change: CONNECTED
2> 8074 INFO (jetty-launcher-188-thread-1-EventThread) [] o.a.c.f.s.ConnectionStateManager State change: CONNECTED
2> 8075 INFO (jetty-launcher-188-thread-4-EventThread) [] o.a.c.f.i.EnsembleTracker New config event received: {}
2> 8075 INFO (jetty-launcher-188-thread-4-EventThread) [] o.a.c.f.i.EnsembleTracker New config event received: {}
2> 8075 INFO (jetty-launcher-188-thread-1-EventThread) [] o.a.c.f.i.EnsembleTracker New config event received: {}
2> 8075 INFO (jetty-launcher-188-thread-2-EventThread) [] o.a.c.f.i.EnsembleTracker New config event received: {}
2> 8075 INFO (jetty-launcher-188-thread-1-EventThread) [] o.a.c.f.i.EnsembleTracker New config event received: {}
2> 8075 INFO (jetty-launcher-188-thread-2-EventThread) [] o.a.c.f.i.EnsembleTracker New config event received: {}
2> 8075 INFO (jetty-launcher-188-thread-3-EventThread) [] o.a.c.f.s.ConnectionStateManager State change: CONNECTED
2> 8075 INFO (Curator-Framework-0) [] o.a.c.f.i.CuratorFrameworkImpl backgroundOperationsLoop exiting
2> 8075 INFO (Curator-Framework-0) [] o.a.c.f.i.CuratorFrameworkImpl backgroundOperationsLoop exiting
2> 8075 INFO (Curator-Framework-0) [] o.a.c.f.i.CuratorFrameworkImpl backgroundOperationsLoop exiting
2> 8076 INFO (jetty-launcher-188-thread-3-EventThread) [] o.a.c.f.i.EnsembleTracker New config event received: {}
2> 8076 INFO (jetty-launcher-188-thread-3-EventThread) [] o.a.c.f.i.EnsembleTracker New config event received: {}
2> 8076 INFO (Curator-Framework-0) [] o.a.c.f.i.CuratorFrameworkImpl backgroundOperationsLoop exiting
2> 8177 INFO (jetty-launcher-188-thread-4) [n:127.0.0.1:40575_solr] o.a.c.f.i.CuratorFrameworkImpl Starting
2> 8177 INFO (jetty-launcher-188-thread-1) [n:127.0.0.1:42055_solr] o.a.c.f.i.CuratorFrameworkImpl Starting
2> 8177 INFO (jetty-launcher-188-thread-2) [n:127.0.0.1:39881_solr] o.a.c.f.i.CuratorFrameworkImpl Starting
2> 8177 INFO (jetty-launcher-188-thread-3) [n:127.0.0.1:37793_solr] o.a.c.f.i.CuratorFrameworkImpl Starting
2> 8180 INFO (jetty-launcher-188-thread-4) [n:127.0.0.1:40575_solr] o.a.c.f.i.CuratorFrameworkImpl Default schema
2> 8180 INFO (jetty-launcher-188-thread-1) [n:127.0.0.1:42055_solr] o.a.c.f.i.CuratorFrameworkImpl Default schema
2> 8180 INFO (jetty-launcher-188-thread-3) [n:127.0.0.1:37793_solr] o.a.c.f.i.CuratorFrameworkImpl Default schema
2> 8180 INFO (jetty-launcher-188-thread-2) [n:127.0.0.1:39881_solr] o.a.c.f.i.CuratorFrameworkImpl Default schema
2> 8180 INFO (jetty-launcher-188-thread-4-EventThread) [] o.a.c.f.s.ConnectionStateManager State change: CONNECTED
2> 8181 INFO (jetty-launcher-188-thread-1-EventThread) [] o.a.c.f.s.ConnectionStateManager State change: CONNECTED
2> 8181 INFO (jetty-launcher-188-thread-3-EventThread) [] o.a.c.f.s.ConnectionStateManager State change: CONNECTED
2> 8181 INFO (jetty-launcher-188-thread-2-EventThread) [] o.a.c.f.s.ConnectionStateManager State change: CONNECTED
2> 8181 INFO (jetty-launcher-188-thread-1-EventThread) [] o.a.c.f.i.EnsembleTracker New config event received: {}
2> 8181 INFO (jetty-launcher-188-thread-4-EventThread) [] o.a.c.f.i.EnsembleTracker New config event received: {}
2> 8181 INFO (jetty-launcher-188-thread-4-EventThread) [] o.a.c.f.i.EnsembleTracker New config event received: {}
2> 8181 INFO (jetty-launcher-188-thread-1-EventThread) [] o.a.c.f.i.EnsembleTracker New config event received: {}
2> 8181 INFO (jetty-launcher-188-thread-3-EventThread) [] o.a.c.f.i.EnsembleTracker New config event received: {}
2> 8181 INFO (jetty-launcher-188-thread-3-EventThread) [] o.a.c.f.i.EnsembleTracker New config event received: {}
2> 8182 INFO (jetty-launcher-188-thread-2-EventThread) [] o.a.c.f.i.EnsembleTracker New config event received: {}
2> 8182 INFO (jetty-launcher-188-thread-2-EventThread) [] o.a.c.f.i.EnsembleTracker New config event received: {}
2> 8218 WARN (jetty-launcher-188-thread-2) [n:127.0.0.1:39881_solr] o.a.s.c.ZkController Contents of zookeeper /security.json are world-readable; consider setting up ACLs as described in https://solr.apache.org/guide/solr/latest/deployment-guide/zookeeper-access-control.html
2> 8218 WARN (jetty-launcher-188-thread-1) [n:127.0.0.1:42055_solr] o.a.s.c.ZkController Contents of zookeeper /security.json are world-readable; consider setting up ACLs as described in https://solr.apache.org/guide/solr/latest/deployment-guide/zookeeper-access-control.html
2> 8218 WARN (jetty-launcher-188-thread-3) [n:127.0.0.1:37793_solr] o.a.s.c.ZkController Contents of zookeeper /security.json are world-readable; consider setting up ACLs as described in https://solr.apache.org/guide/solr/latest/deployment-guide/zookeeper-access-control.html
2> 8218 WARN (jetty-launcher-188-thread-4) [n:127.0.0.1:40575_solr] o.a.s.c.ZkController Contents of zookeeper /security.json are world-readable; consider setting up ACLs as described in https://solr.apache.org/guide/solr/latest/deployment-guide/zookeeper-access-control.html
2> 8222 INFO (jetty-launcher-188-thread-2) [n:127.0.0.1:39881_solr] o.a.s.c.ZkController The Overseer is enabled. It will process all cluster commands & state updates.
2> 8222 INFO (jetty-launcher-188-thread-4) [n:127.0.0.1:40575_solr] o.a.s.c.ZkController The Overseer is enabled. It will process all cluster commands & state updates.
2> 8222 INFO (jetty-launcher-188-thread-3) [n:127.0.0.1:37793_solr] o.a.s.c.ZkController The Overseer is enabled. It will process all cluster commands & state updates.
2> 8222 INFO (jetty-launcher-188-thread-1) [n:127.0.0.1:42055_solr] o.a.s.c.ZkController The Overseer is enabled. It will process all cluster commands & state updates.
2> 8225 INFO (jetty-launcher-188-thread-1) [n:127.0.0.1:42055_solr] o.a.s.c.OverseerElectionContext I am going to be the leader 127.0.0.1:42055_solr
2> 8226 INFO (jetty-launcher-188-thread-3) [n:127.0.0.1:37793_solr] o.a.s.c.ZkController Register node as live in ZooKeeper: /live_nodes/127.0.0.1:37793_solr
2> 8226 INFO (jetty-launcher-188-thread-2) [n:127.0.0.1:39881_solr] o.a.s.c.ZkController Register node as live in ZooKeeper: /live_nodes/127.0.0.1:39881_solr
2> 8226 INFO (jetty-launcher-188-thread-1) [n:127.0.0.1:42055_solr] o.a.s.c.Overseer Overseer (id=72081841026367500-127.0.0.1:42055_solr-n_0000000000) starting
2> 8226 INFO (jetty-launcher-188-thread-4) [n:127.0.0.1:40575_solr] o.a.s.c.ZkController Register node as live in ZooKeeper: /live_nodes/127.0.0.1:40575_solr
2> 8228 INFO (zkCallback-255-thread-1) [] o.a.s.c.c.ZkStateReader Updated live nodes from ZooKeeper... (0) -> (3)
2> 8228 INFO (zkCallback-248-thread-1) [] o.a.s.c.c.ZkStateReader Updated live nodes from ZooKeeper... (0) -> (3)
2> 8228 INFO (zkCallback-249-thread-1) [] o.a.s.c.c.ZkStateReader Updated live nodes from ZooKeeper... (0) -> (3)
2> 8228 INFO (zkCallback-252-thread-1) [] o.a.s.c.c.ZkStateReader Updated live nodes from ZooKeeper... (0) -> (3)
2> 8231 INFO (jetty-launcher-188-thread-1) [n:127.0.0.1:42055_solr] o.a.s.c.ZkController Publish node=127.0.0.1:42055_solr as DOWN
2> 8231 INFO (OverseerStateUpdate-72081841026367500-127.0.0.1:42055_solr-n_0000000000) [n:127.0.0.1:42055_solr] o.a.s.c.Overseer Starting to work on the main queue : 127.0.0.1:42055_solr
2> 8232 WARN (jetty-launcher-188-thread-4) [n:127.0.0.1:40575_solr] o.a.s.c.CoreContainer Not all security plugins configured! authentication=disabled authorization=disabled. Solr is only as secure as you make it. Consider configuring authentication/authorization before exposing Solr to users internal or external. See https://s.apache.org/solrsecurity for more info
2> 8232 WARN (jetty-launcher-188-thread-2) [n:127.0.0.1:39881_solr] o.a.s.c.CoreContainer Not all security plugins configured! authentication=disabled authorization=disabled. Solr is only as secure as you make it. Consider configuring authentication/authorization before exposing Solr to users internal or external. See https://s.apache.org/solrsecurity for more info
2> 8232 WARN (jetty-launcher-188-thread-3) [n:127.0.0.1:37793_solr] o.a.s.c.CoreContainer Not all security plugins configured! authentication=disabled authorization=disabled. Solr is only as secure as you make it. Consider configuring authentication/authorization before exposing Solr to users internal or external. See https://s.apache.org/solrsecurity for more info
2> 8233 INFO (jetty-launcher-188-thread-1) [n:127.0.0.1:42055_solr] o.a.s.c.ZkController Register node as live in ZooKeeper: /live_nodes/127.0.0.1:42055_solr
2> 8234 INFO (zkCallback-255-thread-1) [] o.a.s.c.c.ZkStateReader Updated live nodes from ZooKeeper... (3) -> (4)
2> 8234 INFO (zkCallback-252-thread-1) [] o.a.s.c.c.ZkStateReader Updated live nodes from ZooKeeper... (3) -> (4)
2> 8235 INFO (zkCallback-248-thread-1) [] o.a.s.c.c.ZkStateReader Updated live nodes from ZooKeeper... (3) -> (4)
2> 8235 INFO (zkCallback-249-thread-1) [] o.a.s.c.c.ZkStateReader Updated live nodes from ZooKeeper... (3) -> (4)
2> 8237 WARN (jetty-launcher-188-thread-1) [n:127.0.0.1:42055_solr] o.a.s.c.CoreContainer Not all security plugins configured! authentication=disabled authorization=disabled. Solr is only as secure as you make it. Consider configuring authentication/authorization before exposing Solr to users internal or external. See https://s.apache.org/solrsecurity for more info
2> 8258 INFO (jetty-launcher-188-thread-1) [n:127.0.0.1:42055_solr] o.a.s.c.CorePropertiesLocator Found 0 core definitions underneath /home/jenkins/jenkins-agent/workspace/Solr/Solr-Test-10.0/build/tmp/tests-tmp/org.apache.solr.client.solrj.io.stream.StreamDecoratorTest_7203DD009EBBF5D5-001/tempDir-001/node1
2> 8300 INFO (jetty-launcher-188-thread-1) [n:127.0.0.1:42055_solr] o.a.s.j.SolrRequestAuthorizer Creating a new SolrRequestAuthorizer
2> 8315 INFO (jetty-launcher-188-thread-1) [n:127.0.0.1:42055_solr] o.e.j.e.s.ServletContextHandler Started oeje10s.ServletContextHandler@21faba5f{/solr,/solr,b=file:///home/jenkins/jenkins-agent/workspace/Solr/Solr-Test-10.0/solr/solrj-streaming/build/tmp/tests-cwd/,a=AVAILABLE,h=oeje10s.SessionHandler@3b2d3817{STARTED}}
2> 8315 INFO (jetty-launcher-188-thread-1) [n:127.0.0.1:42055_solr] o.e.j.s.AbstractConnector Started ServerConnector@2aca2dfd{HTTP/1.1, (http/1.1, h2c)}{127.0.0.1:42055}
2> 8315 INFO (jetty-launcher-188-thread-1) [n:127.0.0.1:42055_solr] o.e.j.s.Server Started oejs.Server@5a1490ee{STARTING}[12.0.27,sto=15000] @8336ms
2> 8329 INFO (jetty-launcher-188-thread-2) [n:127.0.0.1:39881_solr] o.a.s.c.CorePropertiesLocator Found 0 core definitions underneath /home/jenkins/jenkins-agent/workspace/Solr/Solr-Test-10.0/build/tmp/tests-tmp/org.apache.solr.client.solrj.io.stream.StreamDecoratorTest_7203DD009EBBF5D5-001/tempDir-001/node2
2> 8349 INFO (jetty-launcher-188-thread-3) [n:127.0.0.1:37793_solr] o.a.s.c.CorePropertiesLocator Found 0 core definitions underneath /home/jenkins/jenkins-agent/workspace/Solr/Solr-Test-10.0/build/tmp/tests-tmp/org.apache.solr.client.solrj.io.stream.StreamDecoratorTest_7203DD009EBBF5D5-001/tempDir-001/node3
2> 8354 INFO (jetty-launcher-188-thread-4) [n:127.0.0.1:40575_solr] o.a.s.c.CorePropertiesLocator Found 0 core definitions underneath /home/jenkins/jenkins-agent/workspace/Solr/Solr-Test-10.0/build/tmp/tests-tmp/org.apache.solr.client.solrj.io.stream.StreamDecoratorTest_7203DD009EBBF5D5-001/tempDir-001/node4
2> 8368 INFO (jetty-launcher-188-thread-2) [n:127.0.0.1:39881_solr] o.a.s.j.SolrRequestAuthorizer Creating a new SolrRequestAuthorizer
2> 8383 INFO (jetty-launcher-188-thread-2) [n:127.0.0.1:39881_solr] o.e.j.e.s.ServletContextHandler Started oeje10s.ServletContextHandler@29aafdf9{/solr,/solr,b=file:///home/jenkins/jenkins-agent/workspace/Solr/Solr-Test-10.0/solr/solrj-streaming/build/tmp/tests-cwd/,a=AVAILABLE,h=oeje10s.SessionHandler@79b872b7{STARTED}}
2> 8384 INFO (jetty-launcher-188-thread-2) [n:127.0.0.1:39881_solr] o.e.j.s.AbstractConnector Started ServerConnector@1a8913e1{HTTP/1.1, (http/1.1, h2c)}{127.0.0.1:39881}
2> 8384 INFO (jetty-launcher-188-thread-2) [n:127.0.0.1:39881_solr] o.e.j.s.Server Started oejs.Server@661c546d{STARTING}[12.0.27,sto=15000] @8404ms
[...truncated too long message...]
viceConfigurationError: Locale provider adapter "CLDR"cannot be instantiated.
java.security.policy: error adding Permission, java.net.URLPermission:
java.util.ServiceConfigurationError: Locale provider adapter "CLDR"cannot be instantiated.
java.security.policy: error adding Permission, java.net.URLPermission:
java.util.ServiceConfigurationError: Locale provider adapter "CLDR"cannot be instantiated.
java.security.policy: error adding Permission, java.net.URLPermission:
java.util.ServiceConfigurationError: Locale provider adapter "CLDR"cannot be instantiated.
:solr:modules:s3-repository:test (SUCCESS): 53 test(s), 1 skipped
> Task :solr:modules:s3-repository:wipeTaskTemp
> Task :solr:modules:scripting:compileJava
Note: Some input files use or override a deprecated API.
Note: Recompile with -Xlint:deprecation for details.
> Task :solr:modules:scripting:processResources NO-SOURCE
> Task :solr:modules:scripting:classes
> Task :solr:modules:scripting:compileTestJava
Note: Some input files use or override a deprecated API.
Note: Recompile with -Xlint:deprecation for details.
> Task :solr:modules:scripting:processTestResources
> Task :solr:modules:scripting:testClasses
> Task :solr:modules:scripting:test
WARNING: Using incubator modules: jdk.incubator.vector
WARNING: Using incubator modules: jdk.incubator.vector
WARNING: Using incubator modules: jdk.incubator.vector
WARNING: Using incubator modules: jdk.incubator.vector
WARNING: A command line option has enabled the Security Manager
WARNING: The Security Manager is deprecated and will be removed in a future release
WARNING: A command line option has enabled the Security Manager
WARNING: The Security Manager is deprecated and will be removed in a future release
WARNING: A command line option has enabled the Security Manager
WARNING: The Security Manager is deprecated and will be removed in a future release
WARNING: A command line option has enabled the Security Manager
WARNING: The Security Manager is deprecated and will be removed in a future release
java.security.policy: error adding Permission, java.net.URLPermission:
java.util.ServiceConfigurationError: Locale provider adapter "CLDR"cannot be instantiated.
java.security.policy: error adding Permission, java.net.URLPermission:
java.util.ServiceConfigurationError: Locale provider adapter "CLDR"cannot be instantiated.
java.security.policy: error adding Permission, java.net.URLPermission:
java.util.ServiceConfigurationError: Locale provider adapter "CLDR"cannot be instantiated.
java.security.policy: error adding Permission, java.net.URLPermission:
java.util.ServiceConfigurationError: Locale provider adapter "CLDR"cannot be instantiated.
java.security.policy: error adding Permission, java.net.URLPermission:
java.util.ServiceConfigurationError: Locale provider adapter "CLDR"cannot be instantiated.
java.security.policy: error adding Permission, java.net.URLPermission:
java.util.ServiceConfigurationError: Locale provider adapter "CLDR"cannot be instantiated.
java.security.policy: error adding Permission, java.net.URLPermission:
java.util.ServiceConfigurationError: Locale provider adapter "CLDR"cannot be instantiated.
java.security.policy: error adding Permission, java.net.URLPermission:
java.util.ServiceConfigurationError: Locale provider adapter "CLDR"cannot be instantiated.
java.security.policy: error adding Permission, java.net.URLPermission:
java.util.ServiceConfigurationError: Locale provider adapter "CLDR"cannot be instantiated.
java.security.policy: error adding Permission, java.net.URLPermission:
java.util.ServiceConfigurationError: Locale provider adapter "CLDR"cannot be instantiated.
java.security.policy: error adding Permission, java.net.URLPermission:
java.util.ServiceConfigurationError: Locale provider adapter "CLDR"cannot be instantiated.
java.security.policy: error adding Permission, java.net.URLPermission:
java.util.ServiceConfigurationError: Locale provider adapter "CLDR"cannot be instantiated.
:solr:modules:scripting:test (SUCCESS): 22 test(s), 17 skipped
> Task :solr:modules:scripting:wipeTaskTemp
> Task :solr:modules:sql:compileTestJava
Note: Some input files use or override a deprecated API.
Note: Recompile with -Xlint:deprecation for details.
> Task :solr:modules:sql:copySolrCoreTestResources
> Task :solr:modules:sql:processTestResources
> Task :solr:modules:sql:testClasses
> Task :solr:modules:sql:test
WARNING: Using incubator modules: jdk.incubator.vector
WARNING: Using incubator modules: jdk.incubator.vector
WARNING: Using incubator modules: jdk.incubator.vector
WARNING: A command line option has enabled the Security Manager
WARNING: The Security Manager is deprecated and will be removed in a future release
WARNING: A command line option has enabled the Security Manager
WARNING: The Security Manager is deprecated and will be removed in a future release
WARNING: A command line option has enabled the Security Manager
WARNING: The Security Manager is deprecated and will be removed in a future release
java.security.policy: error adding Permission, java.net.URLPermission:
java.util.ServiceConfigurationError: Locale provider adapter "CLDR"cannot be instantiated.
java.security.policy: error adding Permission, java.net.URLPermission:
java.util.ServiceConfigurationError: Locale provider adapter "CLDR"cannot be instantiated.
java.security.policy: error adding Permission, java.net.URLPermission:
java.util.ServiceConfigurationError: Locale provider adapter "CLDR"cannot be instantiated.
java.security.policy: error adding Permission, java.net.URLPermission:
java.util.ServiceConfigurationError: Locale provider adapter "CLDR"cannot be instantiated.
java.security.policy: error adding Permission, java.net.URLPermission:
java.util.ServiceConfigurationError: Locale provider adapter "CLDR"cannot be instantiated.
java.security.policy: error adding Permission, java.net.URLPermission:
java.security.policy: error adding Permission, java.net.URLPermission:
java.util.ServiceConfigurationError: Locale provider adapter "CLDR"cannot be instantiated.
java.util.ServiceConfigurationError: Locale provider adapter "CLDR"cannot be instantiated.
java.security.policy: error adding Permission, java.net.URLPermission:
java.util.ServiceConfigurationError: Locale provider adapter "CLDR"cannot be instantiated.
java.security.policy: error adding Permission, java.net.URLPermission:
java.util.ServiceConfigurationError: Locale provider adapter "CLDR"cannot be instantiated.
:solr:modules:sql:test (SUCCESS): 33 test(s)
> Task :solr:modules:sql:wipeTaskTemp
The slowest tests (exceeding 500 ms) during this run:
90.16s BasicDistributedZkTest.test (:solr:core)
65.45s TestCpuAllowedLimit.testDistribLimit (:solr:core)
64.14s PeerSyncReplicationTest.test (:solr:core)
61.85s TestCloudJSONFacetSKG.testRandom (:solr:core)
61.24s TestRandomCollapseQParserPlugin.testRandomCollapseWithSort (:solr:core)
54.36s TestCpuAllowedLimit.testDistribLimit2 (:solr:core)
48.16s ReplicationFactorTest.test (:solr:core)
45.40s SyncSliceTest.test (:solr:core)
40.17s TestRandomFaceting.testRandomFaceting (:solr:core)
40.15s HttpJettySolrClientTest.testIdleTimeoutWithHttpClient (:solr:solrj-jetty)
The slowest suites (exceeding 1s) during this run:
126.05s TestCpuAllowedLimit (:solr:core)
90.41s BasicDistributedZkTest (:solr:core)
81.68s TestPullReplica (:solr:core)
68.19s TestRandomCollapseQParserPlugin (:solr:core)
68.12s TestRecovery (:solr:core)
68.04s KnnQParserTest (:solr:core)
66.55s TestCloudJSONFacetSKG (:solr:core)
64.33s PeerSyncReplicationTest (:solr:core)
61.30s TestCloudConsistency (:solr:core)
60.80s TestCoordinatorRole (:solr:core)
ERROR: The following test(s) have failed:
- org.apache.solr.client.solrj.io.stream.StreamDecoratorTest.testParallelUpdateStream (:solr:solrj-streaming)
Test history: https://develocity.apache.org/scans/tests?search.rootProjectNames=solr-root&tests.container=org.apache.solr.client.solrj.io.stream.StreamDecoratorTest&tests.test=testParallelUpdateStream http://fucit.org/solr-jenkins-reports/history-trend-of-recent-failures.html#series/org.apache.solr.client.solrj.io.stream.StreamDecoratorTest.testParallelUpdateStream
Test output: /home/jenkins/jenkins-agent/workspace/Solr/Solr-Test-10.0/solr/solrj-streaming/build/test-results/test/outputs/OUTPUT-org.apache.solr.client.solrj.io.stream.StreamDecoratorTest.txt
Reproduce with: ./gradlew :solr:solrj-streaming:test --tests "org.apache.solr.client.solrj.io.stream.StreamDecoratorTest.testParallelUpdateStream" -Ptests.haltonfailure=false "-Ptests.jvmargs=-XX:TieredStopAtLevel=1 -XX:+UseParallelGC -XX:ActiveProcessorCount=1 -XX:ReservedCodeCacheSize=120m" -Ptests.seed=7203DD009EBBF5D5 -Ptests.multiplier=2 -Ptests.useSecurityManager=true -Ptests.badapples=false -Ptests.file.encoding=UTF-8
Deprecated Gradle features were used in this build, making it incompatible with Gradle 9.0.
You can use '--warning-mode all' to show the individual deprecation warnings and determine if they come from your own scripts or plugins.
For more on this, please refer to https://docs.gradle.org/8.10/userguide/command_line_interface.html#sec:command_line_warnings in the Gradle documentation.
BUILD SUCCESSFUL in 43m 2s
153 actionable tasks: 153 executed
Publishing build scan...
The Develocity server (develocity.apache.org) rejected the access key with prefix '7x3jzizm4zpygv7psbkg6byvm4'.
Your credential has expired.
Build step 'Invoke Gradle script' changed build result to SUCCESS
Archiving artifacts
‘**/*.events’ doesn’t match anything: ‘**’ exists but not ‘**/*.events’
No artifacts found that match the file pattern "**/*.events,heapdumps/**,**/hs_err_pid*". Configuration error?
Recording test results
[Checks API] No suitable checks publisher found.
Build step 'Publish JUnit test result report' changed build result to UNSTABLE
Email was triggered for: Unstable (Test Failures)
Sending email for trigger: Unstable (Test Failures)