You are viewing a plain text version of this content. The canonical link for it is here.
Posted to dev@any23.apache.org by Apache Jenkins Server <je...@builds.apache.org> on 2013/06/05 13:19:12 UTC

Build failed in Jenkins: Any23-trunk #681

See <https://builds.apache.org/job/Any23-trunk/681/>

------------------------------------------
[...truncated 4615 lines...]
Total time: 0s
Finished at: Wed Jun 05 11:18:51 UTC 2013
Final Memory: 106M/251M
------------------------------------------------------------------------
Tests run: 4, Failures: 0, Errors: 0, Skipped: 0, Time elapsed: 0.164 sec
Running org.apache.any23.cli.ToolRunnerTest
Apache Any23 0.8.0-SNAPSHOT (UNKNOWN@r${buildNumber}; 2013-06-05 11:17:54+0000)
Java version: 1.6.0_45, vendor: Sun Microsystems Inc.
Java home: /x1/jenkins/tools/java/jdk1.6.0_45-32/jre
Default locale: en_US, platform encoding: ANSI_X3.4-1968
OS name: "Linux", version: "3.2.0-40-generic", arch: "i386", family: "unix"
Usage: null [options] [command] [command options]
  Options:
    -h, --help          Display help information.
                        Default: false
        --plugins-dir   The Any23 plugins directory.
                        Default: /home/jenkins/.any23/plugins
    -X, --verbose       Produce execution verbose output.
                        Default: false
    -v, --version       Display version information.
                        Default: false
  Commands:
    extractor      Utility for obtaining documentation about metadata extractors.
      Usage: extractor [options] Extractor name      
  Options:
          -a, --all     shows a report about all available extractors
                        Default: false
          -i, --input   shows example input for the given extractor
                        Default: false
          -l, --list    shows the names of all available extractors
                        Default: false
          -o, --outut   shows example output for the given extractor
                        Default: false

    microdata      Commandline Tool for extracting Microdata from file/HTTP source.
      Usage: microdata [options] Input document URL, {http://path/to/resource.html|file:/path/to/local.file}
    mimes      MIME Type Detector Tool.
      Usage: mimes [options] Input document URL, {http://path/to/resource.html|file:///path/to/local.file|inline:// some inline content}
    verify      Utility for plugin management verification.
      Usage: verify [options] plugins-dir
    rover      Any23 Command Line Tool.
      Usage: rover [options] input URIs {<url>|<file>}+      
  Options:
          -d, --defaultns    Override the default namespace used to produce
                             statements.
          -e, --extractors   a comma-separated list of extractors, e.g.
                             rdf-xml,rdf-turtle
                             Default: []
          -f, --format       the output format
                             Default: json
          -l, --log          Produce log within a file.
          -n, --nesting      Disable production of nesting triples.
                             Default: false
          -t, --notrivial    Filter trivial statements (e.g. CSS related ones).
                             Default: false
          -o, --output       Specify Output file (defaults to standard output)
                             Default: org.apache.maven.surefire.report.ConsoleOutputCapture$ForwardingPrintStream@ac169c
          -p, --pedantic     Validate and fixes HTML content detecting commons
                             issues.
                             Default: false
          -s, --stats        Print out extraction statistics.
                             Default: false

    vocab      Prints out the RDF Schema of the vocabularies used by Any23.
      Usage: vocab [options]      
  Options:
          -f, --format   Vocabulary output format
                         Default: N-Quads (mimeTypes=text/x-nquads; ext=nq)


Tests run: 3, Failures: 0, Errors: 0, Skipped: 0, Time elapsed: 0.01 sec
Running org.apache.any23.cli.MimeDetectorTest

------------------------------------------------------------------------
Apache Any23 :: mimes
------------------------------------------------------------------------

[2013-06-05 11:18:51,483] WARN  9023[main] - org.apache.commons.httpclient.HttpMethodBase.processCookieHeaders(HttpMethodBase.java:1656) - Cookie rejected: "$Version=0; guest_id=v1%3A137043113146519919; $Path=/; $Domain=.twitter.com". Illegal domain attribute ".twitter.com". Domain of origin: "twitter.com"
  [2013-06-05 11:18:51,666] WARN  9206[main] - org.apache.commons.httpclient.HttpMethodBase.processCookieHeaders(HttpMethodBase.java:1656) - Cookie rejected: "$Version=0; _twitter_sess=BAh7CToHaWQiJTBkNDE1MjM0ZTc0MjkxOWZiNmViZWY1MzgzZjM2ZDFjOgxj%250Ac3JmX2lkIiVhNWFhMjlkYTdlMjljMjhhY2EyNjY0ZjI5Y2FmODc4YjoPY3Jl%250AYXRlZF9hdGwrCLiPDxQ%252FASIKZmxhc2hJQzonQWN0aW9uQ29udHJvbGxlcjo6%250ARmxhc2g6OkZsYXNoSGFzaHsABjoKQHVzZWR7AA%253D%253D--875f4212fdbfa9e10c8e9edcfa2743b09bae39d4; $Path=/; $Domain=.twitter.com". Illegal domain attribute ".twitter.com". Domain of origin: "twitter.com"
  [2013-06-05 11:18:51,666] WARN  9206[main] - org.apache.commons.httpclient.HttpMethodBase.processCookieHeaders(HttpMethodBase.java:1656) - Cookie rejected: "$Version=0; guest_id=v1%3A137043113157296123; $Path=/; $Domain=.twitter.com". Illegal domain attribute ".twitter.com". Domain of origin: "twitter.com"
  text/html

------------------------------------------------------------------------
Apache Any23 SUCCESS
Total time: 0s
Finished at: Wed Jun 05 11:18:51 UTC 2013
Final Memory: 110M/251M
------------------------------------------------------------------------

------------------------------------------------------------------------
Apache Any23 :: mimes
------------------------------------------------------------------------

application/trix

------------------------------------------------------------------------
Apache Any23 SUCCESS
Total time: 0s
Finished at: Wed Jun 05 11:18:51 UTC 2013
Final Memory: 110M/251M
------------------------------------------------------------------------

------------------------------------------------------------------------
Apache Any23 :: mimes
------------------------------------------------------------------------

text/rdf+n3

------------------------------------------------------------------------
Apache Any23 SUCCESS
Total time: 0s
Finished at: Wed Jun 05 11:18:51 UTC 2013
Final Memory: 110M/251M
------------------------------------------------------------------------
Tests run: 3, Failures: 0, Errors: 0, Skipped: 0, Time elapsed: 0.376 sec
Running org.apache.any23.cli.MicrodataParserTest

------------------------------------------------------------------------
Apache Any23 :: microdata
------------------------------------------------------------------------

{ "result" : [{ "xpath" : "/HTML[1]/BODY[1]/DIV[1]", "id" : "amanda", "refs" : ["a", "b"], "type" : null, "itemid" : null, "properties" : [ { "xpath" : "/HTML[1]/BODY[1]/DIV[2]", "name" : "band", "value" : { "content" : { "xpath" : "/HTML[1]/BODY[1]/DIV[2]", "id" : "b", "refs" : ["c"], "type" : null, "itemid" : null, "properties" : [ { "xpath" : "/HTML[1]/BODY[1]/DIV[3]/P[1]/SPAN[1]", "name" : "name", "value" : { "content" : "Jazz Band", "type" : "Plain" } }, { "xpath" : "/HTML[1]/BODY[1]/DIV[3]/P[2]/SPAN[1]", "name" : "size", "value" : { "content" : "12", "type" : "Plain" } } ] }, "type" : "Nested" } }, { "xpath" : "/HTML[1]/BODY[1]/P[1]/SPAN[1]", "name" : "name", "value" : { "content" : "Amanda", "type" : "Plain" } } ] }, { "xpath" : "/HTML[1]/BODY[1]/DIV[4]", "id" : null, "refs" : [], "type" : "http://schema.org/Movie", "itemid" : null, "properties" : [ { "xpath" : "/HTML[1]/BODY[1]/DIV[4]/H1[1]", "name" : "name", "value" : { "content" : "Avatar", "type" : "Plain" } }, { "xpath" : "/HTML[1]/BODY[1]/DIV[4]/DIV[1]", "name" : "director", "value" : { "content" : { "xpath" : "/HTML[1]/BODY[1]/DIV[4]/DIV[1]", "id" : null, "refs" : [], "type" : "http://schema.org/Person", "itemid" : null, "properties" : [ { "xpath" : "/HTML[1]/BODY[1]/DIV[4]/DIV[1]/SPAN[1]", "name" : "name", "value" : { "content" : "James Cameron", "type" : "Plain" } } ] }, "type" : "Nested" } } ] }] }
------------------------------------------------------------------------
Apache Any23 SUCCESS
Total time: 0s
Finished at: Wed Jun 05 11:18:51 UTC 2013
Final Memory: 114M/251M
------------------------------------------------------------------------
Tests run: 2, Failures: 0, Errors: 0, Skipped: 1, Time elapsed: 0.007 sec
Running org.apache.any23.rdf.RDFUtilsTest
Tests run: 6, Failures: 0, Errors: 0, Skipped: 0, Time elapsed: 0.001 sec
Running org.apache.any23.rdf.PrefixesTest
Tests run: 36, Failures: 0, Errors: 0, Skipped: 0, Time elapsed: 0.006 sec
Running org.apache.any23.writer.WriterRegistryTest
Tests run: 7, Failures: 0, Errors: 0, Skipped: 0, Time elapsed: 0.002 sec
Running org.apache.any23.writer.JSONWriterTest
Tests run: 1, Failures: 0, Errors: 0, Skipped: 0, Time elapsed: 0 sec

Results :

Failed tests:   testKelkoo(org.apache.any23.extractor.html.HListingExtractorTest): Assertion failed! Extracted triples:
  testKelkooFull(org.apache.any23.extractor.html.HListingExtractorTest): Assertion failed! Extracted triples:

Tests run: 391, Failures: 2, Errors: 0, Skipped: 7

[ERROR] There are test failures.

Please refer to <https://builds.apache.org/job/Any23-trunk/ws/core/target/surefire-reports> for the individual test results.
[JENKINS] Recording test results
[INFO] [jar:jar {execution: default-jar}]
[INFO] Building jar: <https://builds.apache.org/job/Any23-trunk/ws/core/target/apache-any23-core-0.8.0-SNAPSHOT.jar>
[INFO] [appassembler:assemble {execution: default}]
[INFO] Installing artifact <https://builds.apache.org/job/Any23-trunk/ws/api/target/apache-any23-api-0.8.0-SNAPSHOT.jar> to <https://builds.apache.org/job/Any23-trunk/ws/core/target/appassembler/lib/apache-any23-api-0.8.0-SNAPSHOT.jar>
[INFO] Installing artifact /home/jenkins/jenkins-slave/maven-repositories/1/org/slf4j/slf4j-api/1.6.6/slf4j-api-1.6.6.jar to <https://builds.apache.org/job/Any23-trunk/ws/core/target/appassembler/lib/slf4j-api-1.6.6.jar>
[INFO] Installing artifact /home/jenkins/jenkins-slave/maven-repositories/1/org/openrdf/sesame/sesame-model/2.6.9/sesame-model-2.6.9.jar to <https://builds.apache.org/job/Any23-trunk/ws/core/target/appassembler/lib/sesame-model-2.6.9.jar>
[INFO] Installing artifact /home/jenkins/jenkins-slave/maven-repositories/1/org/openrdf/sesame/sesame-util/2.6.9/sesame-util-2.6.9.jar to <https://builds.apache.org/job/Any23-trunk/ws/core/target/appassembler/lib/sesame-util-2.6.9.jar>
[INFO] Installing artifact /home/jenkins/jenkins-slave/maven-repositories/1/org/openrdf/sesame/sesame-rio-api/2.6.9/sesame-rio-api-2.6.9.jar to <https://builds.apache.org/job/Any23-trunk/ws/core/target/appassembler/lib/sesame-rio-api-2.6.9.jar>
[INFO] Installing artifact <https://builds.apache.org/job/Any23-trunk/ws/csvutils/target/apache-any23-csvutils-0.8.0-SNAPSHOT.jar> to <https://builds.apache.org/job/Any23-trunk/ws/core/target/appassembler/lib/apache-any23-csvutils-0.8.0-SNAPSHOT.jar>
[INFO] Installing artifact /home/jenkins/jenkins-slave/maven-repositories/1/org/apache/commons/commons-csv/1.0-SNAPSHOT-rev1148315/commons-csv-1.0-SNAPSHOT-rev1148315.jar to <https://builds.apache.org/job/Any23-trunk/ws/core/target/appassembler/lib/commons-csv-1.0-SNAPSHOT-rev1148315.jar>
[INFO] Installing artifact <https://builds.apache.org/job/Any23-trunk/ws/mime/target/apache-any23-mime-0.8.0-SNAPSHOT.jar> to <https://builds.apache.org/job/Any23-trunk/ws/core/target/appassembler/lib/apache-any23-mime-0.8.0-SNAPSHOT.jar>
[INFO] Installing artifact /home/jenkins/jenkins-slave/maven-repositories/1/commons-io/commons-io/2.4/commons-io-2.4.jar to <https://builds.apache.org/job/Any23-trunk/ws/core/target/appassembler/lib/commons-io-2.4.jar>
[INFO] Installing artifact /home/jenkins/jenkins-slave/maven-repositories/1/org/apache/tika/tika-core/1.2/tika-core-1.2.jar to <https://builds.apache.org/job/Any23-trunk/ws/core/target/appassembler/lib/tika-core-1.2.jar>
[INFO] Installing artifact /home/jenkins/jenkins-slave/maven-repositories/1/org/apache/tika/tika-parsers/1.2/tika-parsers-1.2.jar to <https://builds.apache.org/job/Any23-trunk/ws/core/target/appassembler/lib/tika-parsers-1.2.jar>
[INFO] Installing artifact /home/jenkins/jenkins-slave/maven-repositories/1/org/gagravarr/vorbis-java-tika/0.1/vorbis-java-tika-0.1.jar to <https://builds.apache.org/job/Any23-trunk/ws/core/target/appassembler/lib/vorbis-java-tika-0.1.jar>
[INFO] Installing artifact /home/jenkins/jenkins-slave/maven-repositories/1/org/gagravarr/vorbis-java-core/0.1/vorbis-java-core-0.1-tests.jar to <https://builds.apache.org/job/Any23-trunk/ws/core/target/appassembler/lib/vorbis-java-core-0.1-tests.jar>
[INFO] Installing artifact /home/jenkins/jenkins-slave/maven-repositories/1/edu/ucar/netcdf/4.2-min/netcdf-4.2-min.jar to <https://builds.apache.org/job/Any23-trunk/ws/core/target/appassembler/lib/netcdf-4.2-min.jar>
[INFO] Installing artifact /home/jenkins/jenkins-slave/maven-repositories/1/org/apache/james/apache-mime4j-core/0.7.2/apache-mime4j-core-0.7.2.jar to <https://builds.apache.org/job/Any23-trunk/ws/core/target/appassembler/lib/apache-mime4j-core-0.7.2.jar>
[INFO] Installing artifact /home/jenkins/jenkins-slave/maven-repositories/1/org/apache/james/apache-mime4j-dom/0.7.2/apache-mime4j-dom-0.7.2.jar to <https://builds.apache.org/job/Any23-trunk/ws/core/target/appassembler/lib/apache-mime4j-dom-0.7.2.jar>
[INFO] Installing artifact /home/jenkins/jenkins-slave/maven-repositories/1/org/apache/commons/commons-compress/1.4.1/commons-compress-1.4.1.jar to <https://builds.apache.org/job/Any23-trunk/ws/core/target/appassembler/lib/commons-compress-1.4.1.jar>
[INFO] Installing artifact /home/jenkins/jenkins-slave/maven-repositories/1/org/tukaani/xz/1.0/xz-1.0.jar to <https://builds.apache.org/job/Any23-trunk/ws/core/target/appassembler/lib/xz-1.0.jar>
[INFO] Installing artifact /home/jenkins/jenkins-slave/maven-repositories/1/commons-codec/commons-codec/1.6/commons-codec-1.6.jar to <https://builds.apache.org/job/Any23-trunk/ws/core/target/appassembler/lib/commons-codec-1.6.jar>
[INFO] Installing artifact /home/jenkins/jenkins-slave/maven-repositories/1/org/apache/pdfbox/pdfbox/1.7.0/pdfbox-1.7.0.jar to <https://builds.apache.org/job/Any23-trunk/ws/core/target/appassembler/lib/pdfbox-1.7.0.jar>
[INFO] Installing artifact /home/jenkins/jenkins-slave/maven-repositories/1/org/apache/pdfbox/fontbox/1.7.0/fontbox-1.7.0.jar to <https://builds.apache.org/job/Any23-trunk/ws/core/target/appassembler/lib/fontbox-1.7.0.jar>
[INFO] Installing artifact /home/jenkins/jenkins-slave/maven-repositories/1/org/apache/pdfbox/jempbox/1.7.0/jempbox-1.7.0.jar to <https://builds.apache.org/job/Any23-trunk/ws/core/target/appassembler/lib/jempbox-1.7.0.jar>
[INFO] Installing artifact /home/jenkins/jenkins-slave/maven-repositories/1/commons-logging/commons-logging/1.0.4/commons-logging-1.0.4.jar to <https://builds.apache.org/job/Any23-trunk/ws/core/target/appassembler/lib/commons-logging-1.0.4.jar>
[INFO] Installing artifact /home/jenkins/jenkins-slave/maven-repositories/1/org/bouncycastle/bcmail-jdk15/1.45/bcmail-jdk15-1.45.jar to <https://builds.apache.org/job/Any23-trunk/ws/core/target/appassembler/lib/bcmail-jdk15-1.45.jar>
[INFO] Installing artifact /home/jenkins/jenkins-slave/maven-repositories/1/org/bouncycastle/bcprov-jdk15/1.45/bcprov-jdk15-1.45.jar to <https://builds.apache.org/job/Any23-trunk/ws/core/target/appassembler/lib/bcprov-jdk15-1.45.jar>
[INFO] Installing artifact /home/jenkins/jenkins-slave/maven-repositories/1/org/apache/poi/poi/3.8/poi-3.8.jar to <https://builds.apache.org/job/Any23-trunk/ws/core/target/appassembler/lib/poi-3.8.jar>
[INFO] Installing artifact /home/jenkins/jenkins-slave/maven-repositories/1/org/apache/poi/poi-scratchpad/3.8/poi-scratchpad-3.8.jar to <https://builds.apache.org/job/Any23-trunk/ws/core/target/appassembler/lib/poi-scratchpad-3.8.jar>
[INFO] Installing artifact /home/jenkins/jenkins-slave/maven-repositories/1/org/apache/poi/poi-ooxml/3.8/poi-ooxml-3.8.jar to <https://builds.apache.org/job/Any23-trunk/ws/core/target/appassembler/lib/poi-ooxml-3.8.jar>
[INFO] Installing artifact /home/jenkins/jenkins-slave/maven-repositories/1/org/apache/poi/poi-ooxml-schemas/3.8/poi-ooxml-schemas-3.8.jar to <https://builds.apache.org/job/Any23-trunk/ws/core/target/appassembler/lib/poi-ooxml-schemas-3.8.jar>
[INFO] Installing artifact /home/jenkins/jenkins-slave/maven-repositories/1/org/apache/xmlbeans/xmlbeans/2.3.0/xmlbeans-2.3.0.jar to <https://builds.apache.org/job/Any23-trunk/ws/core/target/appassembler/lib/xmlbeans-2.3.0.jar>
[INFO] Installing artifact /home/jenkins/jenkins-slave/maven-repositories/1/dom4j/dom4j/1.6.1/dom4j-1.6.1.jar to <https://builds.apache.org/job/Any23-trunk/ws/core/target/appassembler/lib/dom4j-1.6.1.jar>
[INFO] Installing artifact /home/jenkins/jenkins-slave/maven-repositories/1/org/apache/geronimo/specs/geronimo-stax-api_1.0_spec/1.0.1/geronimo-stax-api_1.0_spec-1.0.1.jar to <https://builds.apache.org/job/Any23-trunk/ws/core/target/appassembler/lib/geronimo-stax-api_1.0_spec-1.0.1.jar>
[INFO] Installing artifact /home/jenkins/jenkins-slave/maven-repositories/1/org/ccil/cowan/tagsoup/tagsoup/1.2.1/tagsoup-1.2.1.jar to <https://builds.apache.org/job/Any23-trunk/ws/core/target/appassembler/lib/tagsoup-1.2.1.jar>
[INFO] Installing artifact /home/jenkins/jenkins-slave/maven-repositories/1/asm/asm/3.1/asm-3.1.jar to <https://builds.apache.org/job/Any23-trunk/ws/core/target/appassembler/lib/asm-3.1.jar>
[INFO] Installing artifact /home/jenkins/jenkins-slave/maven-repositories/1/com/googlecode/mp4parser/isoparser/1.0-RC-1/isoparser-1.0-RC-1.jar to <https://builds.apache.org/job/Any23-trunk/ws/core/target/appassembler/lib/isoparser-1.0-RC-1.jar>
[INFO] Installing artifact /home/jenkins/jenkins-slave/maven-repositories/1/org/aspectj/aspectjrt/1.6.11/aspectjrt-1.6.11.jar to <https://builds.apache.org/job/Any23-trunk/ws/core/target/appassembler/lib/aspectjrt-1.6.11.jar>
[INFO] Installing artifact /home/jenkins/jenkins-slave/maven-repositories/1/com/drewnoakes/metadata-extractor/2.4.0-beta-1/metadata-extractor-2.4.0-beta-1.jar to <https://builds.apache.org/job/Any23-trunk/ws/core/target/appassembler/lib/metadata-extractor-2.4.0-beta-1.jar>
[INFO] Installing artifact /home/jenkins/jenkins-slave/maven-repositories/1/de/l3s/boilerpipe/boilerpipe/1.1.0/boilerpipe-1.1.0.jar to <https://builds.apache.org/job/Any23-trunk/ws/core/target/appassembler/lib/boilerpipe-1.1.0.jar>
[INFO] Installing artifact /home/jenkins/jenkins-slave/maven-repositories/1/rome/rome/0.9/rome-0.9.jar to <https://builds.apache.org/job/Any23-trunk/ws/core/target/appassembler/lib/rome-0.9.jar>
[INFO] Installing artifact /home/jenkins/jenkins-slave/maven-repositories/1/jdom/jdom/1.0/jdom-1.0.jar to <https://builds.apache.org/job/Any23-trunk/ws/core/target/appassembler/lib/jdom-1.0.jar>
[INFO] Installing artifact /home/jenkins/jenkins-slave/maven-repositories/1/org/gagravarr/vorbis-java-core/0.1/vorbis-java-core-0.1.jar to <https://builds.apache.org/job/Any23-trunk/ws/core/target/appassembler/lib/vorbis-java-core-0.1.jar>
[INFO] Installing artifact /home/jenkins/jenkins-slave/maven-repositories/1/com/googlecode/juniversalchardet/juniversalchardet/1.0.3/juniversalchardet-1.0.3.jar to <https://builds.apache.org/job/Any23-trunk/ws/core/target/appassembler/lib/juniversalchardet-1.0.3.jar>
[INFO] Installing artifact /home/jenkins/jenkins-slave/maven-repositories/1/org/openrdf/sesame/sesame-rio-turtle/2.6.9/sesame-rio-turtle-2.6.9.jar to <https://builds.apache.org/job/Any23-trunk/ws/core/target/appassembler/lib/sesame-rio-turtle-2.6.9.jar>
[INFO] Installing artifact /home/jenkins/jenkins-slave/maven-repositories/1/org/openrdf/sesame/sesame-rio-ntriples/2.6.9/sesame-rio-ntriples-2.6.9.jar to <https://builds.apache.org/job/Any23-trunk/ws/core/target/appassembler/lib/sesame-rio-ntriples-2.6.9.jar>
[INFO] Installing artifact /home/jenkins/jenkins-slave/maven-repositories/1/org/openrdf/sesame/sesame-rio-n3/2.6.9/sesame-rio-n3-2.6.9.jar to <https://builds.apache.org/job/Any23-trunk/ws/core/target/appassembler/lib/sesame-rio-n3-2.6.9.jar>
[INFO] Installing artifact <https://builds.apache.org/job/Any23-trunk/ws/encoding/target/apache-any23-encoding-0.8.0-SNAPSHOT.jar> to <https://builds.apache.org/job/Any23-trunk/ws/core/target/appassembler/lib/apache-any23-encoding-0.8.0-SNAPSHOT.jar>
[INFO] Installing artifact /home/jenkins/jenkins-slave/maven-repositories/1/commons-lang/commons-lang/2.4/commons-lang-2.4.jar to <https://builds.apache.org/job/Any23-trunk/ws/core/target/appassembler/lib/commons-lang-2.4.jar>
[INFO] Installing artifact /home/jenkins/jenkins-slave/maven-repositories/1/commons-httpclient/commons-httpclient/3.1/commons-httpclient-3.1.jar to <https://builds.apache.org/job/Any23-trunk/ws/core/target/appassembler/lib/commons-httpclient-3.1.jar>
[INFO] Installing artifact /home/jenkins/jenkins-slave/maven-repositories/1/net/sourceforge/nekohtml/nekohtml/1.9.15/nekohtml-1.9.15.jar to <https://builds.apache.org/job/Any23-trunk/ws/core/target/appassembler/lib/nekohtml-1.9.15.jar>
[INFO] Installing artifact /home/jenkins/jenkins-slave/maven-repositories/1/xerces/xercesImpl/2.9.1/xercesImpl-2.9.1.jar to <https://builds.apache.org/job/Any23-trunk/ws/core/target/appassembler/lib/xercesImpl-2.9.1.jar>
[INFO] Installing artifact /home/jenkins/jenkins-slave/maven-repositories/1/xml-apis/xml-apis/1.3.04/xml-apis-1.3.04.jar to <https://builds.apache.org/job/Any23-trunk/ws/core/target/appassembler/lib/xml-apis-1.3.04.jar>
[INFO] Installing artifact /home/jenkins/jenkins-slave/maven-repositories/1/com/beust/jcommander/1.23/jcommander-1.23.jar to <https://builds.apache.org/job/Any23-trunk/ws/core/target/appassembler/lib/jcommander-1.23.jar>
[INFO] Installing artifact /home/jenkins/jenkins-slave/maven-repositories/1/org/openrdf/sesame/sesame-rio-rdfxml/2.6.9/sesame-rio-rdfxml-2.6.9.jar to <https://builds.apache.org/job/Any23-trunk/ws/core/target/appassembler/lib/sesame-rio-rdfxml-2.6.9.jar>
[INFO] Installing artifact /home/jenkins/jenkins-slave/maven-repositories/1/org/openrdf/sesame/sesame-rio-trix/2.6.9/sesame-rio-trix-2.6.9.jar to <https://builds.apache.org/job/Any23-trunk/ws/core/target/appassembler/lib/sesame-rio-trix-2.6.9.jar>
[INFO] Installing artifact /home/jenkins/jenkins-slave/maven-repositories/1/org/openrdf/sesame/sesame-repository-sail/2.6.9/sesame-repository-sail-2.6.9.jar to <https://builds.apache.org/job/Any23-trunk/ws/core/target/appassembler/lib/sesame-repository-sail-2.6.9.jar>
[INFO] Installing artifact /home/jenkins/jenkins-slave/maven-repositories/1/org/openrdf/sesame/sesame-repository-api/2.6.9/sesame-repository-api-2.6.9.jar to <https://builds.apache.org/job/Any23-trunk/ws/core/target/appassembler/lib/sesame-repository-api-2.6.9.jar>
[INFO] Installing artifact /home/jenkins/jenkins-slave/maven-repositories/1/org/openrdf/sesame/sesame-query/2.6.9/sesame-query-2.6.9.jar to <https://builds.apache.org/job/Any23-trunk/ws/core/target/appassembler/lib/sesame-query-2.6.9.jar>
[INFO] Installing artifact /home/jenkins/jenkins-slave/maven-repositories/1/org/openrdf/sesame/sesame-sail-api/2.6.9/sesame-sail-api-2.6.9.jar to <https://builds.apache.org/job/Any23-trunk/ws/core/target/appassembler/lib/sesame-sail-api-2.6.9.jar>
[INFO] Installing artifact /home/jenkins/jenkins-slave/maven-repositories/1/org/openrdf/sesame/sesame-queryalgebra-model/2.6.9/sesame-queryalgebra-model-2.6.9.jar to <https://builds.apache.org/job/Any23-trunk/ws/core/target/appassembler/lib/sesame-queryalgebra-model-2.6.9.jar>
[INFO] Installing artifact /home/jenkins/jenkins-slave/maven-repositories/1/org/openrdf/sesame/sesame-queryparser-api/2.6.9/sesame-queryparser-api-2.6.9.jar to <https://builds.apache.org/job/Any23-trunk/ws/core/target/appassembler/lib/sesame-queryparser-api-2.6.9.jar>
[INFO] Installing artifact /home/jenkins/jenkins-slave/maven-repositories/1/org/openrdf/sesame/sesame-sail-memory/2.6.9/sesame-sail-memory-2.6.9.jar to <https://builds.apache.org/job/Any23-trunk/ws/core/target/appassembler/lib/sesame-sail-memory-2.6.9.jar>
[INFO] Installing artifact /home/jenkins/jenkins-slave/maven-repositories/1/org/openrdf/sesame/sesame-sail-inferencer/2.6.9/sesame-sail-inferencer-2.6.9.jar to <https://builds.apache.org/job/Any23-trunk/ws/core/target/appassembler/lib/sesame-sail-inferencer-2.6.9.jar>
[INFO] Installing artifact /home/jenkins/jenkins-slave/maven-repositories/1/org/openrdf/sesame/sesame-queryparser-serql/2.6.9/sesame-queryparser-serql-2.6.9.jar to <https://builds.apache.org/job/Any23-trunk/ws/core/target/appassembler/lib/sesame-queryparser-serql-2.6.9.jar>
[INFO] Installing artifact /home/jenkins/jenkins-slave/maven-repositories/1/org/openrdf/sesame/sesame-queryalgebra-evaluation/2.6.9/sesame-queryalgebra-evaluation-2.6.9.jar to <https://builds.apache.org/job/Any23-trunk/ws/core/target/appassembler/lib/sesame-queryalgebra-evaluation-2.6.9.jar>
[INFO] Installing artifact /home/jenkins/jenkins-slave/maven-repositories/1/org/openrdf/sesame/sesame-repository-sparql/2.6.9/sesame-repository-sparql-2.6.9.jar to <https://builds.apache.org/job/Any23-trunk/ws/core/target/appassembler/lib/sesame-repository-sparql-2.6.9.jar>
[INFO] Installing artifact /home/jenkins/jenkins-slave/maven-repositories/1/org/openrdf/sesame/sesame-http-client/2.6.9/sesame-http-client-2.6.9.jar to <https://builds.apache.org/job/Any23-trunk/ws/core/target/appassembler/lib/sesame-http-client-2.6.9.jar>
[INFO] Installing artifact /home/jenkins/jenkins-slave/maven-repositories/1/org/openrdf/sesame/sesame-http-protocol/2.6.9/sesame-http-protocol-2.6.9.jar to <https://builds.apache.org/job/Any23-trunk/ws/core/target/appassembler/lib/sesame-http-protocol-2.6.9.jar>
[INFO] Installing artifact /home/jenkins/jenkins-slave/maven-repositories/1/org/openrdf/sesame/sesame-queryresultio-api/2.6.9/sesame-queryresultio-api-2.6.9.jar to <https://builds.apache.org/job/Any23-trunk/ws/core/target/appassembler/lib/sesame-queryresultio-api-2.6.9.jar>
[INFO] Installing artifact /home/jenkins/jenkins-slave/maven-repositories/1/org/openrdf/sesame/sesame-queryresultio-sparqlxml/2.6.9/sesame-queryresultio-sparqlxml-2.6.9.jar to <https://builds.apache.org/job/Any23-trunk/ws/core/target/appassembler/lib/sesame-queryresultio-sparqlxml-2.6.9.jar>
[INFO] Installing artifact /home/jenkins/jenkins-slave/maven-repositories/1/info/aduna/commons/aduna-commons-xml/2.7.0/aduna-commons-xml-2.7.0.jar to <https://builds.apache.org/job/Any23-trunk/ws/core/target/appassembler/lib/aduna-commons-xml-2.7.0.jar>
[INFO] Installing artifact /home/jenkins/jenkins-slave/maven-repositories/1/info/aduna/commons/aduna-commons-text/2.7.0/aduna-commons-text-2.7.0.jar to <https://builds.apache.org/job/Any23-trunk/ws/core/target/appassembler/lib/aduna-commons-text-2.7.0.jar>
[INFO] Installing artifact /home/jenkins/jenkins-slave/maven-repositories/1/info/aduna/commons/aduna-commons-net/2.7.0/aduna-commons-net-2.7.0.jar to <https://builds.apache.org/job/Any23-trunk/ws/core/target/appassembler/lib/aduna-commons-net-2.7.0.jar>
[INFO] Installing artifact /home/jenkins/jenkins-slave/maven-repositories/1/info/aduna/commons/aduna-commons-lang/2.9.0/aduna-commons-lang-2.9.0.jar to <https://builds.apache.org/job/Any23-trunk/ws/core/target/appassembler/lib/aduna-commons-lang-2.9.0.jar>
[INFO] Installing artifact /home/jenkins/jenkins-slave/maven-repositories/1/info/aduna/commons/aduna-commons-iteration/2.10.0/aduna-commons-iteration-2.10.0.jar to <https://builds.apache.org/job/Any23-trunk/ws/core/target/appassembler/lib/aduna-commons-iteration-2.10.0.jar>
[INFO] Installing artifact /home/jenkins/jenkins-slave/maven-repositories/1/info/aduna/commons/aduna-commons-concurrent/2.7.0/aduna-commons-concurrent-2.7.0.jar to <https://builds.apache.org/job/Any23-trunk/ws/core/target/appassembler/lib/aduna-commons-concurrent-2.7.0.jar>
[INFO] Installing artifact /home/jenkins/jenkins-slave/maven-repositories/1/info/aduna/commons/aduna-commons-io/2.10.0/aduna-commons-io-2.10.0.jar to <https://builds.apache.org/job/Any23-trunk/ws/core/target/appassembler/lib/aduna-commons-io-2.10.0.jar>
[INFO] Installing artifact /home/jenkins/jenkins-slave/maven-repositories/1/org/kohsuke/metainf-services/metainf-services/1.4/metainf-services-1.4.jar to <https://builds.apache.org/job/Any23-trunk/ws/core/target/appassembler/lib/metainf-services-1.4.jar>
[INFO] Installing artifact <https://builds.apache.org/job/Any23-trunk/ws/core/target/apache-any23-core-0.8.0-SNAPSHOT.jar> to <https://builds.apache.org/job/Any23-trunk/ws/core/target/appassembler/lib/apache-any23-core-0.8.0-SNAPSHOT.jar>
[INFO] [assembly:single {execution: assembly}]
[INFO] Reading assembly descriptor: <https://builds.apache.org/job/Any23-trunk/ws/core/src/main/assembly/bin.xml>
[JENKINS] Archiving <https://builds.apache.org/job/Any23-trunk/ws/core/pom.xml> to /home/hudson/hudson/jobs/Any23-trunk/modules/org.apache.any23$apache-any23-core/builds/2013-06-05_11-17-45/archive/org.apache.any23/apache-any23-core/0.8.0-SNAPSHOT/apache-any23-core-0.8.0-SNAPSHOT.pom
[JENKINS] Archiving <https://builds.apache.org/job/Any23-trunk/ws/core/target/apache-any23-core-0.8.0-SNAPSHOT.jar> to /home/hudson/hudson/jobs/Any23-trunk/modules/org.apache.any23$apache-any23-core/builds/2013-06-05_11-17-45/archive/org.apache.any23/apache-any23-core/0.8.0-SNAPSHOT/apache-any23-core-0.8.0-SNAPSHOT.jar
[INFO] ------------------------------------------------------------------------
[ERROR] BUILD ERROR
[INFO] ------------------------------------------------------------------------
[INFO] Failed to create assembly: Error adding file to archive: <https://builds.apache.org/job/Any23-trunk/ws/core/./../DISCLAIMER.txt> isn't a file.

[INFO] ------------------------------------------------------------------------
[INFO] For more information, run Maven with the -e switch
[INFO] ------------------------------------------------------------------------
[INFO] Total time: 1 minute 
[INFO] Finished at: Wed Jun 05 11:18:54 UTC 2013
[INFO] Final Memory: 70M/374M
[INFO] ------------------------------------------------------------------------
Waiting for Jenkins to finish collecting data
Maven failed with error.
channel stopped

Build failed in Jenkins: Any23-trunk #682

Posted by Apache Jenkins Server <je...@builds.apache.org>.
See <https://builds.apache.org/job/Any23-trunk/682/>

------------------------------------------
Started by timer
Building remotely on ubuntu2 in workspace <https://builds.apache.org/job/Any23-trunk/ws/>
Checkout:Any23-trunk / <https://builds.apache.org/job/Any23-trunk/ws/> - hudson.remoting.Channel@59f95962:ubuntu2
Using strategy: Default
Last Built Revision: Revision 4a35ec1863585f730198a3b44182e99f3cf65547 (origin/HEAD, origin/master)
Cloning the remote Git repository
Cloning repository https://git-wip-us.apache.org/repos/asf/any23.git
git --version
git version 1.7.9.5
Fetching upstream changes from https://git-wip-us.apache.org/repos/asf/any23.git
Seen branch in repository origin/ANY23-141
Seen branch in repository origin/ANY23-156
Seen branch in repository origin/ANY23-156v2
Seen branch in repository origin/ANY23-158
Seen branch in repository origin/HEAD
Seen branch in repository origin/master
Commencing build of Revision 4a35ec1863585f730198a3b44182e99f3cf65547 (origin/HEAD, origin/master)
Checking out Revision 4a35ec1863585f730198a3b44182e99f3cf65547 (origin/HEAD, origin/master)
FATAL: Could not apply tag jenkins-Any23-trunk-682
hudson.plugins.git.GitException: Could not apply tag jenkins-Any23-trunk-682
	at hudson.plugins.git.GitAPI.tag(GitAPI.java:829)
	at hudson.plugins.git.GitSCM$4.invoke(GitSCM.java:1270)
	at hudson.plugins.git.GitSCM$4.invoke(GitSCM.java:1231)
	at hudson.FilePath$FileCallableWrapper.call(FilePath.java:2348)
	at hudson.remoting.UserRequest.perform(UserRequest.java:118)
	at hudson.remoting.UserRequest.perform(UserRequest.java:48)
	at hudson.remoting.Request$2.run(Request.java:326)
	at hudson.remoting.InterceptingExecutorService$1.call(InterceptingExecutorService.java:72)
	at java.util.concurrent.FutureTask$Sync.innerRun(FutureTask.java:334)
	at java.util.concurrent.FutureTask.run(FutureTask.java:166)
	at java.util.concurrent.ThreadPoolExecutor.runWorker(ThreadPoolExecutor.java:1146)
	at java.util.concurrent.ThreadPoolExecutor$Worker.run(ThreadPoolExecutor.java:615)
	at java.lang.Thread.run(Thread.java:679)
Caused by: hudson.plugins.git.GitException: Command "git tag -a -f -m Jenkins Build #682 jenkins-Any23-trunk-682" returned status code 128:
stdout: 
stderr: 
*** Please tell me who you are.

Run

  git config --global user.email "you@example.com"
  git config --global user.name "Your Name"

to set your account's default identity.
Omit --global to set the identity only in this repository.

fatal: empty ident  <je...@vesta.apache.org> not allowed

	at hudson.plugins.git.GitAPI.launchCommandIn(GitAPI.java:897)
	at hudson.plugins.git.GitAPI.launchCommand(GitAPI.java:858)
	at hudson.plugins.git.GitAPI.launchCommand(GitAPI.java:868)
	at hudson.plugins.git.GitAPI.tag(GitAPI.java:827)
	... 12 more