You are viewing a plain text version of this content. The canonical link for it is here.
Posted to builds@beam.apache.org by Apache Jenkins Server <je...@builds.apache.org> on 2019/07/18 17:21:06 UTC

Build failed in Jenkins: beam_LoadTests_Python_CoGBK_Dataflow_Batch #10

See <https://builds.apache.org/job/beam_LoadTests_Python_CoGBK_Dataflow_Batch/10/display/redirect?page=changes>

Changes:

[juta.staes] [BEAM-7630] add ITs for writing and reading bytes from pubsub

[yoshiki.obata] [BEAM-7284] enabled to pickle MappingProxyType in order to pickle

[pabloem] Adding logging and adding one more retry

[hannahjiang] BEAM-3645 improve test cases

[pabloem] [BEAM-7530] Add it test to read None values from BigQuery (#8875)

[github] [BEAM-7499] Fixup for tricky Reify testing issue (#9077)

[alireza4263] [BEAM-7545] Reordering Beam Joins and check if the produced join is

[github] [BEAM-7641] Collect xunit statistics for Py ITs (#8952)

[github] [BEAM-4948, BEAM-6267, BEAM-5559, BEAM-7289] Update the version of guava

[udim] [BEAM-7484] Metrics collection in BigQuery perf tests (#8766)

[lostluck] Fix documentation on iterable coder spec.

------------------------------------------
[...truncated 125.28 KB...]
            "value": "apache_beam.transforms.core.CallableWrapperDoFn"
          }
        ], 
        "non_parallel_inputs": {}, 
        "output_info": [
          {
            "encoding": {
              "@type": "kind:windowed_value", 
              "component_encodings": [
                {
                  "@type": "FastPrimitivesCoder$eNprYEpOLEhMzkiNT0pNzNVLzk9JLSqGUlxuicUlAUWZuZklmWWpxc4gQa5CBs3GQsbaQqZQ/vi0xJycpMTk7Hiw+kJmPEYFZCZn56RCjWABGsFaW8iWVJykBwDlGS3/", 
                  "component_encodings": [
                    {
                      "@type": "FastPrimitivesCoder$eNprYEpOLEhMzkiNT0pNzNVLzk9JLSqGUlxuicUlAUWZuZklmWWpxc4gQa5CBs3GQsbaQqZQ/vi0xJycpMTk7Hiw+kJmPEYFZCZn56RCjWABGsFaW8iWVJykBwDlGS3/", 
                      "component_encodings": []
                    }, 
                    {
                      "@type": "FastPrimitivesCoder$eNprYEpOLEhMzkiNT0pNzNVLzk9JLSqGUlxuicUlAUWZuZklmWWpxc4gQa5CBs3GQsbaQqZQ/vi0xJycpMTk7Hiw+kJmPEYFZCZn56RCjWABGsFaW8iWVJykBwDlGS3/", 
                      "component_encodings": []
                    }
                  ], 
                  "is_pair_like": true
                }, 
                {
                  "@type": "kind:global_window"
                }
              ], 
              "is_wrapper": true
            }, 
            "output_name": "out", 
            "user_name": "CoGroupByKey /Map(_merge_tagged_vals_under_key).out"
          }
        ], 
        "parallel_input": {
          "@type": "OutputReference", 
          "output_name": "out", 
          "step_name": "s10"
        }, 
        "serialized_fn": "<string of 1384 bytes>", 
        "user_name": "CoGroupByKey /Map(_merge_tagged_vals_under_key)"
      }
    }, 
    {
      "kind": "ParallelDo", 
      "name": "s12", 
      "properties": {
        "display_data": [
          {
            "key": "fn", 
            "label": "Transform Function", 
            "namespace": "apache_beam.transforms.core.ParDo", 
            "shortValue": "_UngroupAndReiterate", 
            "type": "STRING", 
            "value": "apache_beam.testing.load_tests.co_group_by_key_test._UngroupAndReiterate"
          }
        ], 
        "non_parallel_inputs": {}, 
        "output_info": [
          {
            "encoding": {
              "@type": "kind:windowed_value", 
              "component_encodings": [
                {
                  "@type": "FastPrimitivesCoder$eNprYEpOLEhMzkiNT0pNzNVLzk9JLSqGUlxuicUlAUWZuZklmWWpxc4gQa5CBs3GQsbaQqZQ/vi0xJycpMTk7Hiw+kJmPEYFZCZn56RCjWABGsFaW8iWVJykBwDlGS3/", 
                  "component_encodings": [
                    {
                      "@type": "FastPrimitivesCoder$eNprYEpOLEhMzkiNT0pNzNVLzk9JLSqGUlxuicUlAUWZuZklmWWpxc4gQa5CBs3GQsbaQqZQ/vi0xJycpMTk7Hiw+kJmPEYFZCZn56RCjWABGsFaW8iWVJykBwDlGS3/", 
                      "component_encodings": []
                    }, 
                    {
                      "@type": "FastPrimitivesCoder$eNprYEpOLEhMzkiNT0pNzNVLzk9JLSqGUlxuicUlAUWZuZklmWWpxc4gQa5CBs3GQsbaQqZQ/vi0xJycpMTk7Hiw+kJmPEYFZCZn56RCjWABGsFaW8iWVJykBwDlGS3/", 
                      "component_encodings": []
                    }
                  ], 
                  "is_pair_like": true
                }, 
                {
                  "@type": "kind:global_window"
                }
              ], 
              "is_wrapper": true
            }, 
            "output_name": "out", 
            "user_name": "Consume Joined Collections.out"
          }
        ], 
        "parallel_input": {
          "@type": "OutputReference", 
          "output_name": "out", 
          "step_name": "s11"
        }, 
        "serialized_fn": "<string of 460 bytes>", 
        "user_name": "Consume Joined Collections"
      }
    }, 
    {
      "kind": "ParallelDo", 
      "name": "s13", 
      "properties": {
        "display_data": [
          {
            "key": "fn", 
            "label": "Transform Function", 
            "namespace": "apache_beam.transforms.core.ParDo", 
            "shortValue": "MeasureTime", 
            "type": "STRING", 
            "value": "apache_beam.testing.load_tests.load_test_metrics_utils.MeasureTime"
          }
        ], 
        "non_parallel_inputs": {}, 
        "output_info": [
          {
            "encoding": {
              "@type": "kind:windowed_value", 
              "component_encodings": [
                {
                  "@type": "FastPrimitivesCoder$eNprYEpOLEhMzkiNT0pNzNVLzk9JLSqGUlxuicUlAUWZuZklmWWpxc4gQa5CBs3GQsbaQqZQ/vi0xJycpMTk7Hiw+kJmPEYFZCZn56RCjWABGsFaW8iWVJykBwDlGS3/", 
                  "component_encodings": [
                    {
                      "@type": "FastPrimitivesCoder$eNprYEpOLEhMzkiNT0pNzNVLzk9JLSqGUlxuicUlAUWZuZklmWWpxc4gQa5CBs3GQsbaQqZQ/vi0xJycpMTk7Hiw+kJmPEYFZCZn56RCjWABGsFaW8iWVJykBwDlGS3/", 
                      "component_encodings": []
                    }, 
                    {
                      "@type": "FastPrimitivesCoder$eNprYEpOLEhMzkiNT0pNzNVLzk9JLSqGUlxuicUlAUWZuZklmWWpxc4gQa5CBs3GQsbaQqZQ/vi0xJycpMTk7Hiw+kJmPEYFZCZn56RCjWABGsFaW8iWVJykBwDlGS3/", 
                      "component_encodings": []
                    }
                  ], 
                  "is_pair_like": true
                }, 
                {
                  "@type": "kind:global_window"
                }
              ], 
              "is_wrapper": true
            }, 
            "output_name": "out", 
            "user_name": "Measure time: End.out"
          }
        ], 
        "parallel_input": {
          "@type": "OutputReference", 
          "output_name": "out", 
          "step_name": "s12"
        }, 
        "serialized_fn": "<string of 504 bytes>", 
        "user_name": "Measure time: End"
      }
    }
  ], 
  "type": "JOB_TYPE_BATCH"
}
root: INFO: Create job: <Job
 createTime: u'2019-07-18T17:18:49.816323Z'
 currentStateTime: u'1970-01-01T00:00:00Z'
 id: u'2019-07-18_10_18_40-2700215169504195509'
 location: u'us-central1'
 name: u'load-tests-python-dataflow-batch-cogbk-2-0718150333'
 projectId: u'apache-beam-testing'
 stageStates: []
 startTime: u'2019-07-18T17:18:49.816323Z'
 steps: []
 tempFiles: []
 type: TypeValueValuesEnum(JOB_TYPE_BATCH, 1)>
root: INFO: Created job with id: [2019-07-18_10_18_40-2700215169504195509]
root: INFO: To access the Dataflow monitoring console, please navigate to https://console.cloud.google.com/dataflow/jobsDetail/locations/us-central1/jobs/2019-07-18_10_18_40-2700215169504195509?project=apache-beam-testing
root: INFO: Job 2019-07-18_10_18_40-2700215169504195509 is in state JOB_STATE_PENDING
root: INFO: 2019-07-18T17:18:40.911Z: JOB_MESSAGE_WARNING: The requested max number of workers (5) is ignored as autoscaling is explicitly disabled (autoscalingAlgorithm=NONE).
root: INFO: 2019-07-18T17:18:51.695Z: JOB_MESSAGE_DETAILED: Checking permissions granted to controller Service Account.
root: INFO: 2019-07-18T17:18:52.184Z: JOB_MESSAGE_BASIC: Worker configuration: n1-standard-1 in us-central1-a.
root: INFO: 2019-07-18T17:18:52.730Z: JOB_MESSAGE_DETAILED: Expanding CoGroupByKey operations into optimizable parts.
root: INFO: 2019-07-18T17:18:52.768Z: JOB_MESSAGE_DEBUG: Combiner lifting skipped for step CoGroupByKey /GroupByKey: GroupByKey not followed by a combiner.
root: INFO: 2019-07-18T17:18:52.818Z: JOB_MESSAGE_DETAILED: Expanding GroupByKey operations into optimizable parts.
root: INFO: 2019-07-18T17:18:52.855Z: JOB_MESSAGE_DETAILED: Lifting ValueCombiningMappingFns into MergeBucketsMappingFns
root: INFO: 2019-07-18T17:18:52.950Z: JOB_MESSAGE_DEBUG: Annotating graph with Autotuner information.
root: INFO: 2019-07-18T17:18:53.014Z: JOB_MESSAGE_DETAILED: Fusing adjacent ParDo, Read, Write, and Flatten operations
root: INFO: 2019-07-18T17:18:53.051Z: JOB_MESSAGE_DETAILED: Unzipping flatten s9 for input s7.out
root: INFO: 2019-07-18T17:18:53.099Z: JOB_MESSAGE_DETAILED: Fusing unzipped copy of CoGroupByKey /GroupByKey/Reify, through flatten CoGroupByKey /Flatten, into producer CoGroupByKey /pair_with_pc2
root: INFO: 2019-07-18T17:18:53.156Z: JOB_MESSAGE_DETAILED: Fusing consumer CoGroupByKey /Map(_merge_tagged_vals_under_key) into CoGroupByKey /GroupByKey/GroupByWindow
root: INFO: 2019-07-18T17:18:53.185Z: JOB_MESSAGE_DETAILED: Fusing consumer Measure time: End into Consume Joined Collections
root: INFO: 2019-07-18T17:18:53.232Z: JOB_MESSAGE_DETAILED: Fusing consumer Consume Joined Collections into CoGroupByKey /Map(_merge_tagged_vals_under_key)
root: INFO: 2019-07-18T17:18:53.280Z: JOB_MESSAGE_DETAILED: Fusing consumer CoGroupByKey /GroupByKey/GroupByWindow into CoGroupByKey /GroupByKey/Read
root: INFO: 2019-07-18T17:18:53.328Z: JOB_MESSAGE_DETAILED: Unzipping flatten s9-u13 for input s10-reify-value0-c11
root: INFO: 2019-07-18T17:18:53.372Z: JOB_MESSAGE_DETAILED: Fusing unzipped copy of CoGroupByKey /GroupByKey/Write, through flatten CoGroupByKey /Flatten/Unzipped-1, into producer CoGroupByKey /GroupByKey/Reify
root: INFO: 2019-07-18T17:18:53.415Z: JOB_MESSAGE_DETAILED: Fusing consumer CoGroupByKey /GroupByKey/Reify into CoGroupByKey /pair_with_pc1
root: INFO: 2019-07-18T17:18:53.439Z: JOB_MESSAGE_DETAILED: Fusing consumer CoGroupByKey /GroupByKey/Write into CoGroupByKey /GroupByKey/Reify
root: INFO: 2019-07-18T17:18:53.487Z: JOB_MESSAGE_DETAILED: Fusing consumer Measure time: Start pc2 into Make pc2 iterable
root: INFO: 2019-07-18T17:18:53.551Z: JOB_MESSAGE_DETAILED: Fusing consumer CoGroupByKey /pair_with_pc2 into Measure time: Start pc2
root: INFO: 2019-07-18T17:18:53.590Z: JOB_MESSAGE_DETAILED: Fusing consumer CoGroupByKey /pair_with_pc1 into Measure time: Start pc1
root: INFO: 2019-07-18T17:18:53.633Z: JOB_MESSAGE_DETAILED: Fusing consumer Measure time: Start pc1 into Make pc1 iterable
root: INFO: 2019-07-18T17:18:53.684Z: JOB_MESSAGE_DETAILED: Fusing consumer Make pc2 iterable into Read pc2
root: INFO: 2019-07-18T17:18:53.721Z: JOB_MESSAGE_DETAILED: Fusing consumer Make pc1 iterable into Read pc1
root: INFO: 2019-07-18T17:18:53.771Z: JOB_MESSAGE_DEBUG: Workflow config is missing a default resource spec.
root: INFO: 2019-07-18T17:18:53.819Z: JOB_MESSAGE_DEBUG: Adding StepResource setup and teardown to workflow graph.
root: INFO: 2019-07-18T17:18:53.866Z: JOB_MESSAGE_DEBUG: Adding workflow start and stop steps.
root: INFO: 2019-07-18T17:18:53.913Z: JOB_MESSAGE_DEBUG: Assigning stage ids.
root: INFO: 2019-07-18T17:18:54.086Z: JOB_MESSAGE_DEBUG: Executing wait step start21
root: INFO: 2019-07-18T17:18:54.199Z: JOB_MESSAGE_BASIC: Executing operation CoGroupByKey /GroupByKey/Create
root: INFO: 2019-07-18T17:18:54.254Z: JOB_MESSAGE_DEBUG: Starting worker pool setup.
root: INFO: 2019-07-18T17:18:54.304Z: JOB_MESSAGE_BASIC: Starting 5 workers in us-central1-a...
root: INFO: 2019-07-18T17:18:54.361Z: JOB_MESSAGE_BASIC: Finished operation CoGroupByKey /GroupByKey/Create
root: INFO: 2019-07-18T17:18:54.405Z: JOB_MESSAGE_BASIC: Worker configuration: n1-standard-1 in us-central1-a.
root: INFO: 2019-07-18T17:18:54.459Z: JOB_MESSAGE_DEBUG: Value "CoGroupByKey /GroupByKey/Session" materialized.
root: INFO: 2019-07-18T17:18:54.542Z: JOB_MESSAGE_BASIC: Executing operation Read pc1+Make pc1 iterable+Measure time: Start pc1+CoGroupByKey /pair_with_pc1+CoGroupByKey /GroupByKey/Reify+CoGroupByKey /GroupByKey/Write
root: INFO: 2019-07-18T17:18:54.589Z: JOB_MESSAGE_BASIC: Executing operation Read pc2+Make pc2 iterable+Measure time: Start pc2+CoGroupByKey /pair_with_pc2+CoGroupByKey /GroupByKey/Reify+CoGroupByKey /GroupByKey/Write
root: INFO: Job 2019-07-18_10_18_40-2700215169504195509 is in state JOB_STATE_RUNNING
root: INFO: 2019-07-18T17:19:52.439Z: JOB_MESSAGE_DETAILED: Autoscaling: Raised the number of workers to 1 based on the rate of progress in the currently running step(s).
root: INFO: 2019-07-18T17:19:52.482Z: JOB_MESSAGE_DETAILED: Resized worker pool to 1, though goal was 5.  This could be a quota issue.
root: INFO: 2019-07-18T17:20:09.201Z: JOB_MESSAGE_DETAILED: Autoscaling: Raised the number of workers to 3 based on the rate of progress in the currently running step(s).
root: INFO: 2019-07-18T17:20:09.242Z: JOB_MESSAGE_DETAILED: Resized worker pool to 3, though goal was 5.  This could be a quota issue.
root: INFO: 2019-07-18T17:20:14.642Z: JOB_MESSAGE_DETAILED: Autoscaling: Raised the number of workers to 5 based on the rate of progress in the currently running step(s).
root: INFO: 2019-07-18T17:20:20.902Z: JOB_MESSAGE_DETAILED: Workers have started successfully.
root: INFO: 2019-07-18T17:20:20.940Z: JOB_MESSAGE_DETAILED: Workers have started successfully.
--------------------- >> end captured logging << ---------------------

----------------------------------------------------------------------
XML: <https://builds.apache.org/job/beam_LoadTests_Python_CoGBK_Dataflow_Batch/ws/src/sdks/python/nosetests.xml>
----------------------------------------------------------------------
Ran 1 test in 145.271s

FAILED (errors=1)

> Task :sdks:python:apache_beam:testing:load_tests:run FAILED

FAILURE: Build failed with an exception.

* Where:
Build file '<https://builds.apache.org/job/beam_LoadTests_Python_CoGBK_Dataflow_Batch/ws/src/sdks/python/apache_beam/testing/load_tests/build.gradle'> line: 49

* What went wrong:
Execution failed for task ':sdks:python:apache_beam:testing:load_tests:run'.
> error occurred

* Try:
Run with --stacktrace option to get the stack trace. Run with --info or --debug option to get more log output. Run with --scan to get full insights.

* Get more help at https://help.gradle.org

Deprecated Gradle features were used in this build, making it incompatible with Gradle 6.0.
Use '--warning-mode all' to show the individual deprecation warnings.
See https://docs.gradle.org/5.2.1/userguide/command_line_interface.html#sec:command_line_warnings

BUILD FAILED in 2m 41s
4 actionable tasks: 3 executed, 1 up-to-date

Publishing build scan...
https://gradle.com/s/2ot7d6ylpxpma

Build step 'Invoke Gradle script' changed build result to FAILURE
Build step 'Invoke Gradle script' marked build as failure

---------------------------------------------------------------------
To unsubscribe, e-mail: builds-unsubscribe@beam.apache.org
For additional commands, e-mail: builds-help@beam.apache.org


Jenkins build is back to normal : beam_LoadTests_Python_CoGBK_Dataflow_Batch #11

Posted by Apache Jenkins Server <je...@builds.apache.org>.
See <https://builds.apache.org/job/beam_LoadTests_Python_CoGBK_Dataflow_Batch/11/display/redirect?page=changes>


---------------------------------------------------------------------
To unsubscribe, e-mail: builds-unsubscribe@beam.apache.org
For additional commands, e-mail: builds-help@beam.apache.org