You are viewing a plain text version of this content. The canonical link for it is here.
Posted to builds@beam.apache.org by Apache Jenkins Server <je...@builds.apache.org> on 2023/09/19 00:30:42 UTC

Build failed in Jenkins: beam_PostCommit_Java_Examples_Dataflow_V2 #4114

See <https://ci-beam.apache.org/job/beam_PostCommit_Java_Examples_Dataflow_V2/4114/display/redirect>

Changes:


------------------------------------------
[...truncated 36.80 KB...]
go: added github.com/golang/protobuf v1.5.3
go: added golang.org/x/net v0.14.0
go: added golang.org/x/sys v0.11.0
go: added golang.org/x/text v0.12.0
go: added google.golang.org/genproto/googleapis/rpc v0.0.0-20230726155614-23370e0ffb3e
go: added google.golang.org/grpc v1.57.0
go: added google.golang.org/protobuf v1.31.0
+ go-licenses save github.com/apache/beam/sdks/v2/java/container --save_path=/output/licenses

> Task :runners:core-construction-java:jar
> Task :runners:core-java:compileJava FROM-CACHE
> Task :runners:core-java:classes UP-TO-DATE
> Task :runners:core-java:jar
> Task :sdks:java:extensions:python:compileJava FROM-CACHE
> Task :sdks:java:extensions:python:classes
> Task :sdks:java:extensions:python:jar
> Task :sdks:java:extensions:google-cloud-platform-core:compileJava FROM-CACHE
> Task :sdks:java:extensions:google-cloud-platform-core:classes UP-TO-DATE
> Task :sdks:java:harness:compileJava FROM-CACHE
> Task :sdks:java:harness:classes UP-TO-DATE
> Task :sdks:java:extensions:google-cloud-platform-core:jar
> Task :sdks:java:harness:jar
> Task :runners:java-fn-execution:compileJava FROM-CACHE
> Task :runners:java-fn-execution:classes UP-TO-DATE
> Task :runners:java-fn-execution:jar
> Task :sdks:java:expansion-service:compileJava FROM-CACHE
> Task :sdks:java:expansion-service:classes UP-TO-DATE
> Task :sdks:java:expansion-service:jar
> Task :runners:direct-java:compileJava FROM-CACHE
> Task :runners:direct-java:classes UP-TO-DATE
> Task :sdks:java:harness:shadowJar FROM-CACHE

> Task :release:go-licenses:java:dockerRun
W0919 00:02:41.799911      31 library.go:101] "golang.org/x/sys/unix" contains non-Go code that can't be inspected for further dependencies:
/go/pkg/mod/golang.org/x/sys@v0.11.0/unix/asm_linux_amd64.s

> Task :runners:direct-java:shadowJar FROM-CACHE
> Task :sdks:java:container:java8:copyDockerfileDependencies
> Task :sdks:java:extensions:ml:compileJava FROM-CACHE
> Task :sdks:java:extensions:ml:classes UP-TO-DATE
> Task :sdks:java:io:kafka:compileJava FROM-CACHE
> Task :sdks:java:io:kafka:classes UP-TO-DATE
> Task :sdks:java:extensions:ml:jar
> Task :sdks:java:io:kafka:jar
> Task :sdks:java:io:google-cloud-platform:compileJava FROM-CACHE
> Task :sdks:java:io:google-cloud-platform:classes UP-TO-DATE
> Task :sdks:java:io:google-cloud-platform:jar
> Task :runners:google-cloud-dataflow-java:compileJava FROM-CACHE
> Task :runners:google-cloud-dataflow-java:classes
> Task :examples:java:compileJava FROM-CACHE
> Task :examples:java:classes UP-TO-DATE
> Task :runners:google-cloud-dataflow-java:jar
> Task :examples:java:compileTestJava FROM-CACHE
> Task :examples:java:jar
> Task :examples:java:testClasses
> Task :examples:java:testJar

> Task :release:go-licenses:java:dockerRun
+ go-licenses csv github.com/apache/beam/sdks/v2/java/container
+ tee /output/licenses/list.csv
W0919 00:02:49.414173      73 library.go:101] "golang.org/x/sys/unix" contains non-Go code that can't be inspected for further dependencies:
/go/pkg/mod/golang.org/x/sys@v0.11.0/unix/asm_linux_amd64.s
+ chmod -R a+w /output/licenses

> Task :release:go-licenses:java:createLicenses
> Task :sdks:java:container:java8:copyGolangLicenses

> Task :sdks:java:container:pullLicenses
INFO:root:Pulling license for 126 dependencies using 16 threads.
INFO:root:Replaced local file URL with file://<https://ci-beam.apache.org/job/beam_PostCommit_Java_Examples_Dataflow_V2/ws/src/sdks/java/container/license_scripts/manual_licenses/xz/COPYING> for xz-1.5
INFO:root:pull_licenses_java.py succeed. It took 14.690656 seconds with 16 threads.
Copying licenses from <https://ci-beam.apache.org/job/beam_PostCommit_Java_Examples_Dataflow_V2/ws/src/sdks/java/container/build/target/java_third_party_licenses> to <https://ci-beam.apache.org/job/beam_PostCommit_Java_Examples_Dataflow_V2/ws/src/sdks/java/container/build/target/third_party_licenses.>
Finished license_scripts.sh

> Task :sdks:java:container:java8:copyJavaThirdPartyLicenses

> Task :sdks:java:container:downloadCloudProfilerAgent
  % Total    % Received % Xferd  Average Speed   Time    Time     Time  Current
                                 Dload  Upload   Total   Spent    Left  Speed
  0     0    0     0    0     0      0      0 --:--:-- --:--:-- --:--:--     0100 4183k  100 4183k    0     0  19.6M      0 --:--:-- --:--:-- --:--:-- 19.7M

> Task :sdks:java:container:goPrepare UP-TO-DATE
> Task :sdks:java:container:goBuild

> Task :sdks:java:container:java8:copySdkHarnessLauncher
Execution optimizations have been disabled for task ':sdks:java:container:java8:copySdkHarnessLauncher' to ensure correctness due to the following reasons:
  - Gradle detected a problem with the following location: '<https://ci-beam.apache.org/job/beam_PostCommit_Java_Examples_Dataflow_V2/ws/src/sdks/java/container/build/target'.> Reason: Task ':sdks:java:container:java8:copySdkHarnessLauncher' uses this output of task ':sdks:java:container:pullLicenses' without declaring an explicit or implicit dependency. This can lead to incorrect results being produced, depending on what order the tasks are executed. Please refer to https://docs.gradle.org/7.6.2/userguide/validation_problems.html#implicit_dependency for more details about this problem.

> Task :sdks:java:container:java8:dockerPrepare

> Task :sdks:java:container:java8:docker
#1 [internal] load build definition from Dockerfile
#1 transferring dockerfile: 2.58kB done
#1 DONE 0.1s

#2 [internal] load .dockerignore
#2 transferring context: 2B done
#2 DONE 0.0s

#3 [internal] load metadata for docker.io/library/eclipse-temurin:8
#3 DONE 0.4s

#4 [ 1/16] FROM docker.io/library/eclipse-temurin:8@sha256:ae78c894d048567fe780b577194f3409ed56ee8cb951d82c8ce66c41de46a9e4
#4 CACHED

#5 [internal] load build context
#5 transferring context: 47.26MB 0.6s done
#5 DONE 0.6s

#6 [ 2/16] ADD target/slf4j-api.jar /opt/apache/beam/jars/
#6 DONE 2.1s

#7 [ 3/16] ADD target/slf4j-jdk14.jar /opt/apache/beam/jars/
#7 DONE 0.1s

#8 [ 4/16] ADD target/jcl-over-slf4j.jar /opt/apache/beam/jars/
#8 DONE 0.1s

#9 [ 5/16] ADD target/log4j-over-slf4j.jar /opt/apache/beam/jars/
#9 DONE 0.1s

#10 [ 6/16] ADD target/log4j-to-slf4j.jar /opt/apache/beam/jars/
#10 DONE 0.1s

#11 [ 7/16] ADD target/beam-sdks-java-harness.jar /opt/apache/beam/jars/
#11 DONE 0.1s

#12 [ 8/16] COPY target/jamm.jar target/open-module-agent*.jar /opt/apache/beam/jars/
#12 DONE 0.1s

#13 [ 9/16] COPY target/linux_amd64/boot /opt/apache/beam/
#13 DONE 0.2s

#14 [10/16] COPY target/LICENSE /opt/apache/beam/
#14 DONE 0.1s

#15 [11/16] COPY target/NOTICE /opt/apache/beam/
#15 DONE 0.1s

#16 [12/16] ADD target/third_party_licenses /opt/apache/beam/third_party_licenses/
#16 DONE 0.2s

#17 [13/16] COPY target/LICENSE target/options/* /opt/apache/beam/options/
#17 DONE 0.1s

#18 [14/16] COPY target/go-licenses/* /opt/apache/beam/third_party_licenses/golang/
#18 DONE 0.1s

#19 [15/16] RUN if [ "true" = "false" ] ; then     rm -rf /opt/apache/beam/third_party_licenses ;    fi
#19 DONE 0.4s

#20 [16/16] COPY target/profiler/* /opt/google_cloud_profiler/
#20 DONE 0.1s

#21 exporting to image
#21 exporting layers
#21 exporting layers 0.3s done
#21 writing image sha256:740d1f39970c47db10f500e29491c3a554317729e77a223a2c9d4c2ced92075c done
#21 naming to docker.io/apache/beam_java8_sdk:2.51.0.dev done
#21 DONE 0.3s

> Task :runners:google-cloud-dataflow-java:buildAndPushDockerJavaContainer
WARNING: `gcloud docker` will not be supported for Docker client versions above 18.03.

As an alternative, use `gcloud auth configure-docker` to configure `docker` to
use `gcloud` as a credential helper, then use `docker` as you would for non-GCR
registries, e.g. `docker pull gcr.io/project-id/my-image`. Add
`--verbosity=error` to silence this warning: `gcloud docker
--verbosity=error -- pull gcr.io/project-id/my-image`.

See: https://cloud.google.com/container-registry/docs/support/deprecation-notices#gcloud-docker


> Task :runners:google-cloud-dataflow-java:examplesJavaRunnerV2IntegrationTest

org.apache.beam.examples.cookbook.BigQueryTornadoesIT > testE2EBigQueryTornadoesWithExportUsingQuery FAILED
    java.lang.RuntimeException at BigQueryTornadoesIT.java:68

org.apache.beam.examples.cookbook.BigQueryTornadoesIT > testE2EBigQueryTornadoesWithExport FAILED
    java.lang.RuntimeException at BigQueryTornadoesIT.java:68

org.apache.beam.examples.cookbook.FilterExamplesIT > testE2EFilterExamples FAILED
    java.lang.RuntimeException at FilterExamplesIT.java:73

org.apache.beam.examples.cookbook.CombinePerKeyExamplesIT > testE2ECombinePerKey FAILED
    java.lang.RuntimeException at CombinePerKeyExamplesIT.java:73

org.apache.beam.examples.cookbook.MaxPerKeyExamplesIT > testE2EMaxPerKeyExamples FAILED
    java.lang.RuntimeException at MaxPerKeyExamplesIT.java:75

org.apache.beam.examples.snippets.transforms.io.gcp.bigquery.BigQuerySamplesIT > testTableIO FAILED
    java.lang.RuntimeException at BigQuerySamplesIT.java:121

org.apache.beam.examples.cookbook.JoinExamplesIT > testE2EJoinExamples FAILED
    java.lang.RuntimeException at JoinExamplesIT.java:63

13 tests completed, 7 failed

> Task :runners:google-cloud-dataflow-java:examplesJavaRunnerV2IntegrationTest FAILED

> Task :runners:google-cloud-dataflow-java:cleanUpDockerJavaImages
WARNING: Successfully resolved tag to sha256, but it is recommended to use sha256 directly.
Tag: [us.gcr.io/apache-beam-testing/java-postcommit-it/java:20230919000213]
- referencing digest: [us.gcr.io/apache-beam-testing/java-postcommit-it/java@sha256:e4f70a7ca1d61f1c007ae94b9e39c3549da8bf6638f27fa5dbe577d3554ffedb]

Deleted [[us.gcr.io/apache-beam-testing/java-postcommit-it/java:20230919000213] (referencing [us.gcr.io/apache-beam-testing/java-postcommit-it/java@sha256:e4f70a7ca1d61f1c007ae94b9e39c3549da8bf6638f27fa5dbe577d3554ffedb])].

FAILURE: Build failed with an exception.

* What went wrong:
Execution failed for task ':runners:google-cloud-dataflow-java:examplesJavaRunnerV2IntegrationTest'.
> There were failing tests. See the report at: file://<https://ci-beam.apache.org/job/beam_PostCommit_Java_Examples_Dataflow_V2/ws/src/runners/google-cloud-dataflow-java/build/reports/tests/examplesJavaRunnerV2IntegrationTest/index.html>

* Try:
> Run with --stacktrace option to get the stack trace.
> Run with --info or --debug option to get more log output.

* Get more help at https://help.gradle.org

Deprecated Gradle features were used in this build, making it incompatible with Gradle 8.0.

You can use '--warning-mode all' to show the individual deprecation warnings and determine if they come from your own scripts or plugins.

See https://docs.gradle.org/7.6.2/userguide/command_line_interface.html#sec:command_line_warnings

Execution optimizations have been disabled for 1 invalid unit(s) of work during this build to ensure correctness.
Please consult deprecation warnings for more details.

BUILD FAILED in 27m 37s
124 actionable tasks: 81 executed, 39 from cache, 4 up-to-date

Publishing build scan...
Publishing build scan failed due to network error 'java.net.SocketTimeoutException: Read timed out' (2 retries remaining)...
Publishing build scan failed due to network error 'java.net.SocketTimeoutException: Read timed out' (1 retry remaining)...

A network error occurred.

If you require assistance with this problem, please report it to your Gradle Enterprise administrator and include the following information via copy/paste.

----------
Gradle version: 7.6.2
Plugin version: 3.13.2
Request URL: https://ge.apache.org/scans/publish/gradle/3.13.2/upload
Request ID: c296e14d-8bc4-4233-81ea-cacf2ef45954
Exception: java.net.SocketTimeoutException: Read timed out
----------

Build step 'Invoke Gradle script' changed build result to FAILURE
Build step 'Invoke Gradle script' marked build as failure

---------------------------------------------------------------------
To unsubscribe, e-mail: builds-unsubscribe@beam.apache.org
For additional commands, e-mail: builds-help@beam.apache.org


Jenkins build is back to normal : beam_PostCommit_Java_Examples_Dataflow_V2 #4118

Posted by Apache Jenkins Server <je...@builds.apache.org>.
See <https://ci-beam.apache.org/job/beam_PostCommit_Java_Examples_Dataflow_V2/4118/display/redirect>


---------------------------------------------------------------------
To unsubscribe, e-mail: builds-unsubscribe@beam.apache.org
For additional commands, e-mail: builds-help@beam.apache.org


Build failed in Jenkins: beam_PostCommit_Java_Examples_Dataflow_V2 #4117

Posted by Apache Jenkins Server <je...@builds.apache.org>.
See <https://ci-beam.apache.org/job/beam_PostCommit_Java_Examples_Dataflow_V2/4117/display/redirect>

Changes:


------------------------------------------
[...truncated 54.95 KB...]
/go/pkg/mod/golang.org/x/sys@v0.11.0/unix/asm_linux_amd64.s
+ go-licenses csv github.com/apache/beam/sdks/v2/java/container
+ tee /output/licenses/list.csv
W0919 18:02:35.990446      84 library.go:101] "golang.org/x/sys/unix" contains non-Go code that can't be inspected for further dependencies:
/go/pkg/mod/golang.org/x/sys@v0.11.0/unix/asm_linux_amd64.s
github.com/apache/beam/sdks/v2/go,https://github.com/apache/beam/blob/sdks/v2.50.0/sdks/go/README.md,Apache-2.0
github.com/apache/beam/sdks/v2/java/container,https://github.com/apache/beam/blob/sdks/v2.50.0/sdks/LICENSE,Apache-2.0
github.com/golang/protobuf,https://github.com/golang/protobuf/blob/v1.5.3/LICENSE,BSD-3-Clause
golang.org/x/net,https://cs.opensource.google/go/x/net/+/v0.14.0:LICENSE,BSD-3-Clause
golang.org/x/sys/unix,https://cs.opensource.google/go/x/sys/+/v0.11.0:LICENSE,BSD-3-Clause
golang.org/x/text,https://cs.opensource.google/go/x/text/+/v0.12.0:LICENSE,BSD-3-Clause
google.golang.org/genproto/googleapis/rpc/status,https://github.com/googleapis/go-genproto/blob/23370e0ffb3e/googleapis/rpc/LICENSE,Apache-2.0
google.golang.org/grpc,https://github.com/grpc/grpc-go/blob/v1.57.0/LICENSE,Apache-2.0
google.golang.org/protobuf,https://github.com/protocolbuffers/protobuf-go/blob/v1.31.0/LICENSE,BSD-3-Clause
+ chmod -R a+w /output/licenses

> Task :release:go-licenses:java:createLicenses
> Task :sdks:java:container:java8:copyGolangLicenses
> Task :sdks:java:container:java8:dockerPrepare

> Task :sdks:java:container:java8:docker
#1 [internal] load build definition from Dockerfile
#1 transferring dockerfile: 2.58kB done
#1 DONE 0.0s

#2 [internal] load .dockerignore
#2 transferring context: 2B done
#2 DONE 0.0s

#3 [internal] load metadata for docker.io/library/eclipse-temurin:8
#3 DONE 0.3s

#4 [ 1/16] FROM docker.io/library/eclipse-temurin:8@sha256:ae78c894d048567fe780b577194f3409ed56ee8cb951d82c8ce66c41de46a9e4
#4 resolve docker.io/library/eclipse-temurin:8@sha256:ae78c894d048567fe780b577194f3409ed56ee8cb951d82c8ce66c41de46a9e4 0.0s done
#4 CACHED

#5 [internal] load build context
#5 transferring context: 47.26MB 0.3s done
#5 DONE 0.3s

#6 [ 2/16] ADD target/slf4j-api.jar /opt/apache/beam/jars/
#6 DONE 1.2s

#7 [ 3/16] ADD target/slf4j-jdk14.jar /opt/apache/beam/jars/
#7 DONE 0.1s

#8 [ 4/16] ADD target/jcl-over-slf4j.jar /opt/apache/beam/jars/
#8 DONE 0.1s

#9 [ 5/16] ADD target/log4j-over-slf4j.jar /opt/apache/beam/jars/
#9 DONE 0.1s

#10 [ 6/16] ADD target/log4j-to-slf4j.jar /opt/apache/beam/jars/
#10 DONE 0.1s

#11 [ 7/16] ADD target/beam-sdks-java-harness.jar /opt/apache/beam/jars/
#11 DONE 0.1s

#12 [ 8/16] COPY target/jamm.jar target/open-module-agent*.jar /opt/apache/beam/jars/
#12 DONE 0.1s

#13 [ 9/16] COPY target/linux_amd64/boot /opt/apache/beam/
#13 DONE 0.2s

#14 [10/16] COPY target/LICENSE /opt/apache/beam/
#14 DONE 0.1s

#15 [11/16] COPY target/NOTICE /opt/apache/beam/
#15 DONE 0.0s

#16 [12/16] ADD target/third_party_licenses /opt/apache/beam/third_party_licenses/
#16 DONE 0.2s

#17 [13/16] COPY target/LICENSE target/options/* /opt/apache/beam/options/
#17 DONE 0.1s

#18 [14/16] COPY target/go-licenses/* /opt/apache/beam/third_party_licenses/golang/
#18 DONE 0.1s

#19 [15/16] RUN if [ "true" = "false" ] ; then     rm -rf /opt/apache/beam/third_party_licenses ;    fi
#19 DONE 0.5s

#20 [16/16] COPY target/profiler/* /opt/google_cloud_profiler/
#20 DONE 0.1s

#21 exporting to image
#21 exporting layers
#21 exporting layers 0.2s done
#21 writing image sha256:ab84adb03d13d10bd635366898a40f61781897d3409ed94cda7b7aaa1a6fc58f done
#21 naming to docker.io/apache/beam_java8_sdk:2.51.0.dev done
#21 DONE 0.2s

> Task :runners:google-cloud-dataflow-java:buildAndPushDockerJavaContainer
WARNING: `gcloud docker` will not be supported for Docker client versions above 18.03.

As an alternative, use `gcloud auth configure-docker` to configure `docker` to
use `gcloud` as a credential helper, then use `docker` as you would for non-GCR
registries, e.g. `docker pull gcr.io/project-id/my-image`. Add
`--verbosity=error` to silence this warning: `gcloud docker
--verbosity=error -- pull gcr.io/project-id/my-image`.

See: https://cloud.google.com/container-registry/docs/support/deprecation-notices#gcloud-docker

The push refers to repository [us.gcr.io/apache-beam-testing/java-postcommit-it/java]
d9a4b82916cd: Preparing
5f70bf18a086: Preparing
3b9ea611fddf: Preparing
85929de41d75: Preparing
1eb98f6a9242: Preparing
ab5debd39c08: Preparing
d5c03c1fe81e: Preparing
c2a136844c05: Preparing
d36ce819b8f7: Preparing
cf2f3bade97f: Preparing
303dbc31cfe1: Preparing
c933d4e62393: Preparing
eb4f6744e6f1: Preparing
df48b5829015: Preparing
58d052abe06a: Preparing
cc64ed2782c8: Preparing
75d91765f4e2: Preparing
a31fc5e5e9a2: Preparing
2f3ff0b4cbda: Preparing
dc0585a4b8b7: Preparing
d5c03c1fe81e: Waiting
ab5debd39c08: Waiting
c2a136844c05: Waiting
58d052abe06a: Waiting
d36ce819b8f7: Waiting
cc64ed2782c8: Waiting
cf2f3bade97f: Waiting
75d91765f4e2: Waiting
303dbc31cfe1: Waiting
a31fc5e5e9a2: Waiting
c933d4e62393: Waiting
2f3ff0b4cbda: Waiting
eb4f6744e6f1: Waiting
df48b5829015: Waiting
5f70bf18a086: Layer already exists
ab5debd39c08: Pushed
3b9ea611fddf: Pushed
85929de41d75: Pushed
1eb98f6a9242: Pushed
d9a4b82916cd: Pushed
d36ce819b8f7: Pushed
d5c03c1fe81e: Pushed
303dbc31cfe1: Pushed
c2a136844c05: Pushed
cf2f3bade97f: Pushed
cc64ed2782c8: Layer already exists
75d91765f4e2: Layer already exists
a31fc5e5e9a2: Layer already exists
2f3ff0b4cbda: Layer already exists
c933d4e62393: Pushed
dc0585a4b8b7: Layer already exists
eb4f6744e6f1: Pushed
58d052abe06a: Pushed
df48b5829015: Pushed
20230919180141: digest: sha256:1565fb73a9a5a6bbbab865ddc299f4af7f5a6eab2fa6b3cbc358cf7f7250fc96 size: 4504

> Task :runners:google-cloud-dataflow-java:examplesJavaRunnerV2IntegrationTest

org.apache.beam.examples.cookbook.BigQueryTornadoesIT > testE2EBigQueryTornadoesWithExportUsingQuery FAILED
    java.lang.RuntimeException at BigQueryTornadoesIT.java:68

org.apache.beam.examples.cookbook.FilterExamplesIT > testE2EFilterExamples FAILED
    java.lang.RuntimeException at FilterExamplesIT.java:73

***********************************************************
***********************************************************
**********************Set Up Pubsub************************
The Pub/Sub topic has been set up for this example: projects/apache-beam-testing/topics/testpipeline-jenkins-0919180258-80d0fd53
The Pub/Sub subscription has been set up for this example: projects/apache-beam-testing/subscriptions/testpipeline-jenkins-0919180258-80d0fd53
*************************Tear Down*************************
The Pub/Sub topic has been deleted: projects/apache-beam-testing/topics/testpipeline-jenkins-0919180258-80d0fd53
The Pub/Sub subscription has been deleted: projects/apache-beam-testing/subscriptions/testpipeline-jenkins-0919180258-80d0fd53
***********************************************************
***********************************************************

org.apache.beam.examples.cookbook.BigQueryTornadoesIT > testE2EBigQueryTornadoesWithExport FAILED
    java.lang.RuntimeException at BigQueryTornadoesIT.java:68

org.apache.beam.examples.cookbook.CombinePerKeyExamplesIT > testE2ECombinePerKey FAILED
    java.lang.RuntimeException at CombinePerKeyExamplesIT.java:73

org.apache.beam.examples.cookbook.MaxPerKeyExamplesIT > testE2EMaxPerKeyExamples FAILED
    java.lang.RuntimeException at MaxPerKeyExamplesIT.java:75

org.apache.beam.examples.snippets.transforms.io.gcp.bigquery.BigQuerySamplesIT > testTableIO FAILED
    java.lang.RuntimeException at BigQuerySamplesIT.java:121

***********************************************************
***********************************************************
**********************Set Up Pubsub************************
The Pub/Sub topic has been set up for this example: projects/apache-beam-testing/topics/testpipeline-jenkins-0919180258-edfdc5ab
The Pub/Sub subscription has been set up for this example: projects/apache-beam-testing/subscriptions/testpipeline-jenkins-0919180258-edfdc5ab
*************************Tear Down*************************
The Pub/Sub topic has been deleted: projects/apache-beam-testing/topics/testpipeline-jenkins-0919180258-edfdc5ab
The Pub/Sub subscription has been deleted: projects/apache-beam-testing/subscriptions/testpipeline-jenkins-0919180258-edfdc5ab
***********************************************************
***********************************************************

org.apache.beam.examples.cookbook.JoinExamplesIT > testE2EJoinExamples FAILED
    java.lang.RuntimeException at JoinExamplesIT.java:63

13 tests completed, 7 failed

> Task :runners:google-cloud-dataflow-java:examplesJavaRunnerV2IntegrationTest FAILED

> Task :runners:google-cloud-dataflow-java:cleanUpDockerJavaImages
Untagged: us.gcr.io/apache-beam-testing/java-postcommit-it/java:20230919180141
Untagged: us.gcr.io/apache-beam-testing/java-postcommit-it/java@sha256:1565fb73a9a5a6bbbab865ddc299f4af7f5a6eab2fa6b3cbc358cf7f7250fc96
Deleted: sha256:ab84adb03d13d10bd635366898a40f61781897d3409ed94cda7b7aaa1a6fc58f
WARNING: Successfully resolved tag to sha256, but it is recommended to use sha256 directly.
Tag: [us.gcr.io/apache-beam-testing/java-postcommit-it/java:20230919180141]
- referencing digest: [us.gcr.io/apache-beam-testing/java-postcommit-it/java@sha256:1565fb73a9a5a6bbbab865ddc299f4af7f5a6eab2fa6b3cbc358cf7f7250fc96]

Deleted [[us.gcr.io/apache-beam-testing/java-postcommit-it/java:20230919180141] (referencing [us.gcr.io/apache-beam-testing/java-postcommit-it/java@sha256:1565fb73a9a5a6bbbab865ddc299f4af7f5a6eab2fa6b3cbc358cf7f7250fc96])].
Removing untagged image us.gcr.io/apache-beam-testing/java-postcommit-it/java@sha256:1565fb73a9a5a6bbbab865ddc299f4af7f5a6eab2fa6b3cbc358cf7f7250fc96

FAILURE: Build failed with an exception.

* What went wrong:
Execution failed for task ':runners:google-cloud-dataflow-java:examplesJavaRunnerV2IntegrationTest'.
> There were failing tests. See the report at: file://<https://ci-beam.apache.org/job/beam_PostCommit_Java_Examples_Dataflow_V2/ws/src/runners/google-cloud-dataflow-java/build/reports/tests/examplesJavaRunnerV2IntegrationTest/index.html>

* Try:
> Run with --stacktrace option to get the stack trace.
> Run with --info or --debug option to get more log output.

* Get more help at https://help.gradle.org

Deprecated Gradle features were used in this build, making it incompatible with Gradle 8.0.

You can use '--warning-mode all' to show the individual deprecation warnings and determine if they come from your own scripts or plugins.

See https://docs.gradle.org/7.6.2/userguide/command_line_interface.html#sec:command_line_warnings

Execution optimizations have been disabled for 1 invalid unit(s) of work during this build to ensure correctness.
Please consult deprecation warnings for more details.

BUILD FAILED in 30m 17s
124 actionable tasks: 81 executed, 39 from cache, 4 up-to-date

Publishing build scan...
https://ge.apache.org/s/e5swd2d2thgou

Build step 'Invoke Gradle script' changed build result to FAILURE
Build step 'Invoke Gradle script' marked build as failure

---------------------------------------------------------------------
To unsubscribe, e-mail: builds-unsubscribe@beam.apache.org
For additional commands, e-mail: builds-help@beam.apache.org


Build failed in Jenkins: beam_PostCommit_Java_Examples_Dataflow_V2 #4116

Posted by Apache Jenkins Server <je...@builds.apache.org>.
See <https://ci-beam.apache.org/job/beam_PostCommit_Java_Examples_Dataflow_V2/4116/display/redirect>

Changes:


------------------------------------------
[...truncated 56.25 KB...]
google.golang.org/protobuf,https://github.com/protocolbuffers/protobuf-go/blob/v1.31.0/LICENSE,BSD-3-Clause
+ chmod -R a+w /output/licenses

> Task :release:go-licenses:java:createLicenses
> Task :sdks:java:container:java8:copyGolangLicenses
> Task :sdks:java:container:java8:dockerPrepare

> Task :sdks:java:container:java8:docker
#1 [internal] load build definition from Dockerfile
#1 transferring dockerfile: 2.58kB done
#1 DONE 0.0s

#2 [internal] load .dockerignore
#2 transferring context: 2B done
#2 DONE 0.0s

#3 [internal] load metadata for docker.io/library/eclipse-temurin:8
#3 DONE 0.3s

#4 [ 1/16] FROM docker.io/library/eclipse-temurin:8@sha256:ae78c894d048567fe780b577194f3409ed56ee8cb951d82c8ce66c41de46a9e4
#4 CACHED

#5 [internal] load build context
#5 transferring context: 47.26MB 0.4s done
#5 DONE 0.4s

#6 [ 2/16] ADD target/slf4j-api.jar /opt/apache/beam/jars/
#6 DONE 1.1s

#7 [ 3/16] ADD target/slf4j-jdk14.jar /opt/apache/beam/jars/
#7 DONE 0.1s

#8 [ 4/16] ADD target/jcl-over-slf4j.jar /opt/apache/beam/jars/
#8 DONE 0.1s

#9 [ 5/16] ADD target/log4j-over-slf4j.jar /opt/apache/beam/jars/
#9 DONE 0.1s

#10 [ 6/16] ADD target/log4j-to-slf4j.jar /opt/apache/beam/jars/
#10 DONE 0.1s

#11 [ 7/16] ADD target/beam-sdks-java-harness.jar /opt/apache/beam/jars/
#11 DONE 0.1s

#12 [ 8/16] COPY target/jamm.jar target/open-module-agent*.jar /opt/apache/beam/jars/
#12 DONE 0.2s

#13 [ 9/16] COPY target/linux_amd64/boot /opt/apache/beam/
#13 DONE 0.1s

#14 [10/16] COPY target/LICENSE /opt/apache/beam/
#14 DONE 0.1s

#15 [11/16] COPY target/NOTICE /opt/apache/beam/
#15 DONE 0.0s

#16 [12/16] ADD target/third_party_licenses /opt/apache/beam/third_party_licenses/
#16 DONE 0.2s

#17 [13/16] COPY target/LICENSE target/options/* /opt/apache/beam/options/
#17 DONE 0.1s

#18 [14/16] COPY target/go-licenses/* /opt/apache/beam/third_party_licenses/golang/
#18 DONE 0.1s

#19 [15/16] RUN if [ "true" = "false" ] ; then     rm -rf /opt/apache/beam/third_party_licenses ;    fi
#19 DONE 0.3s

#20 [16/16] COPY target/profiler/* /opt/google_cloud_profiler/
#20 DONE 0.1s

#21 exporting to image
#21 exporting layers
#21 exporting layers 0.2s done
#21 writing image sha256:cbb26ec0c95eba1a1492a855b3656099b59679b495ee9b5c7e739723b9eb3d1d
#21 writing image sha256:cbb26ec0c95eba1a1492a855b3656099b59679b495ee9b5c7e739723b9eb3d1d done
#21 naming to docker.io/apache/beam_java8_sdk:2.51.0.dev done
#21 DONE 0.3s

> Task :runners:google-cloud-dataflow-java:buildAndPushDockerJavaContainer
WARNING: `gcloud docker` will not be supported for Docker client versions above 18.03.

As an alternative, use `gcloud auth configure-docker` to configure `docker` to
use `gcloud` as a credential helper, then use `docker` as you would for non-GCR
registries, e.g. `docker pull gcr.io/project-id/my-image`. Add
`--verbosity=error` to silence this warning: `gcloud docker
--verbosity=error -- pull gcr.io/project-id/my-image`.

See: https://cloud.google.com/container-registry/docs/support/deprecation-notices#gcloud-docker

The push refers to repository [us.gcr.io/apache-beam-testing/java-postcommit-it/java]
863f13794888: Preparing
5f70bf18a086: Preparing
e0ccc794c501: Preparing
c2bd46decfab: Preparing
d273ced1b531: Preparing
59bc0d7f74f8: Preparing
f7702fc88dce: Preparing
076919607003: Preparing
a2a5b0b73eed: Preparing
c0d94aac04f1: Preparing
81fd14dc9313: Preparing
a687a8d56489: Preparing
d19cbc4ea186: Preparing
981d32dee4f5: Preparing
476bba715240: Preparing
cc64ed2782c8: Preparing
75d91765f4e2: Preparing
a31fc5e5e9a2: Preparing
a2a5b0b73eed: Waiting
c0d94aac04f1: Waiting
2f3ff0b4cbda: Preparing
dc0585a4b8b7: Preparing
81fd14dc9313: Waiting
a687a8d56489: Waiting
cc64ed2782c8: Waiting
d19cbc4ea186: Waiting
75d91765f4e2: Waiting
981d32dee4f5: Waiting
476bba715240: Waiting
a31fc5e5e9a2: Waiting
59bc0d7f74f8: Waiting
f7702fc88dce: Waiting
2f3ff0b4cbda: Waiting
076919607003: Waiting
dc0585a4b8b7: Waiting
5f70bf18a086: Layer already exists
e0ccc794c501: Pushed
59bc0d7f74f8: Pushed
c2bd46decfab: Pushed
863f13794888: Pushed
d273ced1b531: Pushed
f7702fc88dce: Pushed
a2a5b0b73eed: Pushed
81fd14dc9313: Pushed
c0d94aac04f1: Pushed
076919607003: Pushed
cc64ed2782c8: Layer already exists
a687a8d56489: Pushed
75d91765f4e2: Layer already exists
a31fc5e5e9a2: Layer already exists
2f3ff0b4cbda: Layer already exists
d19cbc4ea186: Pushed
dc0585a4b8b7: Layer already exists
981d32dee4f5: Pushed
476bba715240: Pushed
20230919120140: digest: sha256:bce605a6dd3ddd6e9a325076d18d32f617672c7f3d8f0fb72b9ac0bffc70f9ea size: 4504

> Task :runners:google-cloud-dataflow-java:examplesJavaRunnerV2IntegrationTest

org.apache.beam.examples.cookbook.BigQueryTornadoesIT > testE2EBigQueryTornadoesWithExportUsingQuery FAILED
    java.lang.RuntimeException at BigQueryTornadoesIT.java:68

org.apache.beam.examples.cookbook.FilterExamplesIT > testE2EFilterExamples FAILED
    java.lang.RuntimeException at FilterExamplesIT.java:73

***********************************************************
***********************************************************
**********************Set Up Pubsub************************
The Pub/Sub topic has been set up for this example: projects/apache-beam-testing/topics/testpipeline-jenkins-0919120235-d7b135b0
The Pub/Sub subscription has been set up for this example: projects/apache-beam-testing/subscriptions/testpipeline-jenkins-0919120235-d7b135b0
*************************Tear Down*************************
The Pub/Sub topic has been deleted: projects/apache-beam-testing/topics/testpipeline-jenkins-0919120235-d7b135b0
The Pub/Sub subscription has been deleted: projects/apache-beam-testing/subscriptions/testpipeline-jenkins-0919120235-d7b135b0
***********************************************************
***********************************************************

org.apache.beam.examples.cookbook.BigQueryTornadoesIT > testE2EBigQueryTornadoesWithExport FAILED
    java.lang.RuntimeException at BigQueryTornadoesIT.java:68

org.apache.beam.examples.cookbook.CombinePerKeyExamplesIT > testE2ECombinePerKey FAILED
    java.lang.RuntimeException at CombinePerKeyExamplesIT.java:73

org.apache.beam.examples.cookbook.MaxPerKeyExamplesIT > testE2EMaxPerKeyExamples FAILED
    java.lang.RuntimeException at MaxPerKeyExamplesIT.java:75

org.apache.beam.examples.snippets.transforms.io.gcp.bigquery.BigQuerySamplesIT > testTableIO FAILED
    java.lang.RuntimeException at BigQuerySamplesIT.java:121

***********************************************************
***********************************************************
**********************Set Up Pubsub************************
The Pub/Sub topic has been set up for this example: projects/apache-beam-testing/topics/testpipeline-jenkins-0919120235-92ef6e0
The Pub/Sub subscription has been set up for this example: projects/apache-beam-testing/subscriptions/testpipeline-jenkins-0919120235-92ef6e0
*************************Tear Down*************************
The Pub/Sub topic has been deleted: projects/apache-beam-testing/topics/testpipeline-jenkins-0919120235-92ef6e0
The Pub/Sub subscription has been deleted: projects/apache-beam-testing/subscriptions/testpipeline-jenkins-0919120235-92ef6e0
***********************************************************
***********************************************************

org.apache.beam.examples.cookbook.JoinExamplesIT > testE2EJoinExamples FAILED
    java.lang.RuntimeException at JoinExamplesIT.java:63

13 tests completed, 7 failed

> Task :runners:google-cloud-dataflow-java:examplesJavaRunnerV2IntegrationTest FAILED

> Task :runners:google-cloud-dataflow-java:cleanUpDockerJavaImages
Untagged: us.gcr.io/apache-beam-testing/java-postcommit-it/java:20230919120140
Untagged: us.gcr.io/apache-beam-testing/java-postcommit-it/java@sha256:bce605a6dd3ddd6e9a325076d18d32f617672c7f3d8f0fb72b9ac0bffc70f9ea
WARNING: Successfully resolved tag to sha256, but it is recommended to use sha256 directly.
Tag: [us.gcr.io/apache-beam-testing/java-postcommit-it/java:20230919120140]
- referencing digest: [us.gcr.io/apache-beam-testing/java-postcommit-it/java@sha256:bce605a6dd3ddd6e9a325076d18d32f617672c7f3d8f0fb72b9ac0bffc70f9ea]

Deleted [[us.gcr.io/apache-beam-testing/java-postcommit-it/java:20230919120140] (referencing [us.gcr.io/apache-beam-testing/java-postcommit-it/java@sha256:bce605a6dd3ddd6e9a325076d18d32f617672c7f3d8f0fb72b9ac0bffc70f9ea])].
Removing untagged image us.gcr.io/apache-beam-testing/java-postcommit-it/java@sha256:bce605a6dd3ddd6e9a325076d18d32f617672c7f3d8f0fb72b9ac0bffc70f9ea

FAILURE: Build failed with an exception.

* What went wrong:
Execution failed for task ':runners:google-cloud-dataflow-java:examplesJavaRunnerV2IntegrationTest'.
> There were failing tests. See the report at: file://<https://ci-beam.apache.org/job/beam_PostCommit_Java_Examples_Dataflow_V2/ws/src/runners/google-cloud-dataflow-java/build/reports/tests/examplesJavaRunnerV2IntegrationTest/index.html>

* Try:
> Run with --stacktrace option to get the stack trace.
> Run with --info or --debug option to get more log output.

* Get more help at https://help.gradle.org

Deprecated Gradle features were used in this build, making it incompatible with Gradle 8.0.

You can use '--warning-mode all' to show the individual deprecation warnings and determine if they come from your own scripts or plugins.

See https://docs.gradle.org/7.6.2/userguide/command_line_interface.html#sec:command_line_warnings

Execution optimizations have been disabled for 1 invalid unit(s) of work during this build to ensure correctness.
Please consult deprecation warnings for more details.

BUILD FAILED in 27m 46s
124 actionable tasks: 81 executed, 39 from cache, 4 up-to-date

Publishing build scan...
Publishing build scan failed due to network error 'java.net.SocketTimeoutException: Read timed out' (2 retries remaining)...
Publishing build scan failed due to network error 'java.net.SocketTimeoutException: Read timed out' (1 retry remaining)...

A network error occurred.

If you require assistance with this problem, please report it to your Gradle Enterprise administrator and include the following information via copy/paste.

----------
Gradle version: 7.6.2
Plugin version: 3.13.2
Request URL: https://ge.apache.org/scans/publish/gradle/3.13.2/upload
Request ID: 4c9f27a1-0264-4a3d-b9da-792ed1882564
Exception: java.net.SocketTimeoutException: Read timed out
----------

Build step 'Invoke Gradle script' changed build result to FAILURE
Build step 'Invoke Gradle script' marked build as failure

---------------------------------------------------------------------
To unsubscribe, e-mail: builds-unsubscribe@beam.apache.org
For additional commands, e-mail: builds-help@beam.apache.org


Build failed in Jenkins: beam_PostCommit_Java_Examples_Dataflow_V2 #4115

Posted by Apache Jenkins Server <je...@builds.apache.org>.
See <https://ci-beam.apache.org/job/beam_PostCommit_Java_Examples_Dataflow_V2/4115/display/redirect>

Changes:


------------------------------------------
[...truncated 56.06 KB...]
google.golang.org/genproto/googleapis/rpc/status,https://github.com/googleapis/go-genproto/blob/23370e0ffb3e/googleapis/rpc/LICENSE,Apache-2.0
google.golang.org/grpc,https://github.com/grpc/grpc-go/blob/v1.57.0/LICENSE,Apache-2.0
google.golang.org/protobuf,https://github.com/protocolbuffers/protobuf-go/blob/v1.31.0/LICENSE,BSD-3-Clause
+ chmod -R a+w /output/licenses

> Task :release:go-licenses:java:createLicenses
> Task :sdks:java:container:java8:copyGolangLicenses
> Task :sdks:java:container:java8:dockerPrepare

> Task :sdks:java:container:java8:docker
#1 [internal] load build definition from Dockerfile
#1 transferring dockerfile: 2.58kB done
#1 DONE 0.0s

#2 [internal] load .dockerignore
#2 transferring context: 2B done
#2 DONE 0.0s

#3 [internal] load metadata for docker.io/library/eclipse-temurin:8
#3 DONE 0.3s

#4 [ 1/16] FROM docker.io/library/eclipse-temurin:8@sha256:ae78c894d048567fe780b577194f3409ed56ee8cb951d82c8ce66c41de46a9e4
#4 CACHED

#5 [internal] load build context
#5 transferring context: 47.26MB 0.3s done
#5 DONE 0.4s

#6 [ 2/16] ADD target/slf4j-api.jar /opt/apache/beam/jars/
#6 DONE 1.1s

#7 [ 3/16] ADD target/slf4j-jdk14.jar /opt/apache/beam/jars/
#7 DONE 0.0s

#8 [ 4/16] ADD target/jcl-over-slf4j.jar /opt/apache/beam/jars/
#8 DONE 0.1s

#9 [ 5/16] ADD target/log4j-over-slf4j.jar /opt/apache/beam/jars/
#9 DONE 0.1s

#10 [ 6/16] ADD target/log4j-to-slf4j.jar /opt/apache/beam/jars/
#10 DONE 0.1s

#11 [ 7/16] ADD target/beam-sdks-java-harness.jar /opt/apache/beam/jars/
#11 DONE 0.1s

#12 [ 8/16] COPY target/jamm.jar target/open-module-agent*.jar /opt/apache/beam/jars/
#12 DONE 0.1s

#13 [ 9/16] COPY target/linux_amd64/boot /opt/apache/beam/
#13 DONE 0.2s

#14 [10/16] COPY target/LICENSE /opt/apache/beam/
#14 DONE 0.1s

#15 [11/16] COPY target/NOTICE /opt/apache/beam/
#15 DONE 0.1s

#16 [12/16] ADD target/third_party_licenses /opt/apache/beam/third_party_licenses/
#16 DONE 0.2s

#17 [13/16] COPY target/LICENSE target/options/* /opt/apache/beam/options/
#17 DONE 0.1s

#18 [14/16] COPY target/go-licenses/* /opt/apache/beam/third_party_licenses/golang/
#18 DONE 0.1s

#19 [15/16] RUN if [ "true" = "false" ] ; then     rm -rf /opt/apache/beam/third_party_licenses ;    fi
#19 DONE 0.3s

#20 [16/16] COPY target/profiler/* /opt/google_cloud_profiler/
#20 DONE 0.1s

#21 exporting to image
#21 exporting layers
#21 exporting layers 0.2s done
#21 writing image sha256:f9a1d5aaaa5143e538bc52e3d2d54d5b078486dbdfb9234a22d86c8caedc0539 done
#21 naming to docker.io/apache/beam_java8_sdk:2.51.0.dev done
#21 DONE 0.2s

> Task :runners:google-cloud-dataflow-java:buildAndPushDockerJavaContainer
WARNING: `gcloud docker` will not be supported for Docker client versions above 18.03.

As an alternative, use `gcloud auth configure-docker` to configure `docker` to
use `gcloud` as a credential helper, then use `docker` as you would for non-GCR
registries, e.g. `docker pull gcr.io/project-id/my-image`. Add
`--verbosity=error` to silence this warning: `gcloud docker
--verbosity=error -- pull gcr.io/project-id/my-image`.

See: https://cloud.google.com/container-registry/docs/support/deprecation-notices#gcloud-docker

The push refers to repository [us.gcr.io/apache-beam-testing/java-postcommit-it/java]
da19b812bc57: Preparing
5f70bf18a086: Preparing
550a932377c9: Preparing
4f39c49026c0: Preparing
7e198c6aef86: Preparing
00bbd0461efb: Preparing
76cabfd1bfad: Preparing
ec8064a77efb: Preparing
b8c6367b0016: Preparing
2f00bf80c7d2: Preparing
54a665ac841b: Preparing
204e8039aca0: Preparing
10248815dcdd: Preparing
c872824583d0: Preparing
c12381e1d048: Preparing
cc64ed2782c8: Preparing
75d91765f4e2: Preparing
a31fc5e5e9a2: Preparing
2f3ff0b4cbda: Preparing
dc0585a4b8b7: Preparing
00bbd0461efb: Waiting
c872824583d0: Waiting
76cabfd1bfad: Waiting
c12381e1d048: Waiting
2f3ff0b4cbda: Waiting
ec8064a77efb: Waiting
dc0585a4b8b7: Waiting
cc64ed2782c8: Waiting
2f00bf80c7d2: Waiting
75d91765f4e2: Waiting
204e8039aca0: Waiting
54a665ac841b: Waiting
a31fc5e5e9a2: Waiting
10248815dcdd: Waiting
5f70bf18a086: Layer already exists
4f39c49026c0: Pushed
550a932377c9: Pushed
00bbd0461efb: Pushed
7e198c6aef86: Pushed
da19b812bc57: Pushed
76cabfd1bfad: Pushed
b8c6367b0016: Pushed
54a665ac841b: Pushed
2f00bf80c7d2: Pushed
ec8064a77efb: Pushed
cc64ed2782c8: Layer already exists
204e8039aca0: Pushed
75d91765f4e2: Layer already exists
2f3ff0b4cbda: Layer already exists
a31fc5e5e9a2: Layer already exists
dc0585a4b8b7: Layer already exists
10248815dcdd: Pushed
c12381e1d048: Pushed
c872824583d0: Pushed
20230919060140: digest: sha256:35d8856782a33e60558e4ccbd2a130897618b32fd984f901bfb70bfc816deac4 size: 4504

> Task :runners:google-cloud-dataflow-java:examplesJavaRunnerV2IntegrationTest

org.apache.beam.examples.cookbook.BigQueryTornadoesIT > testE2EBigQueryTornadoesWithExportUsingQuery FAILED
    java.lang.RuntimeException at BigQueryTornadoesIT.java:68

org.apache.beam.examples.cookbook.FilterExamplesIT > testE2EFilterExamples FAILED
    java.lang.RuntimeException at FilterExamplesIT.java:73

***********************************************************
***********************************************************
**********************Set Up Pubsub************************
The Pub/Sub topic has been set up for this example: projects/apache-beam-testing/topics/testpipeline-jenkins-0919060235-e5fd59a6
The Pub/Sub subscription has been set up for this example: projects/apache-beam-testing/subscriptions/testpipeline-jenkins-0919060235-e5fd59a6
*************************Tear Down*************************
The Pub/Sub topic has been deleted: projects/apache-beam-testing/topics/testpipeline-jenkins-0919060235-e5fd59a6
The Pub/Sub subscription has been deleted: projects/apache-beam-testing/subscriptions/testpipeline-jenkins-0919060235-e5fd59a6
***********************************************************
***********************************************************

org.apache.beam.examples.cookbook.BigQueryTornadoesIT > testE2EBigQueryTornadoesWithExport FAILED
    java.lang.RuntimeException at BigQueryTornadoesIT.java:68

org.apache.beam.examples.cookbook.CombinePerKeyExamplesIT > testE2ECombinePerKey FAILED
    java.lang.RuntimeException at CombinePerKeyExamplesIT.java:73

org.apache.beam.examples.cookbook.MaxPerKeyExamplesIT > testE2EMaxPerKeyExamples FAILED
    java.lang.RuntimeException at MaxPerKeyExamplesIT.java:75

org.apache.beam.examples.snippets.transforms.io.gcp.bigquery.BigQuerySamplesIT > testTableIO FAILED
    java.lang.RuntimeException at BigQuerySamplesIT.java:121

***********************************************************
***********************************************************
**********************Set Up Pubsub************************
The Pub/Sub topic has been set up for this example: projects/apache-beam-testing/topics/testpipeline-jenkins-0919060235-db75b795
The Pub/Sub subscription has been set up for this example: projects/apache-beam-testing/subscriptions/testpipeline-jenkins-0919060235-db75b795
*************************Tear Down*************************
The Pub/Sub topic has been deleted: projects/apache-beam-testing/topics/testpipeline-jenkins-0919060235-db75b795
The Pub/Sub subscription has been deleted: projects/apache-beam-testing/subscriptions/testpipeline-jenkins-0919060235-db75b795
***********************************************************
***********************************************************

org.apache.beam.examples.cookbook.JoinExamplesIT > testE2EJoinExamples FAILED
    java.lang.RuntimeException at JoinExamplesIT.java:63

13 tests completed, 7 failed

> Task :runners:google-cloud-dataflow-java:examplesJavaRunnerV2IntegrationTest FAILED

> Task :runners:google-cloud-dataflow-java:cleanUpDockerJavaImages
Untagged: us.gcr.io/apache-beam-testing/java-postcommit-it/java:20230919060140
Untagged: us.gcr.io/apache-beam-testing/java-postcommit-it/java@sha256:35d8856782a33e60558e4ccbd2a130897618b32fd984f901bfb70bfc816deac4
WARNING: Successfully resolved tag to sha256, but it is recommended to use sha256 directly.
Tag: [us.gcr.io/apache-beam-testing/java-postcommit-it/java:20230919060140]
- referencing digest: [us.gcr.io/apache-beam-testing/java-postcommit-it/java@sha256:35d8856782a33e60558e4ccbd2a130897618b32fd984f901bfb70bfc816deac4]

Deleted [[us.gcr.io/apache-beam-testing/java-postcommit-it/java:20230919060140] (referencing [us.gcr.io/apache-beam-testing/java-postcommit-it/java@sha256:35d8856782a33e60558e4ccbd2a130897618b32fd984f901bfb70bfc816deac4])].
Removing untagged image us.gcr.io/apache-beam-testing/java-postcommit-it/java@sha256:35d8856782a33e60558e4ccbd2a130897618b32fd984f901bfb70bfc816deac4

FAILURE: Build failed with an exception.

* What went wrong:
Execution failed for task ':runners:google-cloud-dataflow-java:examplesJavaRunnerV2IntegrationTest'.
> There were failing tests. See the report at: file://<https://ci-beam.apache.org/job/beam_PostCommit_Java_Examples_Dataflow_V2/ws/src/runners/google-cloud-dataflow-java/build/reports/tests/examplesJavaRunnerV2IntegrationTest/index.html>

* Try:
> Run with --stacktrace option to get the stack trace.
> Run with --info or --debug option to get more log output.

* Get more help at https://help.gradle.org

Deprecated Gradle features were used in this build, making it incompatible with Gradle 8.0.

You can use '--warning-mode all' to show the individual deprecation warnings and determine if they come from your own scripts or plugins.

See https://docs.gradle.org/7.6.2/userguide/command_line_interface.html#sec:command_line_warnings

Execution optimizations have been disabled for 1 invalid unit(s) of work during this build to ensure correctness.
Please consult deprecation warnings for more details.

BUILD FAILED in 29m 2s
124 actionable tasks: 81 executed, 39 from cache, 4 up-to-date

Publishing build scan...
Publishing build scan failed due to network error 'java.net.SocketTimeoutException: Read timed out' (2 retries remaining)...
Publishing build scan failed due to network error 'java.net.SocketTimeoutException: Read timed out' (1 retry remaining)...

A network error occurred.

If you require assistance with this problem, please report it to your Gradle Enterprise administrator and include the following information via copy/paste.

----------
Gradle version: 7.6.2
Plugin version: 3.13.2
Request URL: https://ge.apache.org/scans/publish/gradle/3.13.2/upload
Request ID: 7e6ee210-2550-4e23-829e-d1a0b2226469
Exception: java.net.SocketTimeoutException: Read timed out
----------

Build step 'Invoke Gradle script' changed build result to FAILURE
Build step 'Invoke Gradle script' marked build as failure

---------------------------------------------------------------------
To unsubscribe, e-mail: builds-unsubscribe@beam.apache.org
For additional commands, e-mail: builds-help@beam.apache.org