You are viewing a plain text version of this content. The canonical link for it is here.
Posted to dev@hama.apache.org by Apache Hudson Server <hu...@hudson.apache.org> on 2011/01/29 00:02:43 UTC
Build failed in Hudson: Hama-Nightly #92
See <https://hudson.apache.org/hudson/job/Hama-Nightly/92/changes>
Changes:
[edwardyoon] Small changes: removing unnecessary method.
------------------------------------------
Started by timer
Building remotely on solaris2
Updating http://svn.apache.org/repos/asf/incubator/hama/trunk
U src/test/org/apache/hama/bsp/TestBSPPeer.java
U src/java/org/apache/hama/bsp/BSPJob.java
At revision 1064921
[trunk] $ /home/hudson/tools/ant/latest/bin/ant clean package test
Buildfile: build.xml
clean:
[delete] Deleting directory /zonestorage/hudson<https://hudson.apache.org/hudson/job/Hama-Nightly/ws/trunk/build>
init:
[mkdir] Created dir: /zonestorage/hudson<https://hudson.apache.org/hudson/job/Hama-Nightly/ws/trunk/build>
[mkdir] Created dir: /zonestorage/hudson<https://hudson.apache.org/hudson/job/Hama-Nightly/ws/trunk/build/classes>
[mkdir] Created dir: /zonestorage/hudson<https://hudson.apache.org/hudson/job/Hama-Nightly/ws/trunk/build/test>
[mkdir] Created dir: /zonestorage/hudson<https://hudson.apache.org/hudson/job/Hama-Nightly/ws/trunk/build/examples>
[mkdir] Created dir: /zonestorage/hudson<https://hudson.apache.org/hudson/job/Hama-Nightly/ws/trunk/build/reports/findbugs>
[mkdir] Created dir: /zonestorage/hudson<https://hudson.apache.org/hudson/job/Hama-Nightly/ws/trunk/build/reports/tests>
[mkdir] Created dir: /zonestorage/hudson<https://hudson.apache.org/hudson/job/Hama-Nightly/ws/trunk/build/lib>
[copy] Copying 48 files to /zonestorage/hudson<https://hudson.apache.org/hudson/job/Hama-Nightly/ws/trunk/build/lib>
compile:
[mkdir] Created dir: /zonestorage/hudson<https://hudson.apache.org/hudson/job/Hama-Nightly/ws/trunk/build/src>
[javac] Compiling 69 source files to /zonestorage/hudson<https://hudson.apache.org/hudson/job/Hama-Nightly/ws/trunk/build/classes>
[javac] Note: /zonestorage/hudson<https://hudson.apache.org/hudson/job/Hama-Nightly/ws/trunk/src/java/org/apache/hama/bsp/GroomServer.java> uses or overrides a deprecated API.
[javac] Note: Recompile with -Xlint:deprecation for details.
jar:
[jar] Building jar: /zonestorage/hudson<https://hudson.apache.org/hudson/job/Hama-Nightly/ws/trunk/build/hama-0.2.0-dev.jar>
javadoc:
[mkdir] Created dir: /zonestorage/hudson<https://hudson.apache.org/hudson/job/Hama-Nightly/ws/trunk/build/docs/site/api>
[javadoc] Generating Javadoc
[javadoc] Javadoc execution
[javadoc] Loading source files for package org.apache.hama...
[javadoc] Loading source files for package org.apache.hama.bsp...
[javadoc] Loading source files for package org.apache.hama.ipc...
[javadoc] Loading source files for package org.apache.hama.util...
[javadoc] Loading source files for package org.apache.hama.zookeeper...
[javadoc] Constructing Javadoc information...
[javadoc] Standard Doclet version 1.6.0_22
[javadoc] Building tree for all the packages and classes...
[javadoc] Building index for all the packages and classes...
[javadoc] Building index for all classes...
compile-examples:
[javac] Compiling 3 source files to /zonestorage/hudson<https://hudson.apache.org/hudson/job/Hama-Nightly/ws/trunk/build/examples>
examples:
[jar] Building jar: /zonestorage/hudson<https://hudson.apache.org/hudson/job/Hama-Nightly/ws/trunk/build/hama-0.2.0-dev-examples.jar>
compile-test:
[javac] Compiling 15 source files to /zonestorage/hudson<https://hudson.apache.org/hudson/job/Hama-Nightly/ws/trunk/build/test>
[jar] Building jar: /zonestorage/hudson<https://hudson.apache.org/hudson/job/Hama-Nightly/ws/trunk/build/hama-0.2.0-dev-test.jar>
package:
[mkdir] Created dir: /zonestorage/hudson<https://hudson.apache.org/hudson/job/Hama-Nightly/ws/trunk/build/hama-0.2.0-dev>
[copy] Copying 2 files to /zonestorage/hudson<https://hudson.apache.org/hudson/job/Hama-Nightly/ws/trunk/build/hama-0.2.0-dev>
[mkdir] Created dir: /zonestorage/hudson<https://hudson.apache.org/hudson/job/Hama-Nightly/ws/trunk/build/hama-0.2.0-dev/lib>
[copy] Copying 48 files to /zonestorage/hudson<https://hudson.apache.org/hudson/job/Hama-Nightly/ws/trunk/build/hama-0.2.0-dev/lib>
[copy] Copying 3 files to /zonestorage/hudson<https://hudson.apache.org/hudson/job/Hama-Nightly/ws/trunk/build/hama-0.2.0-dev>
[mkdir] Created dir: /zonestorage/hudson<https://hudson.apache.org/hudson/job/Hama-Nightly/ws/trunk/build/hama-0.2.0-dev/src>
[copy] Copying 112 files to /zonestorage/hudson<https://hudson.apache.org/hudson/job/Hama-Nightly/ws/trunk/build/hama-0.2.0-dev/src>
[copy] Copied 29 empty directories to 1 empty directory under /zonestorage/hudson<https://hudson.apache.org/hudson/job/Hama-Nightly/ws/trunk/build/hama-0.2.0-dev/src>
init:
compile:
compile-test:
test:
[junit] WARNING: multiple versions of ant detected in path for junit
[junit] jar:file:/home/hudson/tools/ant/latest/lib/ant.jar!/org/apache/tools/ant/Project.class
[junit] and jar:file:/zonestorage/hudson<https://hudson.apache.org/hudson/job/Hama-Nightly/ws/trunk/lib/findbugs/ant.jar!/org/apache/tools/ant/Project.class>
[junit] Running org.apache.hama.bsp.TestBSPMaster
[junit] Tests run: 1, Failures: 0, Errors: 0, Time elapsed: 17.657 sec
[junit] Running org.apache.hama.bsp.TestBSPPeer
[junit] Tests run: 1, Failures: 0, Errors: 1, Time elapsed: 14.296 sec
[junit] Test org.apache.hama.bsp.TestBSPPeer FAILED
[junit] Running org.apache.hama.bsp.TestClusterStatus
[junit] Tests run: 1, Failures: 0, Errors: 0, Time elapsed: 0.146 sec
[junit] Running org.apache.hama.bsp.TestDirective
[junit] Tests run: 2, Failures: 0, Errors: 0, Time elapsed: 0.046 sec
[junit] Running org.apache.hama.bsp.TestSerializePrinting
[junit] Tests run: 1, Failures: 0, Errors: 0, Time elapsed: 10.232 sec
[junit] Running org.apache.hama.ipc.TestIPC
[junit] Tests run: 3, Failures: 0, Errors: 0, Time elapsed: 11.618 sec
[junit] Running org.apache.hama.ipc.TestRPC
[junit] Tests run: 1, Failures: 0, Errors: 0, Time elapsed: 0.617 sec
[junit] Running org.apache.hama.util.TestBytes
[junit] Tests run: 8, Failures: 0, Errors: 0, Time elapsed: 0.132 sec
[junit] Running org.apache.hama.util.TestNumeric
[junit] Tests run: 1, Failures: 0, Errors: 0, Time elapsed: 0.122 sec
[junit] Running org.apache.hama.util.TestRandomVariable
[junit] Tests run: 3, Failures: 0, Errors: 0, Time elapsed: 0.009 sec
BUILD FAILED
/zonestorage/hudson<https://hudson.apache.org/hudson/job/Hama-Nightly/ws/trunk/build.xml>:295: Tests failed!
Total time: 1 minute 18 seconds
Hudson build is back to normal : Hama-Nightly #94
Posted by Apache Hudson Server <hu...@hudson.apache.org>.
See <https://hudson.apache.org/hudson/job/Hama-Nightly/94/changes>
Build failed in Hudson: Hama-Nightly #93
Posted by Apache Hudson Server <hu...@hudson.apache.org>.
See <https://hudson.apache.org/hudson/job/Hama-Nightly/93/>
------------------------------------------
Started by timer
Building remotely on solaris2
Updating http://svn.apache.org/repos/asf/incubator/hama/trunk
At revision 1065139
no change for http://svn.apache.org/repos/asf/incubator/hama/trunk since the previous build
[trunk] $ /home/hudson/tools/ant/latest/bin/ant clean package test
Buildfile: build.xml
clean:
[delete] Deleting directory /zonestorage/hudson<https://hudson.apache.org/hudson/job/Hama-Nightly/ws/trunk/build>
init:
[mkdir] Created dir: /zonestorage/hudson<https://hudson.apache.org/hudson/job/Hama-Nightly/ws/trunk/build>
[mkdir] Created dir: /zonestorage/hudson<https://hudson.apache.org/hudson/job/Hama-Nightly/ws/trunk/build/classes>
[mkdir] Created dir: /zonestorage/hudson<https://hudson.apache.org/hudson/job/Hama-Nightly/ws/trunk/build/test>
[mkdir] Created dir: /zonestorage/hudson<https://hudson.apache.org/hudson/job/Hama-Nightly/ws/trunk/build/examples>
[mkdir] Created dir: /zonestorage/hudson<https://hudson.apache.org/hudson/job/Hama-Nightly/ws/trunk/build/reports/findbugs>
[mkdir] Created dir: /zonestorage/hudson<https://hudson.apache.org/hudson/job/Hama-Nightly/ws/trunk/build/reports/tests>
[mkdir] Created dir: /zonestorage/hudson<https://hudson.apache.org/hudson/job/Hama-Nightly/ws/trunk/build/lib>
[copy] Copying 48 files to /zonestorage/hudson<https://hudson.apache.org/hudson/job/Hama-Nightly/ws/trunk/build/lib>
compile:
[mkdir] Created dir: /zonestorage/hudson<https://hudson.apache.org/hudson/job/Hama-Nightly/ws/trunk/build/src>
[javac] Compiling 69 source files to /zonestorage/hudson<https://hudson.apache.org/hudson/job/Hama-Nightly/ws/trunk/build/classes>
[javac] Note: /zonestorage/hudson<https://hudson.apache.org/hudson/job/Hama-Nightly/ws/trunk/src/java/org/apache/hama/bsp/GroomServer.java> uses or overrides a deprecated API.
[javac] Note: Recompile with -Xlint:deprecation for details.
jar:
[jar] Building jar: /zonestorage/hudson<https://hudson.apache.org/hudson/job/Hama-Nightly/ws/trunk/build/hama-0.2.0-dev.jar>
javadoc:
[mkdir] Created dir: /zonestorage/hudson<https://hudson.apache.org/hudson/job/Hama-Nightly/ws/trunk/build/docs/site/api>
[javadoc] Generating Javadoc
[javadoc] Javadoc execution
[javadoc] Loading source files for package org.apache.hama...
[javadoc] Loading source files for package org.apache.hama.bsp...
[javadoc] Loading source files for package org.apache.hama.ipc...
[javadoc] Loading source files for package org.apache.hama.util...
[javadoc] Loading source files for package org.apache.hama.zookeeper...
[javadoc] Constructing Javadoc information...
[javadoc] Standard Doclet version 1.6.0_22
[javadoc] Building tree for all the packages and classes...
[javadoc] Building index for all the packages and classes...
[javadoc] Building index for all classes...
compile-examples:
[javac] Compiling 3 source files to /zonestorage/hudson<https://hudson.apache.org/hudson/job/Hama-Nightly/ws/trunk/build/examples>
examples:
[jar] Building jar: /zonestorage/hudson<https://hudson.apache.org/hudson/job/Hama-Nightly/ws/trunk/build/hama-0.2.0-dev-examples.jar>
compile-test:
[javac] Compiling 15 source files to /zonestorage/hudson<https://hudson.apache.org/hudson/job/Hama-Nightly/ws/trunk/build/test>
[jar] Building jar: /zonestorage/hudson<https://hudson.apache.org/hudson/job/Hama-Nightly/ws/trunk/build/hama-0.2.0-dev-test.jar>
package:
[mkdir] Created dir: /zonestorage/hudson<https://hudson.apache.org/hudson/job/Hama-Nightly/ws/trunk/build/hama-0.2.0-dev>
[copy] Copying 2 files to /zonestorage/hudson<https://hudson.apache.org/hudson/job/Hama-Nightly/ws/trunk/build/hama-0.2.0-dev>
[mkdir] Created dir: /zonestorage/hudson<https://hudson.apache.org/hudson/job/Hama-Nightly/ws/trunk/build/hama-0.2.0-dev/lib>
[copy] Copying 48 files to /zonestorage/hudson<https://hudson.apache.org/hudson/job/Hama-Nightly/ws/trunk/build/hama-0.2.0-dev/lib>
[copy] Copying 3 files to /zonestorage/hudson<https://hudson.apache.org/hudson/job/Hama-Nightly/ws/trunk/build/hama-0.2.0-dev>
[mkdir] Created dir: /zonestorage/hudson<https://hudson.apache.org/hudson/job/Hama-Nightly/ws/trunk/build/hama-0.2.0-dev/src>
[copy] Copying 112 files to /zonestorage/hudson<https://hudson.apache.org/hudson/job/Hama-Nightly/ws/trunk/build/hama-0.2.0-dev/src>
[copy] Copied 29 empty directories to 1 empty directory under /zonestorage/hudson<https://hudson.apache.org/hudson/job/Hama-Nightly/ws/trunk/build/hama-0.2.0-dev/src>
init:
compile:
compile-test:
test:
[junit] WARNING: multiple versions of ant detected in path for junit
[junit] jar:file:/home/hudson/tools/ant/latest/lib/ant.jar!/org/apache/tools/ant/Project.class
[junit] and jar:file:/zonestorage/hudson<https://hudson.apache.org/hudson/job/Hama-Nightly/ws/trunk/lib/findbugs/ant.jar!/org/apache/tools/ant/Project.class>
[junit] Running org.apache.hama.bsp.TestBSPMaster
[junit] Tests run: 1, Failures: 0, Errors: 0, Time elapsed: 18.215 sec
[junit] Running org.apache.hama.bsp.TestBSPPeer
[junit] Tests run: 1, Failures: 0, Errors: 1, Time elapsed: 13.469 sec
[junit] Test org.apache.hama.bsp.TestBSPPeer FAILED
[junit] Running org.apache.hama.bsp.TestClusterStatus
[junit] Tests run: 1, Failures: 0, Errors: 0, Time elapsed: 0.138 sec
[junit] Running org.apache.hama.bsp.TestDirective
[junit] Tests run: 2, Failures: 0, Errors: 0, Time elapsed: 0.045 sec
[junit] Running org.apache.hama.bsp.TestSerializePrinting
[junit] Tests run: 1, Failures: 0, Errors: 0, Time elapsed: 12.367 sec
[junit] Running org.apache.hama.ipc.TestIPC
[junit] Tests run: 3, Failures: 0, Errors: 0, Time elapsed: 11.657 sec
[junit] Running org.apache.hama.ipc.TestRPC
[junit] Tests run: 1, Failures: 0, Errors: 0, Time elapsed: 0.632 sec
[junit] Running org.apache.hama.util.TestBytes
[junit] Tests run: 8, Failures: 0, Errors: 0, Time elapsed: 0.133 sec
[junit] Running org.apache.hama.util.TestNumeric
[junit] Tests run: 1, Failures: 0, Errors: 0, Time elapsed: 0.125 sec
[junit] Running org.apache.hama.util.TestRandomVariable
[junit] Tests run: 3, Failures: 0, Errors: 0, Time elapsed: 0.009 sec
BUILD FAILED
/zonestorage/hudson<https://hudson.apache.org/hudson/job/Hama-Nightly/ws/trunk/build.xml>:295: Tests failed!
Total time: 1 minute 20 seconds