You are viewing a plain text version of this content. The canonical link for it is here.
Posted to dev@poi.apache.org by Apache Jenkins Server <je...@builds.apache.org> on 2021/08/20 20:06:29 UTC

Build failed in Jenkins: POI » POI-DSL-Windows-1.16 #121

See <https://ci-builds.apache.org/job/POI/job/POI-DSL-Windows-1.16/121/display/redirect?page=changes>

Changes:

[Andreas Beeker] try to fix path issues in Windows build


------------------------------------------
[...truncated 1.72 KB...]

<-- Got one external: documentation, svn url: https://svn.apache.org/repos/asf/poi/site/src/documentation -->
Fetching 'https://svn.apache.org/repos/asf/poi/site/src/documentation' at -1 into 'F:\jenkins\jenkins-slave\712657a4\workspace\POI\POI-DSL-Windows-1.16\src\documentation'
U         src\documentation\content\xdocs\changes.xml
At revision 1892479

At revision 1892479

No changes for https://svn.apache.org/repos/asf/poi/site/forrest.properties since the previous build
No changes for https://svn.apache.org/repos/asf/poi/site/src/documentation since the previous build
[POI-DSL-Windows-1.16] $ cmd /c call F:\jenkins\jenkins-slave\temp\jenkins2452822750662280851.bat
    X   forrest.properties
M       poi\src\main\java9\module-info.class
C       poi-examples\src\main\java9\module-info.class
?       poi-examples\src\main\java9\module-info.class.r1891468
?       poi-examples\src\main\java9\module-info.class.r1891476
C       poi-ooxml\src\main\java9\module-info.class
?       poi-ooxml\src\main\java9\module-info.class.r1891321
?       poi-ooxml\src\main\java9\module-info.class.r1891468
C       poi-ooxml\src\test\java9\module-info.class
?       poi-ooxml\src\test\java9\module-info.class.r1891321
?       poi-ooxml\src\test\java9\module-info.class.r1891468
C       poi-ooxml-full\src\main\java9\module-info.class
?       poi-ooxml-full\src\main\java9\module-info.class.r1891321
?       poi-ooxml-full\src\main\java9\module-info.class.r1891468
M       poi-ooxml-lite\src\main\java9\module-info.class
M       poi-ooxml-lite\src\main\java9\module-info.java
C       poi-ooxml-lite-agent\src\main\java9\module-info.class
?       poi-ooxml-lite-agent\src\main\java9\module-info.class.r1891321
?       poi-ooxml-lite-agent\src\main\java9\module-info.class.r1891468
M       poi-scratchpad\src\main\java9\module-info.class
X       src\documentation

Performing status on external item at 'src\documentation':
Summary of conflicts:
  Text conflicts: 5
svn: E155010: The node 'F:\jenkins\jenkins-slave\712657a4\workspace\POI\POI-DSL-Windows-1.16\poi*\src\*' was not found.
Java-Home: f:\\jenkins\\tools\\java\\latest16
 Volume in drive F is data
 Volume Serial Number is FEB9-6BE4

 Directory of f:\jenkins\tools\java\latest16

12/18/2020  02:29 PM    <DIR>          .
12/18/2020  02:29 PM    <DIR>          ..
12/18/2020  02:28 PM    <DIR>          bin
12/18/2020  02:28 PM    <DIR>          conf
12/18/2020  02:28 PM    <DIR>          include
12/18/2020  02:28 PM    <DIR>          jmods
12/18/2020  02:28 PM    <DIR>          legal
12/18/2020  02:29 PM    <DIR>          lib
11/11/2020  09:41 PM             1,165 release
               1 File(s)          1,165 bytes
               8 Dir(s)  1,330,399,625,216 bytes free
openjdk version "16-ea" 2021-03-16
OpenJDK Runtime Environment (build 16-ea+24-1553)
OpenJDK 64-Bit Server VM (build 16-ea+24-1553, mixed mode, sharing)
[POI-DSL-Windows-1.16] $ cmd.exe /C "F:\jenkins\tools\ant\latest1.10\bin\ant.bat -Dcoverage.enabled=true clean jenkins && exit %%ERRORLEVEL%%"
Buildfile: <https://ci-builds.apache.org/job/POI/job/POI-DSL-Windows-1.16/ws/build.xml>

clean:
   [delete] Deleting directory <https://ci-builds.apache.org/job/POI/job/POI-DSL-Windows-1.16/ws/build>
   [delete] Deleting directory <https://ci-builds.apache.org/job/POI/job/POI-DSL-Windows-1.16/ws/poi-examples\build>
   [delete] Deleting directory <https://ci-builds.apache.org/job/POI/job/POI-DSL-Windows-1.16/ws/poi-excelant\build>
   [delete] Deleting directory <https://ci-builds.apache.org/job/POI/job/POI-DSL-Windows-1.16/ws/poi-integration\build>
   [delete] Deleting directory <https://ci-builds.apache.org/job/POI/job/POI-DSL-Windows-1.16/ws/poi\build>
   [delete] Deleting directory <https://ci-builds.apache.org/job/POI/job/POI-DSL-Windows-1.16/ws/poi-ooxml\build>
   [delete] Deleting directory <https://ci-builds.apache.org/job/POI/job/POI-DSL-Windows-1.16/ws/poi-ooxml-full\build>
   [delete] Deleting directory <https://ci-builds.apache.org/job/POI/job/POI-DSL-Windows-1.16/ws/poi-scratchpad\build>

replaceVersion:

check-jars:

fetch-jars:

check-ooxml-jars:

fetch-ooxml-jars:
      [get] Destination already exists (skipping): <https://ci-builds.apache.org/job/POI/job/POI-DSL-Windows-1.16/ws/lib\ooxml\curvesapi-1.06.jar>
      [get] Getting: https://repo1.maven.org/maven2/org/apache/xmlbeans/xmlbeans/5.0.0/xmlbeans-5.0.0.jar
      [get] To: <https://ci-builds.apache.org/job/POI/job/POI-DSL-Windows-1.16/ws/lib\ooxml\xmlbeans-5.0.0.jar>
      [get] Destination already exists (skipping): <https://ci-builds.apache.org/job/POI/job/POI-DSL-Windows-1.16/ws/lib\ooxml\commons-compress-1.21.jar>
      [get] Destination already exists (skipping): <https://ci-builds.apache.org/job/POI/job/POI-DSL-Windows-1.16/ws/lib\ooxml-tests\reflections-0.9.12.jar>
      [get] Destination already exists (skipping): <https://ci-builds.apache.org/job/POI/job/POI-DSL-Windows-1.16/ws/lib\ooxml-tests\guava-30.1-jre.jar>
      [get] Destination already exists (skipping): <https://ci-builds.apache.org/job/POI/job/POI-DSL-Windows-1.16/ws/lib\ooxml-tests\javassist-3.27.0-GA.jar>
      [get] Destination already exists (skipping): <https://ci-builds.apache.org/job/POI/job/POI-DSL-Windows-1.16/ws/lib\ooxml-tests\slf4j-api-1.7.31.jar>
      [get] Destination already exists (skipping): <https://ci-builds.apache.org/job/POI/job/POI-DSL-Windows-1.16/ws/lib\ooxml-batik\batik-anim-1.14.jar>
      [get] Destination already exists (skipping): <https://ci-builds.apache.org/job/POI/job/POI-DSL-Windows-1.16/ws/lib\ooxml-batik\batik-awt-util-1.14.jar>
      [get] Destination already exists (skipping): <https://ci-builds.apache.org/job/POI/job/POI-DSL-Windows-1.16/ws/lib\ooxml-batik\batik-bridge-1.14.jar>
      [get] Destination already exists (skipping): <https://ci-builds.apache.org/job/POI/job/POI-DSL-Windows-1.16/ws/lib\ooxml-batik\batik-codec-1.14.jar>
      [get] Destination already exists (skipping): <https://ci-builds.apache.org/job/POI/job/POI-DSL-Windows-1.16/ws/lib\ooxml-batik\batik-constants-1.14.jar>
      [get] Destination already exists (skipping): <https://ci-builds.apache.org/job/POI/job/POI-DSL-Windows-1.16/ws/lib\ooxml-batik\batik-css-1.14.jar>
      [get] Destination already exists (skipping): <https://ci-builds.apache.org/job/POI/job/POI-DSL-Windows-1.16/ws/lib\ooxml-batik\batik-dom-1.14.jar>
      [get] Destination already exists (skipping): <https://ci-builds.apache.org/job/POI/job/POI-DSL-Windows-1.16/ws/lib\ooxml-batik\batik-ext-1.14.jar>
      [get] Destination already exists (skipping): <https://ci-builds.apache.org/job/POI/job/POI-DSL-Windows-1.16/ws/lib\ooxml-batik\batik-gvt-1.14.jar>
      [get] Destination already exists (skipping): <https://ci-builds.apache.org/job/POI/job/POI-DSL-Windows-1.16/ws/lib\ooxml-batik\batik-i18n-1.14.jar>
      [get] Destination already exists (skipping): <https://ci-builds.apache.org/job/POI/job/POI-DSL-Windows-1.16/ws/lib\ooxml-batik\batik-parser-1.14.jar>
      [get] Destination already exists (skipping): <https://ci-builds.apache.org/job/POI/job/POI-DSL-Windows-1.16/ws/lib\ooxml-batik\batik-script-1.14.jar>
      [get] Destination already exists (skipping): <https://ci-builds.apache.org/job/POI/job/POI-DSL-Windows-1.16/ws/lib\ooxml-batik\batik-shared-resources-1.14.jar>
      [get] Destination already exists (skipping): <https://ci-builds.apache.org/job/POI/job/POI-DSL-Windows-1.16/ws/lib\ooxml-batik\batik-svg-dom-1.14.jar>
      [get] Destination already exists (skipping): <https://ci-builds.apache.org/job/POI/job/POI-DSL-Windows-1.16/ws/lib\ooxml-batik\batik-svggen-1.14.jar>
      [get] Destination already exists (skipping): <https://ci-builds.apache.org/job/POI/job/POI-DSL-Windows-1.16/ws/lib\ooxml-batik\batik-svgrasterizer-1.14.jar>
      [get] Destination already exists (skipping): <https://ci-builds.apache.org/job/POI/job/POI-DSL-Windows-1.16/ws/lib\ooxml-batik\batik-transcoder-1.14.jar>
      [get] Destination already exists (skipping): <https://ci-builds.apache.org/job/POI/job/POI-DSL-Windows-1.16/ws/lib\ooxml-batik\batik-util-1.14.jar>
      [get] Destination already exists (skipping): <https://ci-builds.apache.org/job/POI/job/POI-DSL-Windows-1.16/ws/lib\ooxml-batik\batik-xml-1.14.jar>
      [get] Destination already exists (skipping): <https://ci-builds.apache.org/job/POI/job/POI-DSL-Windows-1.16/ws/lib\ooxml-batik\xml-apis-ext-1.3.04.jar>
      [get] Destination already exists (skipping): <https://ci-builds.apache.org/job/POI/job/POI-DSL-Windows-1.16/ws/lib\ooxml-batik\xmlgraphics-commons-2.4.jar>
      [get] Destination already exists (skipping): <https://ci-builds.apache.org/job/POI/job/POI-DSL-Windows-1.16/ws/lib\ooxml-provided\pdfbox-2.0.24.jar>
      [get] Destination already exists (skipping): <https://ci-builds.apache.org/job/POI/job/POI-DSL-Windows-1.16/ws/lib\ooxml-provided\fontbox-2.0.24.jar>
      [get] Destination already exists (skipping): <https://ci-builds.apache.org/job/POI/job/POI-DSL-Windows-1.16/ws/lib\ooxml-provided\graphics2d-0.32.jar>

init:
    [mkdir] Created dir: <https://ci-builds.apache.org/job/POI/job/POI-DSL-Windows-1.16/ws/build>
    [mkdir] Created dir: <https://ci-builds.apache.org/job/POI/job/POI-DSL-Windows-1.16/ws/poi\build\classes\ant\java>
    [mkdir] Created dir: <https://ci-builds.apache.org/job/POI/job/POI-DSL-Windows-1.16/ws/poi\build\test-classes>
    [mkdir] Created dir: <https://ci-builds.apache.org/job/POI/job/POI-DSL-Windows-1.16/ws/poi\build\test-results>
    [mkdir] Created dir: <https://ci-builds.apache.org/job/POI/job/POI-DSL-Windows-1.16/ws/poi-scratchpad\build\classes\ant\java>
    [mkdir] Created dir: <https://ci-builds.apache.org/job/POI/job/POI-DSL-Windows-1.16/ws/poi-scratchpad\build\test-classes>
    [mkdir] Created dir: <https://ci-builds.apache.org/job/POI/job/POI-DSL-Windows-1.16/ws/poi-scratchpad\build\test-results>
    [mkdir] Created dir: <https://ci-builds.apache.org/job/POI/job/POI-DSL-Windows-1.16/ws/poi-ooxml\build\classes\ant\java>
    [mkdir] Created dir: <https://ci-builds.apache.org/job/POI/job/POI-DSL-Windows-1.16/ws/poi-ooxml\build\test-classes>
    [mkdir] Created dir: <https://ci-builds.apache.org/job/POI/job/POI-DSL-Windows-1.16/ws/poi-ooxml-full\build\classes\ant\java>
    [mkdir] Created dir: <https://ci-builds.apache.org/job/POI/job/POI-DSL-Windows-1.16/ws/poi-ooxml-full\build\test-classes>
    [mkdir] Created dir: <https://ci-builds.apache.org/job/POI/job/POI-DSL-Windows-1.16/ws/poi-ooxml-full\build\generated-sources>
    [mkdir] Created dir: <https://ci-builds.apache.org/job/POI/job/POI-DSL-Windows-1.16/ws/poi-ooxml-full\build\generated-classes>
    [mkdir] Created dir: <https://ci-builds.apache.org/job/POI/job/POI-DSL-Windows-1.16/ws/poi-ooxml\build\test-results>
    [mkdir] Created dir: <https://ci-builds.apache.org/job/POI/job/POI-DSL-Windows-1.16/ws/poi-excelant\build\classes\ant\java>
    [mkdir] Created dir: <https://ci-builds.apache.org/job/POI/job/POI-DSL-Windows-1.16/ws/poi-excelant\build\test-classes>
    [mkdir] Created dir: <https://ci-builds.apache.org/job/POI/job/POI-DSL-Windows-1.16/ws/poi-excelant\build\test-results>
    [mkdir] Created dir: <https://ci-builds.apache.org/job/POI/job/POI-DSL-Windows-1.16/ws/poi-examples\build\classes\ant\java>
    [mkdir] Created dir: <https://ci-builds.apache.org/job/POI/job/POI-DSL-Windows-1.16/ws/poi-integration\build\test-classes>
    [mkdir] Created dir: <https://ci-builds.apache.org/job/POI/job/POI-DSL-Windows-1.16/ws/poi-integration\build\test-results>
    [mkdir] Created dir: <https://ci-builds.apache.org/job/POI/job/POI-DSL-Windows-1.16/ws/build\dist>
    [mkdir] Created dir: <https://ci-builds.apache.org/job/POI/job/POI-DSL-Windows-1.16/ws/build\site>
     [echo] Using Ant: Apache Ant(TM) version 1.10.9 compiled on September 27 2020 from F:\\jenkins\\tools\\ant\\latest1.10, Ant detected Java 16 (may be different than actual Java sometimes...)
     [echo] Using Java: 16-ea/16-ea+24-1553/16-ea+24-1553/OpenJDK 64-Bit Server VM from Oracle Corporation on Windows Server 2016: 10.0
     [echo] Building Apache POI version 5.0.1-SNAPSHOT and RC: RC1, isJava8: false
     [echo] Compiling for Java 9+

-version-java-check:

compile-version:
    [mkdir] Created dir: <https://ci-builds.apache.org/job/POI/job/POI-DSL-Windows-1.16/ws/poi\build\generated-sources\org\apache\poi>
     [copy] Copying 1 file to <https://ci-builds.apache.org/job/POI/job/POI-DSL-Windows-1.16/ws/poi\build\generated-sources\org\apache\poi>
    [javac] Compiling 1 source file to <https://ci-builds.apache.org/job/POI/job/POI-DSL-Windows-1.16/ws/poi\build\classes\ant\java>
    [javac] warning: [options] bootstrap class path not set in conjunction with -source 8
    [javac] 1 warning

compile-main:
    [javac] Compiling 1182 source files to <https://ci-builds.apache.org/job/POI/job/POI-DSL-Windows-1.16/ws/poi\build\classes\ant\java>
    [javac] Ignoring source, target and bootclasspath as release has been set
    [javac] Note: Some input files use or override a deprecated API.
    [javac] Note: Recompile with -Xlint:deprecation for details.
    [javac] Note: Some input files use unchecked or unsafe operations.
    [javac] Note: Recompile with -Xlint:unchecked for details.
    [javac] Creating empty <https://ci-builds.apache.org/job/POI/job/POI-DSL-Windows-1.16/ws/poi\build\classes\ant\java\org\apache\poi\ddf\package-info.class>
    [javac] Creating empty <https://ci-builds.apache.org/job/POI/job/POI-DSL-Windows-1.16/ws/poi\build\classes\ant\java\org\apache\poi\hssf\package-info.class>
    [javac] Creating empty <https://ci-builds.apache.org/job/POI/job/POI-DSL-Windows-1.16/ws/poi\build\classes\ant\java\org\apache\poi\poifs\dev\package-info.class>
    [javac] Creating empty <https://ci-builds.apache.org/job/POI/job/POI-DSL-Windows-1.16/ws/poi\build\classes\ant\java\org\apache\poi\util\package-info.class>
    [javac] Creating empty <https://ci-builds.apache.org/job/POI/job/POI-DSL-Windows-1.16/ws/poi\build\classes\ant\java\org\apache\poi\poifs\common\package-info.class>
    [javac] Creating empty <https://ci-builds.apache.org/job/POI/job/POI-DSL-Windows-1.16/ws/poi\build\classes\ant\java\org\apache\poi\hssf\record\package-info.class>
    [javac] Creating empty <https://ci-builds.apache.org/job/POI/job/POI-DSL-Windows-1.16/ws/poi\build\classes\ant\java\org\apache\poi\poifs\package-info.class>
    [javac] Creating empty <https://ci-builds.apache.org/job/POI/job/POI-DSL-Windows-1.16/ws/poi\build\classes\ant\java\org\apache\poi\poifs\crypt\package-info.class>
    [javac] Creating empty <https://ci-builds.apache.org/job/POI/job/POI-DSL-Windows-1.16/ws/poi\build\classes\ant\java\org\apache\poi\hpsf\wellknown\package-info.class>
    [javac] Creating empty <https://ci-builds.apache.org/job/POI/job/POI-DSL-Windows-1.16/ws/poi\build\classes\ant\java\org\apache\poi\hssf\dev\package-info.class>
    [javac] Creating empty <https://ci-builds.apache.org/job/POI/job/POI-DSL-Windows-1.16/ws/poi\build\classes\ant\java\org\apache\poi\ss\formula\package-info.class>
    [javac] Creating empty <https://ci-builds.apache.org/job/POI/job/POI-DSL-Windows-1.16/ws/poi\build\classes\ant\java\org\apache\poi\hpsf\package-info.class>
    [javac] Creating empty <https://ci-builds.apache.org/job/POI/job/POI-DSL-Windows-1.16/ws/poi\build\classes\ant\java\org\apache\poi\poifs\property\package-info.class>
    [javac] Creating empty <https://ci-builds.apache.org/job/POI/job/POI-DSL-Windows-1.16/ws/poi\build\classes\ant\java\org\apache\poi\poifs\filesystem\package-info.class>
    [javac] Creating empty <https://ci-builds.apache.org/job/POI/job/POI-DSL-Windows-1.16/ws/poi\build\classes\ant\java\org\apache\poi\ss\formula\ptg\package-info.class>
    [javac] Creating empty <https://ci-builds.apache.org/job/POI/job/POI-DSL-Windows-1.16/ws/poi\build\classes\ant\java\org\apache\poi\poifs\storage\package-info.class>
    [javac] Creating empty <https://ci-builds.apache.org/job/POI/job/POI-DSL-Windows-1.16/ws/poi\build\classes\ant\java\org\apache\poi\hssf\eventusermodel\package-info.class>
    [javac] Creating empty <https://ci-builds.apache.org/job/POI/job/POI-DSL-Windows-1.16/ws/poi\build\classes\ant\java\org\apache\poi\hssf\record\aggregates\package-info.class>
    [javac] Creating empty <https://ci-builds.apache.org/job/POI/job/POI-DSL-Windows-1.16/ws/poi\build\classes\ant\java\org\apache\poi\ss\format\package-info.class>
    [javac] Creating empty <https://ci-builds.apache.org/job/POI/job/POI-DSL-Windows-1.16/ws/poi\build\classes\ant\java\org\apache\poi\hssf\model\package-info.class>
    [javac] Creating empty <https://ci-builds.apache.org/job/POI/job/POI-DSL-Windows-1.16/ws/poi\build\classes\ant\java\org\apache\poi\hssf\usermodel\package-info.class>
    [javac] Creating empty <https://ci-builds.apache.org/job/POI/job/POI-DSL-Windows-1.16/ws/poi\build\classes\ant\java\org\apache\poi\hssf\util\package-info.class>
    [javac] Creating empty <https://ci-builds.apache.org/job/POI/job/POI-DSL-Windows-1.16/ws/poi\build\classes\ant\java\org\apache\poi\poifs\eventfilesystem\package-info.class>
    [mkdir] Created dir: <https://ci-builds.apache.org/job/POI/job/POI-DSL-Windows-1.16/ws/build\dist\maven\poi>
     [echo] Building jar for poi, module-name: poi with isJava8: false
      [jar] Building jar: <https://ci-builds.apache.org/job/POI/job/POI-DSL-Windows-1.16/ws/build\dist\maven\poi\poi-5.0.1-SNAPSHOT.jar>
    [javac] Compiling 532 source files to <https://ci-builds.apache.org/job/POI/job/POI-DSL-Windows-1.16/ws/poi\build\test-classes>
    [javac] Ignoring source, target and bootclasspath as release has been set
    [javac] Note: Some input files use or override a deprecated API.
    [javac] Note: Recompile with -Xlint:deprecation for details.
     [echo] Building test-jar for poi, module-name: poi with isJava8: false
      [jar] Building jar: <https://ci-builds.apache.org/job/POI/job/POI-DSL-Windows-1.16/ws/build\dist\maven\poi-tests\poi-5.0.1-SNAPSHOT-tests.jar>
      [jar] Building jar: <https://ci-builds.apache.org/job/POI/job/POI-DSL-Windows-1.16/ws/build\dist\maven\poi\poi-5.0.1-SNAPSHOT-sources.jar>

compile-scratchpad:
    [javac] Compiling 514 source files to <https://ci-builds.apache.org/job/POI/job/POI-DSL-Windows-1.16/ws/poi-scratchpad\build\classes\ant\java>
    [javac] Ignoring source, target and bootclasspath as release has been set
    [javac] Note: Some input files use or override a deprecated API.
    [javac] Note: Recompile with -Xlint:deprecation for details.
    [javac] Note: <https://ci-builds.apache.org/job/POI/job/POI-DSL-Windows-1.16/ws/poi-scratchpad\src\main\java\org\apache\poi\hwpf\model\BytePropertyNode.java> uses unchecked or unsafe operations.
    [javac] Note: Recompile with -Xlint:unchecked for details.
    [mkdir] Created dir: <https://ci-builds.apache.org/job/POI/job/POI-DSL-Windows-1.16/ws/build\dist\maven\poi-scratchpad>
     [echo] Building jar for poi-scratchpad, module-name: scratchpad with isJava8: false
      [jar] Building jar: <https://ci-builds.apache.org/job/POI/job/POI-DSL-Windows-1.16/ws/build\dist\maven\poi-scratchpad\poi-scratchpad-5.0.1-SNAPSHOT.jar>
    [javac] Compiling 197 source files to <https://ci-builds.apache.org/job/POI/job/POI-DSL-Windows-1.16/ws/poi-scratchpad\build\test-classes>
    [javac] Ignoring source, target and bootclasspath as release has been set
    [javac] Note: Some input files use or override a deprecated API.
    [javac] Note: Recompile with -Xlint:deprecation for details.
     [echo] Building test-jar for poi-scratchpad, module-name: scratchpad with isJava8: false
      [jar] Building jar: <https://ci-builds.apache.org/job/POI/job/POI-DSL-Windows-1.16/ws/build\dist\maven\poi-scratchpad-tests\poi-scratchpad-5.0.1-SNAPSHOT-tests.jar>
      [jar] Building jar: <https://ci-builds.apache.org/job/POI/job/POI-DSL-Windows-1.16/ws/build\dist\maven\poi-scratchpad\poi-scratchpad-5.0.1-SNAPSHOT-sources.jar>

check-compiled-ooxml-xsds:

compile-ooxml-xsds:
    [mkdir] Created dir: <https://ci-builds.apache.org/job/POI/job/POI-DSL-Windows-1.16/ws/poi-ooxml-full\build\xsds>
     [copy] Copying 8 files to <https://ci-builds.apache.org/job/POI/job/POI-DSL-Windows-1.16/ws/poi-ooxml-full\build\xsds>
     [copy] Copying 28 resources to <https://ci-builds.apache.org/job/POI/job/POI-DSL-Windows-1.16/ws/poi-ooxml-full\build\xsds>
  [xmlbean] SchemaCompiler  Metadata LOAD:org/apache/xmlbeans/metadata GEN:org/apache/poi/schemas/ooxml
  [xmlbean] Time to build schema type system: 3.047 seconds
  [xmlbean] Time to generate code: 44.509 seconds
    [javac] Compiling 5064 source files to <https://ci-builds.apache.org/job/POI/job/POI-DSL-Windows-1.16/ws/poi-ooxml-full\build\classes\ant\java>
    [javac] Ignoring source, target and bootclasspath as release has been set
    [mkdir] Created dir: <https://ci-builds.apache.org/job/POI/job/POI-DSL-Windows-1.16/ws/build\dist\maven\poi-ooxml-full>
      [jar] Building jar: <https://ci-builds.apache.org/job/POI/job/POI-DSL-Windows-1.16/ws/build\dist\maven\poi-ooxml-full\poi-ooxml-full-5.0.1-SNAPSHOT.jar>
      [jar] Building jar: <https://ci-builds.apache.org/job/POI/job/POI-DSL-Windows-1.16/ws/build\dist\maven\poi-ooxml-full\poi-ooxml-full-5.0.1-SNAPSHOT-sources.jar>

compile-ooxml:
    [javac] Compiling 621 source files to <https://ci-builds.apache.org/job/POI/job/POI-DSL-Windows-1.16/ws/poi-ooxml\build\classes\ant\java>
    [javac] Ignoring source, target and bootclasspath as release has been set
    [javac] <https://ci-builds.apache.org/job/POI/job/POI-DSL-Windows-1.16/ws/poi-ooxml\src\main\java\org\apache\poi\xslf\draw\SVGUserAgent.java>:66: error: cannot access ViewCSS
    [javac]         String viewBoxStr = el.getAttributeNS(null, SVGConstants.SVG_VIEW_BOX_ATTRIBUTE);
    [javac]                               ^
    [javac]   class file for org.w3c.dom.css.ViewCSS not found
    [javac] <https://ci-builds.apache.org/job/POI/job/POI-DSL-Windows-1.16/ws/poi-ooxml\src\main\java\org\apache\poi\xslf\draw\SVGUserAgent.java>:81: error: cannot access DocumentCSS
    [javac]         String a = el.getAttributeNS(null, attr);
    [javac]                      ^
    [javac]   class file for org.w3c.dom.css.DocumentCSS not found
    [javac] Note: Some input files use or override a deprecated API.
    [javac] Note: Recompile with -Xlint:deprecation for details.
    [javac] 2 errors

BUILD FAILED
<https://ci-builds.apache.org/job/POI/job/POI-DSL-Windows-1.16/ws/build.xml>:1259: The following error occurred while executing this line:
<https://ci-builds.apache.org/job/POI/job/POI-DSL-Windows-1.16/ws/build.xml>:1074: Compile failed; see the compiler error output for details.

Total time: 4 minutes 7 seconds
Build step 'Invoke Ant' marked build as failure
[SpotBugs] Skipping execution of recorder since overall result is 'FAILURE'
Archiving artifacts
Skipping publisher since build result is FAILURE
Recording test results
ERROR: Step ‘Publish JUnit test result report’ failed: No test report files were found. Configuration error?

---------------------------------------------------------------------
To unsubscribe, e-mail: dev-unsubscribe@poi.apache.org
For additional commands, e-mail: dev-help@poi.apache.org


Jenkins build is back to normal : POI » POI-DSL-Windows-1.16 #126

Posted by Apache Jenkins Server <je...@builds.apache.org>.
See <https://ci-builds.apache.org/job/POI/job/POI-DSL-Windows-1.16/126/display/redirect?page=changes>


---------------------------------------------------------------------
To unsubscribe, e-mail: dev-unsubscribe@poi.apache.org
For additional commands, e-mail: dev-help@poi.apache.org


Build failed in Jenkins: POI » POI-DSL-Windows-1.16 #125

Posted by Apache Jenkins Server <je...@builds.apache.org>.
See <https://ci-builds.apache.org/job/POI/job/POI-DSL-Windows-1.16/125/display/redirect?page=changes>

Changes:

[Andreas Beeker] Increase general max heap size to cover also integration tests demands


------------------------------------------
[...truncated 41.27 KB...]
> Task :poi-scratchpad:testJar

> Task :poi-ooxml:compileTestJava
F:\jenkins\jenkins-slave\712657a4\workspace\POI\POI-DSL-Windows-1.16\poi-ooxml\src\test\java\org\apache\poi\poifs\crypt\dsig\TestSignatureInfo.java:871: warning: [deprecation] getSubjectDN() in X509Certificate has been deprecated
                assertEquals("CN=Muj Klic", result.get(0).getSubjectDN().toString());
                                                         ^
F:\jenkins\jenkins-slave\712657a4\workspace\POI\POI-DSL-Windows-1.16\poi-ooxml\src\test\java\org\apache\poi\poifs\crypt\dsig\TestSignatureInfo.java:872: warning: [deprecation] getSubjectDN() in X509Certificate has been deprecated
                assertEquals("CN=My Second key", result.get(1).getSubjectDN().toString());
                                                              ^
F:\jenkins\jenkins-slave\712657a4\workspace\POI\POI-DSL-Windows-1.16\poi-ooxml\src\test\java\org\apache\poi\poifs\crypt\dsig\TestSignatureInfo.java:875: warning: [deprecation] getSubjectDN() in X509Certificate has been deprecated
                assertEquals("CN=My Second key", result.get(0).getSubjectDN().toString());
                                                              ^
F:\jenkins\jenkins-slave\712657a4\workspace\POI\POI-DSL-Windows-1.16\poi-ooxml\src\test\java\org\apache\poi\poifs\crypt\dsig\TestSignatureInfo.java:914: warning: [deprecation] getSubjectDN() in X509Certificate has been deprecated
        assertEquals("CN=Test", certs.get(0).getSubjectDN().getName());
                                            ^
F:\jenkins\jenkins-slave\712657a4\workspace\POI\POI-DSL-Windows-1.16\poi-ooxml\src\test\java\org\apache\poi\xddf\usermodel\chart\TestXDDFChartRemoveSeries.java:129: warning: [deprecation] getSeries() in XDDFChartData has been deprecated
        assertThrows(UnsupportedOperationException.class, () -> chartData.getSeries().remove(0));
                                                                         ^
F:\jenkins\jenkins-slave\712657a4\workspace\POI\POI-DSL-Windows-1.16\poi-ooxml\src\test\java\org\apache\poi\xwpf\usermodel\TestXWPFRun.java:203: warning: [deprecation] getFontSize() in XWPFRun has been deprecated
        assertEquals(7, run.getFontSize());
                           ^
F:\jenkins\jenkins-slave\712657a4\workspace\POI\POI-DSL-Windows-1.16\poi-ooxml\src\test\java\org\apache\poi\xwpf\usermodel\TestXWPFRun.java:211: warning: [deprecation] getFontSize() in XWPFRun has been deprecated
        assertEquals(25, run.getFontSize());
                            ^
F:\jenkins\jenkins-slave\712657a4\workspace\POI\POI-DSL-Windows-1.16\poi-ooxml\src\test\java\org\apache\poi\xwpf\usermodel\TestXWPFRun.java:589: warning: [deprecation] getFontSize() in XWPFRun has been deprecated
            assertEquals(-1, run.getFontSize());
                                ^
F:\jenkins\jenkins-slave\712657a4\workspace\POI\POI-DSL-Windows-1.16\poi-ooxml\src\test\java\org\apache\poi\xwpf\usermodel\TestXWPFRun.java:592: warning: [deprecation] getFontSize() in XWPFRun has been deprecated
            assertEquals(10, run.getFontSize());
                                ^
F:\jenkins\jenkins-slave\712657a4\workspace\POI\POI-DSL-Windows-1.16\poi-ooxml\src\test\java\org\apache\poi\xwpf\usermodel\TestXWPFRun.java:595: warning: [deprecation] getFontSize() in XWPFRun has been deprecated
            assertEquals(Short.MAX_VALUE - 1, run.getFontSize());
                                                 ^
F:\jenkins\jenkins-slave\712657a4\workspace\POI\POI-DSL-Windows-1.16\poi-ooxml\src\test\java\org\apache\poi\xwpf\usermodel\TestXWPFRun.java:598: warning: [deprecation] getFontSize() in XWPFRun has been deprecated
            assertEquals(Short.MAX_VALUE, run.getFontSize());
                                             ^
F:\jenkins\jenkins-slave\712657a4\workspace\POI\POI-DSL-Windows-1.16\poi-ooxml\src\test\java\org\apache\poi\xwpf\usermodel\TestXWPFRun.java:601: warning: [deprecation] getFontSize() in XWPFRun has been deprecated
            assertEquals(Short.MAX_VALUE + 1, run.getFontSize());
                                                 ^
F:\jenkins\jenkins-slave\712657a4\workspace\POI\POI-DSL-Windows-1.16\poi-ooxml\src\test\java\org\apache\poi\xwpf\usermodel\TestXWPFRun.java:604: warning: [deprecation] getFontSize() in XWPFRun has been deprecated
            assertEquals(Integer.MAX_VALUE - 1, run.getFontSize());
                                                   ^
F:\jenkins\jenkins-slave\712657a4\workspace\POI\POI-DSL-Windows-1.16\poi-ooxml\src\test\java\org\apache\poi\xwpf\usermodel\TestXWPFRun.java:607: warning: [deprecation] getFontSize() in XWPFRun has been deprecated
            assertEquals(Integer.MAX_VALUE, run.getFontSize());
                                               ^
F:\jenkins\jenkins-slave\712657a4\workspace\POI\POI-DSL-Windows-1.16\poi-ooxml\src\test\java\org\apache\poi\xwpf\usermodel\TestXWPFRun.java:610: warning: [deprecation] getFontSize() in XWPFRun has been deprecated
            assertEquals(-1, run.getFontSize());
                                ^
F:\jenkins\jenkins-slave\712657a4\workspace\POI\POI-DSL-Windows-1.16\poi-ooxml\src\test\java\org\apache\poi\xwpf\usermodel\TestXWPFRun.java:658: warning: [deprecation] getFontSize() in XWPFRun has been deprecated
            assertEquals(10, run.getFontSize());
                                ^
16 warnings

> Task :poi-ooxml:compileTest9
> Task :poi-ooxml:cacheTest9
> Task :poi-ooxml:processTestResources NO-SOURCE
> Task :poi-ooxml:testClasses
> Task :poi-ooxml:testJar
> Task :poi-integration:compileTestJava
> Task :poi-integration:compileTest9
> Task :poi-integration:cacheTest9
> Task :poi-integration:processTestResources
> Task :poi-integration:testClasses
> Task :poi-integration:testJar
> Task :allJavaDoc
> Task :zipJavadocs
> Task :binDistTar
> Task :binDistZip
> Task :replaceVersion
> Task :poi-excelant:compileJava
> Task :poi-excelant:compileJava9
> Task :poi-excelant:cacheJava9
> Task :poi-excelant:processResources
> Task :poi-excelant:classes
> Task :poi-excelant:compileTestJava
> Task :poi-excelant:compileTest9
> Task :poi-excelant:cacheTest9
> Task :poi-excelant:jar
> Task :poi-excelant:javadoc
> Task :poi-excelant:javadocJar
> Task :poi-excelant:sourcesJar
> Task :poi-excelant:assemble
> Task :poi-excelant:forbiddenApisMain
> Task :poi-excelant:processTestResources
> Task :poi-excelant:testClasses
> Task :poi-excelant:forbiddenApisTest
> Task :poi-excelant:forbiddenApis
> Task :poi-excelant:testJar
> Task :poi-excelant:test
> Task :poi-excelant:check
> Task :poi-excelant:build
> Task :poi-integration:jar
> Task :poi-integration:javadoc SKIPPED
> Task :poi-integration:javadocJar SKIPPED
> Task :poi-integration:sourcesJar SKIPPED
> Task :poi-integration:assemble
> Task :poi-integration:forbiddenApisMain NO-SOURCE
> Task :poi-integration:forbiddenApisTest
> Task :poi-integration:forbiddenApis
> Task :poi-integration:test
> Task :poi-integration:check
> Task :poi-integration:build
> Task :poi-ooxml:javadoc
> Task :poi-ooxml:javadocJar
> Task :poi-ooxml:sourcesJar
> Task :poi-ooxml:assemble
> Task :poi-ooxml:forbiddenApisMain
> Task :poi-ooxml:forbiddenApisTest
> Task :poi-ooxml:forbiddenApis
> Task :poi-ooxml:test
> Task :poi-ooxml:check
> Task :poi-ooxml:build
> Task :poi-ooxml-lite:generateModuleInfo
> Task :poi-ooxml-lite:compileOoxmlLite
> Task :poi-ooxml-lite:compileJava
> Task :poi-ooxml-lite:compileJava9
> Task :poi-ooxml-lite:cacheJava9
> Task :srcDistTar
> Task :srcDistZip
> Task :fixDistDir
> Task :poi:javadoc
> Task :poi:javadocJar
> Task :poi:sourcesJar
> Task :poi:assemble
> Task :poi:forbiddenApisMain
> Task :poi:forbiddenApisTest
> Task :poi:forbiddenApis

> Task :poi:test
WARNING: Unknown module: org.junit.platform.commons specified to --add-exports
WARNING: Unknown module: org.junit.platform.commons specified to --add-exports

> Task :poi:check
> Task :poi:build
> Task :poi-examples:javadoc
> Task :poi-examples:javadocJar
> Task :poi-examples:sourcesJar
> Task :poi-examples:assemble
> Task :poi-examples:forbiddenApisMain
> Task :poi-examples:compileTestJava
> Task :poi-examples:processTestResources NO-SOURCE
> Task :poi-examples:testClasses
> Task :poi-examples:forbiddenApisTest
> Task :poi-examples:forbiddenApis

> Task :poi-examples:test
WARNING: Unknown module: org.junit.platform.commons specified to --add-exports
WARNING: Unknown module: org.junit.platform.commons specified to --add-exports

> Task :poi-examples:check
> Task :poi-examples:build
> Task :poi-ooxml-full:javadoc
> Task :poi-ooxml-full:javadocJar
> Task :poi-ooxml-full:sourcesJar
> Task :poi-ooxml-full:assemble
> Task :poi-ooxml-full:forbiddenApisMain
> Task :poi-ooxml-full:compileTestJava NO-SOURCE
> Task :poi-ooxml-full:processTestResources NO-SOURCE
> Task :poi-ooxml-full:testClasses UP-TO-DATE
> Task :poi-ooxml-full:forbiddenApisTest NO-SOURCE
> Task :poi-ooxml-full:forbiddenApis
> Task :poi-ooxml-full:test NO-SOURCE
> Task :poi-ooxml-full:check
> Task :poi-ooxml-full:build
> Task :poi-ooxml-lite:processResources
> Task :poi-ooxml-lite:classes
> Task :poi-ooxml-lite:jar
> Task :poi-ooxml-lite:javadoc
> Task :poi-ooxml-lite:javadocJar
> Task :poi-ooxml-lite:sourcesJar
> Task :poi-ooxml-lite:assemble
> Task :poi-ooxml-lite:forbiddenApisMain
> Task :poi-ooxml-lite:compileTestJava NO-SOURCE
> Task :poi-ooxml-lite:processTestResources NO-SOURCE
> Task :poi-ooxml-lite:testClasses UP-TO-DATE
> Task :poi-ooxml-lite:forbiddenApisTest NO-SOURCE
> Task :poi-ooxml-lite:forbiddenApis
> Task :poi-ooxml-lite:test NO-SOURCE
> Task :poi-ooxml-lite:check
> Task :poi-ooxml-lite:build
> Task :poi-ooxml-lite-agent:javadoc
> Task :poi-ooxml-lite-agent:javadocJar
> Task :poi-ooxml-lite-agent:sourcesJar
> Task :poi-ooxml-lite-agent:assemble
> Task :poi-ooxml-lite-agent:forbiddenApisMain
> Task :poi-ooxml-lite-agent:compileTestJava NO-SOURCE
> Task :poi-ooxml-lite-agent:processTestResources NO-SOURCE
> Task :poi-ooxml-lite-agent:testClasses UP-TO-DATE
> Task :poi-ooxml-lite-agent:forbiddenApisTest NO-SOURCE
> Task :poi-ooxml-lite-agent:forbiddenApis
> Task :poi-ooxml-lite-agent:test NO-SOURCE
> Task :poi-ooxml-lite-agent:check
> Task :poi-ooxml-lite-agent:build
> Task :poi-scratchpad:javadoc
> Task :poi-scratchpad:javadocJar
> Task :poi-scratchpad:sourcesJar
> Task :poi-scratchpad:assemble
> Task :poi-scratchpad:forbiddenApisMain
> Task :poi-scratchpad:forbiddenApisTest
> Task :poi-scratchpad:forbiddenApis
> Task :poi-scratchpad:test
> Task :poi-scratchpad:check
> Task :poi-scratchpad:build
> Task :jenkins

> Task :rat FAILED
Files with unapproved licenses:
 - F:/jenkins/jenkins-slave/712657a4/workspace/POI/POI-DSL-Windows-1.16/poi-examples/src/main/java9/module-info.class.r1891370
 - F:/jenkins/jenkins-slave/712657a4/workspace/POI/POI-DSL-Windows-1.16/poi-examples/src/main/java9/module-info.class.r1891667
 - F:/jenkins/jenkins-slave/712657a4/workspace/POI/POI-DSL-Windows-1.16/poi-ooxml-full/src/main/java9/module-info.class.r1891370
 - F:/jenkins/jenkins-slave/712657a4/workspace/POI/POI-DSL-Windows-1.16/poi-ooxml-full/src/main/java9/module-info.class.r1891667
 - F:/jenkins/jenkins-slave/712657a4/workspace/POI/POI-DSL-Windows-1.16/poi-ooxml-lite-agent/src/main/java9/module-info.class.r1891370
 - F:/jenkins/jenkins-slave/712657a4/workspace/POI/POI-DSL-Windows-1.16/poi-ooxml-lite-agent/src/main/java9/module-info.class.r1891667
 - F:/jenkins/jenkins-slave/712657a4/workspace/POI/POI-DSL-Windows-1.16/poi-ooxml/src/main/java9/module-info.class.r1891370
 - F:/jenkins/jenkins-slave/712657a4/workspace/POI/POI-DSL-Windows-1.16/poi-ooxml/src/test/java9/module-info.class.r1891370
 - F:/jenkins/jenkins-slave/712657a4/workspace/POI/POI-DSL-Windows-1.16/poi-scratchpad/src/main/java9/module-info.class.r1891370
 - F:/jenkins/jenkins-slave/712657a4/workspace/POI/POI-DSL-Windows-1.16/poi-scratchpad/src/test/java9/module-info.class.r1891370


> Task :poi:jacocoTestReport

FAILURE: Build failed with an exception.

* What went wrong:
Execution failed for task ':rat'.
> A failure occurred while executing org.nosphere.apache.rat.RatWork
   > Apache Rat audit failure - 10 unapproved licenses
     	See file:///F:/jenkins/jenkins-slave/712657a4/workspace/POI/POI-DSL-Windows-1.16/build/reports/rat/index.html

* Try:
Run with --stacktrace option to get the stack trace. Run with --info or --debug option to get more log output. Run with --scan to get full insights.

* Get more help at https://help.gradle.org

Deprecated Gradle features were used in this build, making it incompatible with Gradle 8.0.

You can use '--warning-mode all' to show the individual deprecation warnings and determine if they come from your own scripts or plugins.

See https://docs.gradle.org/7.1/userguide/command_line_interface.html#sec:command_line_warnings

BUILD FAILED in 38m 44s
132 actionable tasks: 131 executed, 1 up-to-date
Build step 'Invoke Gradle script' changed build result to FAILURE
Build step 'Invoke Gradle script' marked build as failure
[SpotBugs] Skipping execution of recorder since overall result is 'FAILURE'
Archiving artifacts
Skipping publisher since build result is FAILURE
Recording test results
[Checks API] No suitable checks publisher found.

---------------------------------------------------------------------
To unsubscribe, e-mail: dev-unsubscribe@poi.apache.org
For additional commands, e-mail: dev-help@poi.apache.org


Build failed in Jenkins: POI » POI-DSL-Windows-1.16 #124

Posted by Apache Jenkins Server <je...@builds.apache.org>.
See <https://ci-builds.apache.org/job/POI/job/POI-DSL-Windows-1.16/124/display/redirect?page=changes>

Changes:

[Andreas Beeker] Redirecting System.out/err is bad in concurrent test environment


------------------------------------------
[...truncated 43.22 KB...]
                                ^
F:\jenkins\jenkins-slave\712657a4\workspace\POI\POI-DSL-Windows-1.16\poi-ooxml\src\test\java\org\apache\poi\xwpf\usermodel\TestXWPFRun.java:592: warning: [deprecation] getFontSize() in XWPFRun has been deprecated
            assertEquals(10, run.getFontSize());
                                ^
F:\jenkins\jenkins-slave\712657a4\workspace\POI\POI-DSL-Windows-1.16\poi-ooxml\src\test\java\org\apache\poi\xwpf\usermodel\TestXWPFRun.java:595: warning: [deprecation] getFontSize() in XWPFRun has been deprecated
            assertEquals(Short.MAX_VALUE - 1, run.getFontSize());
                                                 ^
F:\jenkins\jenkins-slave\712657a4\workspace\POI\POI-DSL-Windows-1.16\poi-ooxml\src\test\java\org\apache\poi\xwpf\usermodel\TestXWPFRun.java:598: warning: [deprecation] getFontSize() in XWPFRun has been deprecated
            assertEquals(Short.MAX_VALUE, run.getFontSize());
                                             ^
F:\jenkins\jenkins-slave\712657a4\workspace\POI\POI-DSL-Windows-1.16\poi-ooxml\src\test\java\org\apache\poi\xwpf\usermodel\TestXWPFRun.java:601: warning: [deprecation] getFontSize() in XWPFRun has been deprecated
            assertEquals(Short.MAX_VALUE + 1, run.getFontSize());
                                                 ^
F:\jenkins\jenkins-slave\712657a4\workspace\POI\POI-DSL-Windows-1.16\poi-ooxml\src\test\java\org\apache\poi\xwpf\usermodel\TestXWPFRun.java:604: warning: [deprecation] getFontSize() in XWPFRun has been deprecated
            assertEquals(Integer.MAX_VALUE - 1, run.getFontSize());
                                                   ^
F:\jenkins\jenkins-slave\712657a4\workspace\POI\POI-DSL-Windows-1.16\poi-ooxml\src\test\java\org\apache\poi\xwpf\usermodel\TestXWPFRun.java:607: warning: [deprecation] getFontSize() in XWPFRun has been deprecated
            assertEquals(Integer.MAX_VALUE, run.getFontSize());
                                               ^
F:\jenkins\jenkins-slave\712657a4\workspace\POI\POI-DSL-Windows-1.16\poi-ooxml\src\test\java\org\apache\poi\xwpf\usermodel\TestXWPFRun.java:610: warning: [deprecation] getFontSize() in XWPFRun has been deprecated
            assertEquals(-1, run.getFontSize());
                                ^
F:\jenkins\jenkins-slave\712657a4\workspace\POI\POI-DSL-Windows-1.16\poi-ooxml\src\test\java\org\apache\poi\xwpf\usermodel\TestXWPFRun.java:658: warning: [deprecation] getFontSize() in XWPFRun has been deprecated
            assertEquals(10, run.getFontSize());
                                ^
16 warnings

> Task :poi-ooxml:compileTest9
> Task :poi-ooxml:cacheTest9 UP-TO-DATE
> Task :poi-ooxml:processTestResources NO-SOURCE
> Task :poi-ooxml:testClasses
> Task :poi-ooxml:testJar
> Task :poi-integration:compileTestJava
> Task :poi-integration:compileTest9
> Task :poi-integration:cacheTest9 UP-TO-DATE
> Task :poi-integration:processTestResources
> Task :poi-integration:testClasses
> Task :poi-integration:testJar
> Task :allJavaDoc
> Task :zipJavadocs
> Task :binDistTar
> Task :binDistZip
> Task :replaceVersion
> Task :poi-excelant:compileJava
> Task :poi-excelant:compileJava9
> Task :poi-excelant:cacheJava9 UP-TO-DATE
> Task :poi-excelant:processResources
> Task :poi-excelant:classes
> Task :poi-excelant:compileTestJava
> Task :poi-excelant:compileTest9
> Task :poi-excelant:cacheTest9 UP-TO-DATE
> Task :poi-excelant:jar
> Task :poi-excelant:javadoc
> Task :poi-excelant:javadocJar
> Task :poi-excelant:sourcesJar
> Task :poi-excelant:assemble
> Task :poi-excelant:forbiddenApisMain
> Task :poi-excelant:processTestResources
> Task :poi-excelant:testClasses
> Task :poi-excelant:forbiddenApisTest
> Task :poi-excelant:forbiddenApis
> Task :poi-excelant:testJar
> Task :poi-excelant:test
> Task :poi-excelant:check
> Task :poi-excelant:build
> Task :poi-integration:jar
> Task :poi-integration:javadoc SKIPPED
> Task :poi-integration:javadocJar SKIPPED
> Task :poi-integration:sourcesJar SKIPPED
> Task :poi-integration:assemble
> Task :poi-integration:forbiddenApisMain NO-SOURCE
> Task :poi-integration:forbiddenApisTest
> Task :poi-integration:forbiddenApis
> Task :poi-integration:test
> Task :poi-integration:check
> Task :poi-integration:build
> Task :poi-ooxml:javadoc
> Task :poi-ooxml:javadocJar
> Task :poi-ooxml:sourcesJar
> Task :poi-ooxml:assemble
> Task :poi-ooxml:forbiddenApisMain
> Task :poi-ooxml:forbiddenApisTest
> Task :poi-ooxml:forbiddenApis
> Task :poi-ooxml:test
> Task :poi-ooxml:check
> Task :poi-ooxml:build
> Task :poi-ooxml-lite:generateModuleInfo
> Task :poi-ooxml-lite:compileOoxmlLite
> Task :poi-ooxml-lite:compileJava
> Task :poi-ooxml-lite:compileJava9
> Task :poi-ooxml-lite:cacheJava9 UP-TO-DATE
> Task :srcDistTar
> Task :srcDistZip
> Task :fixDistDir
> Task :poi:javadoc
> Task :poi:javadocJar
> Task :poi:sourcesJar
> Task :poi:assemble
> Task :poi:forbiddenApisMain
> Task :poi:forbiddenApisTest
> Task :poi:forbiddenApis

> Task :poi:test
WARNING: Unknown module: org.junit.platform.commons specified to --add-exports
WARNING: Unknown module: org.junit.platform.commons specified to --add-exports

> Task :poi:check
> Task :poi:build
> Task :poi-examples:javadoc
> Task :poi-examples:javadocJar
> Task :poi-examples:sourcesJar
> Task :poi-examples:assemble
> Task :poi-examples:forbiddenApisMain
> Task :poi-examples:compileTestJava
> Task :poi-examples:processTestResources NO-SOURCE
> Task :poi-examples:testClasses
> Task :poi-examples:forbiddenApisTest
> Task :poi-examples:forbiddenApis

> Task :poi-examples:test
WARNING: Unknown module: org.junit.platform.commons specified to --add-exports
WARNING: Unknown module: org.junit.platform.commons specified to --add-exports

> Task :poi-examples:check
> Task :poi-examples:build
> Task :poi-ooxml-full:javadoc
> Task :poi-ooxml-full:javadocJar
> Task :poi-ooxml-full:sourcesJar
> Task :poi-ooxml-full:assemble
> Task :poi-ooxml-full:forbiddenApisMain
> Task :poi-ooxml-full:compileTestJava NO-SOURCE
> Task :poi-ooxml-full:processTestResources NO-SOURCE
> Task :poi-ooxml-full:testClasses UP-TO-DATE
> Task :poi-ooxml-full:forbiddenApisTest NO-SOURCE
> Task :poi-ooxml-full:forbiddenApis
> Task :poi-ooxml-full:test NO-SOURCE
> Task :poi-ooxml-full:check
> Task :poi-ooxml-full:build
> Task :poi-ooxml-lite:processResources
> Task :poi-ooxml-lite:classes
> Task :poi-ooxml-lite:jar
> Task :poi-ooxml-lite:javadoc
> Task :poi-ooxml-lite:javadocJar
> Task :poi-ooxml-lite:sourcesJar
> Task :poi-ooxml-lite:assemble
> Task :poi-ooxml-lite:forbiddenApisMain
> Task :poi-ooxml-lite:compileTestJava NO-SOURCE
> Task :poi-ooxml-lite:processTestResources NO-SOURCE
> Task :poi-ooxml-lite:testClasses UP-TO-DATE
> Task :poi-ooxml-lite:forbiddenApisTest NO-SOURCE
> Task :poi-ooxml-lite:forbiddenApis
> Task :poi-ooxml-lite:test NO-SOURCE
> Task :poi-ooxml-lite:check
> Task :poi-ooxml-lite:build
> Task :poi-ooxml-lite-agent:javadoc
> Task :poi-ooxml-lite-agent:javadocJar
> Task :poi-ooxml-lite-agent:sourcesJar
> Task :poi-ooxml-lite-agent:assemble
> Task :poi-ooxml-lite-agent:forbiddenApisMain
> Task :poi-ooxml-lite-agent:compileTestJava NO-SOURCE
> Task :poi-ooxml-lite-agent:processTestResources NO-SOURCE
> Task :poi-ooxml-lite-agent:testClasses UP-TO-DATE
> Task :poi-ooxml-lite-agent:forbiddenApisTest NO-SOURCE
> Task :poi-ooxml-lite-agent:forbiddenApis
> Task :poi-ooxml-lite-agent:test NO-SOURCE
> Task :poi-ooxml-lite-agent:check
> Task :poi-ooxml-lite-agent:build
> Task :poi-scratchpad:javadoc
> Task :poi-scratchpad:javadocJar
> Task :poi-scratchpad:sourcesJar
> Task :poi-scratchpad:assemble
> Task :poi-scratchpad:forbiddenApisMain
> Task :poi-scratchpad:forbiddenApisTest
> Task :poi-scratchpad:forbiddenApis
> Task :poi-scratchpad:test
> Task :poi-scratchpad:check
> Task :poi-scratchpad:build
> Task :jenkins

> Task :rat
Files with unapproved licenses:
 - F:/jenkins/jenkins-slave/712657a4/workspace/POI/POI-DSL-Windows-1.16/poi-examples/src/main/java9/module-info.class.r1891472
 - F:/jenkins/jenkins-slave/712657a4/workspace/POI/POI-DSL-Windows-1.16/poi-examples/src/main/java9/module-info.class.r1891551
 - F:/jenkins/jenkins-slave/712657a4/workspace/POI/POI-DSL-Windows-1.16/poi-ooxml-full/src/main/java9/module-info.class.r1891362
 - F:/jenkins/jenkins-slave/712657a4/workspace/POI/POI-DSL-Windows-1.16/poi-ooxml-full/src/main/java9/module-info.class.r1891472
 - F:/jenkins/jenkins-slave/712657a4/workspace/POI/POI-DSL-Windows-1.16/poi-ooxml-lite-agent/src/main/java9/module-info.class.r1891362
 - F:/jenkins/jenkins-slave/712657a4/workspace/POI/POI-DSL-Windows-1.16/poi-ooxml-lite-agent/src/main/java9/module-info.class.r1891472
 - F:/jenkins/jenkins-slave/712657a4/workspace/POI/POI-DSL-Windows-1.16/poi-ooxml-lite/src/main/java9/module-info.class.r1891472
 - F:/jenkins/jenkins-slave/712657a4/workspace/POI/POI-DSL-Windows-1.16/poi-ooxml-lite/src/main/java9/module-info.class.r1891551
 - F:/jenkins/jenkins-slave/712657a4/workspace/POI/POI-DSL-Windows-1.16/poi-ooxml-lite/src/main/java9/module-info.java.2.mine
 - F:/jenkins/jenkins-slave/712657a4/workspace/POI/POI-DSL-Windows-1.16/poi-ooxml-lite/src/main/java9/module-info.java.2.r1891248
 - F:/jenkins/jenkins-slave/712657a4/workspace/POI/POI-DSL-Windows-1.16/poi-ooxml-lite/src/main/java9/module-info.java.2.r1891322
 - F:/jenkins/jenkins-slave/712657a4/workspace/POI/POI-DSL-Windows-1.16/poi-ooxml-lite/src/main/java9/module-info.java.2.r1891349
 - F:/jenkins/jenkins-slave/712657a4/workspace/POI/POI-DSL-Windows-1.16/poi-ooxml-lite/src/main/java9/module-info.java.3.mine
 - F:/jenkins/jenkins-slave/712657a4/workspace/POI/POI-DSL-Windows-1.16/poi-ooxml-lite/src/main/java9/module-info.java.3.r1891248
 - F:/jenkins/jenkins-slave/712657a4/workspace/POI/POI-DSL-Windows-1.16/poi-ooxml-lite/src/main/java9/module-info.java.3.r1891322
 - F:/jenkins/jenkins-slave/712657a4/workspace/POI/POI-DSL-Windows-1.16/poi-ooxml-lite/src/main/java9/module-info.java.3.r1891349
 - F:/jenkins/jenkins-slave/712657a4/workspace/POI/POI-DSL-Windows-1.16/poi-ooxml-lite/src/main/java9/module-info.java.4.mine
 - F:/jenkins/jenkins-slave/712657a4/workspace/POI/POI-DSL-Windows-1.16/poi-ooxml-lite/src/main/java9/module-info.java.4.r1891248
 - F:/jenkins/jenkins-slave/712657a4/workspace/POI/POI-DSL-Windows-1.16/poi-ooxml-lite/src/main/java9/module-info.java.4.r1891322
 - F:/jenkins/jenkins-slave/712657a4/workspace/POI/POI-DSL-Windows-1.16/poi-ooxml-lite/src/main/java9/module-info.java.4.r1891349
 - F:/jenkins/jenkins-slave/712657a4/workspace/POI/POI-DSL-Windows-1.16/poi-ooxml-lite/src/main/java9/module-info.java.5.mine
 - F:/jenkins/jenkins-slave/712657a4/workspace/POI/POI-DSL-Windows-1.16/poi-ooxml-lite/src/main/java9/module-info.java.5.r1891248
 - F:/jenkins/jenkins-slave/712657a4/workspace/POI/POI-DSL-Windows-1.16/poi-ooxml-lite/src/main/java9/module-info.java.6.mine
 - F:/jenkins/jenkins-slave/712657a4/workspace/POI/POI-DSL-Windows-1.16/poi-ooxml-lite/src/main/java9/module-info.java.6.r1891248
 - F:/jenkins/jenkins-slave/712657a4/workspace/POI/POI-DSL-Windows-1.16/poi-ooxml-lite/src/main/java9/module-info.java.7.mine
 - F:/jenkins/jenkins-slave/712657a4/workspace/POI/POI-DSL-Windows-1.16/poi-ooxml-lite/src/main/java9/module-info.java.7.r1891248
 - F:/jenkins/jenkins-slave/712657a4/workspace/POI/POI-DSL-Windows-1.16/poi-ooxml-lite/src/main/java9/module-info.java.8.mine
 - F:/jenkins/jenkins-slave/712657a4/workspace/POI/POI-DSL-Windows-1.16/poi-ooxml-lite/src/main/java9/module-info.java.8.r1891248
 - F:/jenkins/jenkins-slave/712657a4/workspace/POI/POI-DSL-Windows-1.16/poi-ooxml-lite/src/main/java9/module-info.java.mine
 - F:/jenkins/jenkins-slave/712657a4/workspace/POI/POI-DSL-Windows-1.16/poi-ooxml-lite/src/main/java9/module-info.java.r1891248
 - F:/jenkins/jenkins-slave/712657a4/workspace/POI/POI-DSL-Windows-1.16/poi-ooxml-lite/src/main/java9/module-info.java.r1891322
 - F:/jenkins/jenkins-slave/712657a4/workspace/POI/POI-DSL-Windows-1.16/poi-ooxml-lite/src/main/java9/module-info.java.r1891349
 - F:/jenkins/jenkins-slave/712657a4/workspace/POI/POI-DSL-Windows-1.16/poi-ooxml/src/main/java9/module-info.class.r1891362
 - F:/jenkins/jenkins-slave/712657a4/workspace/POI/POI-DSL-Windows-1.16/poi-ooxml/src/test/java9/module-info.class.r1891362
 - F:/jenkins/jenkins-slave/712657a4/workspace/POI/POI-DSL-Windows-1.16/poi-scratchpad/src/main/java9/module-info.class.r1891362


> Task :rat FAILED
> Task :poi:jacocoTestReport

FAILURE: Build failed with an exception.

* What went wrong:
Execution failed for task ':rat'.
> A failure occurred while executing org.nosphere.apache.rat.RatWork
   > Apache Rat audit failure - 35 unapproved licenses
     	See file:///F:/jenkins/jenkins-slave/712657a4/workspace/POI/POI-DSL-Windows-1.16/build/reports/rat/index.html

* Try:
Run with --stacktrace option to get the stack trace. Run with --info or --debug option to get more log output. Run with --scan to get full insights.

* Get more help at https://help.gradle.org

Deprecated Gradle features were used in this build, making it incompatible with Gradle 8.0.

You can use '--warning-mode all' to show the individual deprecation warnings and determine if they come from your own scripts or plugins.

See https://docs.gradle.org/7.1/userguide/command_line_interface.html#sec:command_line_warnings

BUILD FAILED in 24m 50s
132 actionable tasks: 119 executed, 13 up-to-date
Build step 'Invoke Gradle script' changed build result to FAILURE
Build step 'Invoke Gradle script' marked build as failure
[SpotBugs] Skipping execution of recorder since overall result is 'FAILURE'
Archiving artifacts
Skipping publisher since build result is FAILURE
Recording test results
[Checks API] No suitable checks publisher found.

---------------------------------------------------------------------
To unsubscribe, e-mail: dev-unsubscribe@poi.apache.org
For additional commands, e-mail: dev-help@poi.apache.org


Build failed in Jenkins: POI » POI-DSL-Windows-1.16 #123

Posted by Apache Jenkins Server <je...@builds.apache.org>.
See <https://ci-builds.apache.org/job/POI/job/POI-DSL-Windows-1.16/123/display/redirect?page=changes>

Changes:

[Andreas Beeker] use gradle for windows builds


------------------------------------------
[...truncated 29.18 KB...]
F:\jenkins\jenkins-slave\712657a4\workspace\POI\POI-DSL-Windows-1.16\poi\src\test\java\org\apache\poi\hssf\usermodel\TestHSSFCell.java:401: warning: [deprecation] setCellType(CellType) in Cell has been deprecated
            cell.setCellType(CellType.STRING);
                ^
F:\jenkins\jenkins-slave\712657a4\workspace\POI\POI-DSL-Windows-1.16\poi\src\test\java\org\apache\poi\hssf\usermodel\TestHSSFCell.java:403: warning: [deprecation] setCellType(CellType) in Cell has been deprecated
            cell.setCellType(CellType.STRING);
                ^
F:\jenkins\jenkins-slave\712657a4\workspace\POI\POI-DSL-Windows-1.16\poi\src\test\java\org\apache\poi\ss\usermodel\BaseTestSheetUpdateArrayFormulas.java:277: warning: [deprecation] setCellType(CellType) in Cell has been deprecated
            scell.setCellType(CellType.STRING);
                 ^
F:\jenkins\jenkins-slave\712657a4\workspace\POI\POI-DSL-Windows-1.16\poi\src\test\java\org\apache\poi\ss\usermodel\BaseTestSheetUpdateArrayFormulas.java:287: warning: [deprecation] setCellType(CellType) in Cell has been deprecated
                IllegalStateException e = assertThrows(IllegalStateException.class, () -> mcell.setCellType(CellType.NUMERIC));
                                                                                               ^
F:\jenkins\jenkins-slave\712657a4\workspace\POI\POI-DSL-Windows-1.16\poi\src\test\java\org\apache\poi\ss\util\TestSheetUtil.java:212: warning: [deprecation] setCellType(CellType) in Cell has been deprecated
            cell.setCellType(CellType.STRING);
                ^
15 warnings

> Task :poi:compileTest9
> Task :poi:cacheTest9
> Task :poi:processTestResources
> Task :poi:testClasses
> Task :poi:testJar
> Task :poi-integration:compileJava NO-SOURCE
> Task :poi-integration:processResources NO-SOURCE
> Task :poi-integration:classes UP-TO-DATE
> Task :poi-ooxml-lite-agent:compileJava
> Task :poi-ooxml-lite-agent:compileJava9
> Task :poi-ooxml-lite-agent:cacheJava9
> Task :poi-ooxml-lite-agent:processResources NO-SOURCE
> Task :poi-ooxml-lite-agent:classes
> Task :poi-ooxml-lite-agent:jar

> Task :poi-scratchpad:compileTestJava
F:\jenkins\jenkins-slave\712657a4\workspace\POI\POI-DSL-Windows-1.16\poi-scratchpad\src\test\java\org\apache\poi\hslf\extractor\TestExtractor.java:497: warning: [deprecation] getCodepoints(String,Boolean,Boolean) in SlideShowExtractor has been deprecated
                BitSet l1 = ppt.getCodepoints(font, null, null);
                               ^
F:\jenkins\jenkins-slave\712657a4\workspace\POI\POI-DSL-Windows-1.16\poi-scratchpad\src\test\java\org\apache\poi\hwpf\extractor\TestWordExtractor.java:190: warning: [deprecation] getHeaderText() in WordExtractor has been deprecated
        assertEquals("First header column!\tMid header Right header!\n", extractor1.getHeaderText());
                                                                                   ^
F:\jenkins\jenkins-slave\712657a4\workspace\POI\POI-DSL-Windows-1.16\poi-scratchpad\src\test\java\org\apache\poi\hwpf\extractor\TestWordExtractor.java:200: warning: [deprecation] getHeaderText() in WordExtractor has been deprecated
        assertEquals("This is a simple header, with a \u20ac euro symbol in it.\n\n", extractor2.getHeaderText());
                                                                                                ^
F:\jenkins\jenkins-slave\712657a4\workspace\POI\POI-DSL-Windows-1.16\poi-scratchpad\src\test\java\org\apache\poi\hwpf\extractor\TestWordExtractor.java:213: warning: [deprecation] getFooterText() in WordExtractor has been deprecated
        assertEquals("Footer Left\tFooter Middle Footer Right\n", extractor1.getFooterText());
                                                                            ^
F:\jenkins\jenkins-slave\712657a4\workspace\POI\POI-DSL-Windows-1.16\poi-scratchpad\src\test\java\org\apache\poi\hwpf\extractor\TestWordExtractor.java:223: warning: [deprecation] getFooterText() in WordExtractor has been deprecated
        assertEquals("The footer, with Moli\u00e8re, has Unicode in it.\n", extractor2.getFooterText());
                                                                                      ^
F:\jenkins\jenkins-slave\712657a4\workspace\POI\POI-DSL-Windows-1.16\poi-scratchpad\src\test\java\org\apache\poi\hwpf\extractor\TestWordExtractorBugs.java:56: warning: [deprecation] getParagraphText() in Word6Extractor has been deprecated
                assertNotNull(extractor.getParagraphText());
                                       ^
F:\jenkins\jenkins-slave\712657a4\workspace\POI\POI-DSL-Windows-1.16\poi-scratchpad\src\test\java\org\apache\poi\hwpf\model\TestCHPBinTable.java:53: warning: [deprecation] writeTo(HWPFFileSystem,int,CharIndexTranslator) in CHPBinTable has been deprecated
    _cHPBinTable.writeTo(fileSys, 0, fakeTPT);
                ^
F:\jenkins\jenkins-slave\712657a4\workspace\POI\POI-DSL-Windows-1.16\poi-scratchpad\src\test\java\org\apache\poi\hwpf\model\TestFontTable.java:47: warning: [deprecation] writeTo(HWPFFileSystem) in FontTable has been deprecated
    _fontTable.writeTo(fileSys);
              ^
F:\jenkins\jenkins-slave\712657a4\workspace\POI\POI-DSL-Windows-1.16\poi-scratchpad\src\test\java\org\apache\poi\hwpf\model\TestSectionTable.java:50: warning: [deprecation] writeTo(HWPFFileSystem,int) in SectionTable has been deprecated
    sectionTable.writeTo(fileSys, 0);
                ^
F:\jenkins\jenkins-slave\712657a4\workspace\POI\POI-DSL-Windows-1.16\poi-scratchpad\src\test\java\org\apache\poi\hwpf\sprm\TestSprms.java:77: warning: [deprecation] getParagraphStyle(int) in StyleSheet has been deprecated
            assertEquals(1, hwpfDocument.getStyleSheet().getParagraphStyle(8).getJustification());
                                                        ^
F:\jenkins\jenkins-slave\712657a4\workspace\POI\POI-DSL-Windows-1.16\poi-scratchpad\src\test\java\org\apache\poi\hwpf\sprm\TestSprms.java:80: warning: [deprecation] getParagraphStyle(int) in StyleSheet has been deprecated
                assertEquals(1, hwpfDocument2.getStyleSheet().getParagraphStyle(8).getJustification());
                                                             ^
F:\jenkins\jenkins-slave\712657a4\workspace\POI\POI-DSL-Windows-1.16\poi-scratchpad\src\test\java\org\apache\poi\hwpf\usermodel\TestBug49820.java:64: warning: [deprecation] getParagraphStyle(int) in StyleSheet has been deprecated
    assertEquals(expectedStyleLvl, styleSheet.getParagraphStyle(par.getStyleIndex()).getLvl());
                                             ^
F:\jenkins\jenkins-slave\712657a4\workspace\POI\POI-DSL-Windows-1.16\poi-scratchpad\src\test\java\org\apache\poi\hwpf\usermodel\TestHWPFOldDocument.java:186: warning: [deprecation] getParagraphText() in Word6Extractor has been deprecated
        for (String p : ex.getParagraphText()) {
                          ^
F:\jenkins\jenkins-slave\712657a4\workspace\POI\POI-DSL-Windows-1.16\poi-scratchpad\src\test\java\org\apache\poi\hwpf\usermodel\TestHWPFOldDocument.java:203: warning: [deprecation] getParagraphText() in Word6Extractor has been deprecated
        for (String p : ex.getParagraphText()) {
                          ^
F:\jenkins\jenkins-slave\712657a4\workspace\POI\POI-DSL-Windows-1.16\poi-scratchpad\src\test\java\org\apache\poi\hwpf\usermodel\TestHWPFOldDocument.java:240: warning: [deprecation] getParagraphText() in Word6Extractor has been deprecated
        for (String p : ex.getParagraphText()) {
                          ^
15 warnings

> Task :poi-scratchpad:compileTest9
> Task :poi-scratchpad:cacheTest9
> Task :poi-scratchpad:processTestResources NO-SOURCE
> Task :poi-scratchpad:testClasses
> Task :poi-scratchpad:testJar

> Task :poi-ooxml:compileTestJava
F:\jenkins\jenkins-slave\712657a4\workspace\POI\POI-DSL-Windows-1.16\poi-ooxml\src\test\java\org\apache\poi\poifs\crypt\dsig\TestSignatureInfo.java:871: warning: [deprecation] getSubjectDN() in X509Certificate has been deprecated
                assertEquals("CN=Muj Klic", result.get(0).getSubjectDN().toString());
                                                         ^
F:\jenkins\jenkins-slave\712657a4\workspace\POI\POI-DSL-Windows-1.16\poi-ooxml\src\test\java\org\apache\poi\poifs\crypt\dsig\TestSignatureInfo.java:872: warning: [deprecation] getSubjectDN() in X509Certificate has been deprecated
                assertEquals("CN=My Second key", result.get(1).getSubjectDN().toString());
                                                              ^
F:\jenkins\jenkins-slave\712657a4\workspace\POI\POI-DSL-Windows-1.16\poi-ooxml\src\test\java\org\apache\poi\poifs\crypt\dsig\TestSignatureInfo.java:875: warning: [deprecation] getSubjectDN() in X509Certificate has been deprecated
                assertEquals("CN=My Second key", result.get(0).getSubjectDN().toString());
                                                              ^
F:\jenkins\jenkins-slave\712657a4\workspace\POI\POI-DSL-Windows-1.16\poi-ooxml\src\test\java\org\apache\poi\poifs\crypt\dsig\TestSignatureInfo.java:914: warning: [deprecation] getSubjectDN() in X509Certificate has been deprecated
        assertEquals("CN=Test", certs.get(0).getSubjectDN().getName());
                                            ^
F:\jenkins\jenkins-slave\712657a4\workspace\POI\POI-DSL-Windows-1.16\poi-ooxml\src\test\java\org\apache\poi\xddf\usermodel\chart\TestXDDFChartRemoveSeries.java:129: warning: [deprecation] getSeries() in XDDFChartData has been deprecated
        assertThrows(UnsupportedOperationException.class, () -> chartData.getSeries().remove(0));
                                                                         ^
F:\jenkins\jenkins-slave\712657a4\workspace\POI\POI-DSL-Windows-1.16\poi-ooxml\src\test\java\org\apache\poi\xwpf\usermodel\TestXWPFRun.java:203: warning: [deprecation] getFontSize() in XWPFRun has been deprecated
        assertEquals(7, run.getFontSize());
                           ^
F:\jenkins\jenkins-slave\712657a4\workspace\POI\POI-DSL-Windows-1.16\poi-ooxml\src\test\java\org\apache\poi\xwpf\usermodel\TestXWPFRun.java:211: warning: [deprecation] getFontSize() in XWPFRun has been deprecated
        assertEquals(25, run.getFontSize());
                            ^
F:\jenkins\jenkins-slave\712657a4\workspace\POI\POI-DSL-Windows-1.16\poi-ooxml\src\test\java\org\apache\poi\xwpf\usermodel\TestXWPFRun.java:589: warning: [deprecation] getFontSize() in XWPFRun has been deprecated
            assertEquals(-1, run.getFontSize());
                                ^
F:\jenkins\jenkins-slave\712657a4\workspace\POI\POI-DSL-Windows-1.16\poi-ooxml\src\test\java\org\apache\poi\xwpf\usermodel\TestXWPFRun.java:592: warning: [deprecation] getFontSize() in XWPFRun has been deprecated
            assertEquals(10, run.getFontSize());
                                ^
F:\jenkins\jenkins-slave\712657a4\workspace\POI\POI-DSL-Windows-1.16\poi-ooxml\src\test\java\org\apache\poi\xwpf\usermodel\TestXWPFRun.java:595: warning: [deprecation] getFontSize() in XWPFRun has been deprecated
            assertEquals(Short.MAX_VALUE - 1, run.getFontSize());
                                                 ^
F:\jenkins\jenkins-slave\712657a4\workspace\POI\POI-DSL-Windows-1.16\poi-ooxml\src\test\java\org\apache\poi\xwpf\usermodel\TestXWPFRun.java:598: warning: [deprecation] getFontSize() in XWPFRun has been deprecated
            assertEquals(Short.MAX_VALUE, run.getFontSize());
                                             ^
F:\jenkins\jenkins-slave\712657a4\workspace\POI\POI-DSL-Windows-1.16\poi-ooxml\src\test\java\org\apache\poi\xwpf\usermodel\TestXWPFRun.java:601: warning: [deprecation] getFontSize() in XWPFRun has been deprecated
            assertEquals(Short.MAX_VALUE + 1, run.getFontSize());
                                                 ^
F:\jenkins\jenkins-slave\712657a4\workspace\POI\POI-DSL-Windows-1.16\poi-ooxml\src\test\java\org\apache\poi\xwpf\usermodel\TestXWPFRun.java:604: warning: [deprecation] getFontSize() in XWPFRun has been deprecated
            assertEquals(Integer.MAX_VALUE - 1, run.getFontSize());
                                                   ^
F:\jenkins\jenkins-slave\712657a4\workspace\POI\POI-DSL-Windows-1.16\poi-ooxml\src\test\java\org\apache\poi\xwpf\usermodel\TestXWPFRun.java:607: warning: [deprecation] getFontSize() in XWPFRun has been deprecated
            assertEquals(Integer.MAX_VALUE, run.getFontSize());
                                               ^
F:\jenkins\jenkins-slave\712657a4\workspace\POI\POI-DSL-Windows-1.16\poi-ooxml\src\test\java\org\apache\poi\xwpf\usermodel\TestXWPFRun.java:610: warning: [deprecation] getFontSize() in XWPFRun has been deprecated
            assertEquals(-1, run.getFontSize());
                                ^
F:\jenkins\jenkins-slave\712657a4\workspace\POI\POI-DSL-Windows-1.16\poi-ooxml\src\test\java\org\apache\poi\xwpf\usermodel\TestXWPFRun.java:658: warning: [deprecation] getFontSize() in XWPFRun has been deprecated
            assertEquals(10, run.getFontSize());
                                ^
16 warnings

> Task :poi-ooxml:compileTest9
> Task :poi-ooxml:cacheTest9
> Task :poi-ooxml:processTestResources NO-SOURCE
> Task :poi-ooxml:testClasses
> Task :poi-ooxml:testJar
> Task :poi-integration:compileTestJava
> Task :poi-integration:compileTest9
> Task :poi-integration:cacheTest9
> Task :poi-integration:processTestResources
> Task :poi-integration:testClasses
> Task :poi-integration:testJar
> Task :allJavaDoc
> Task :zipJavadocs
> Task :binDistTar
> Task :binDistZip
> Task :replaceVersion
> Task :poi-excelant:compileJava
> Task :poi-excelant:compileJava9
> Task :poi-excelant:cacheJava9
> Task :poi-excelant:processResources
> Task :poi-excelant:classes
> Task :poi-excelant:compileTestJava
> Task :poi-excelant:compileTest9
> Task :poi-excelant:cacheTest9
> Task :poi-excelant:jar
> Task :poi-excelant:javadoc
> Task :poi-excelant:javadocJar
> Task :poi-excelant:sourcesJar
> Task :poi-excelant:assemble
> Task :poi-excelant:forbiddenApisMain
> Task :poi-excelant:processTestResources
> Task :poi-excelant:testClasses
> Task :poi-excelant:forbiddenApisTest
> Task :poi-excelant:forbiddenApis
> Task :poi-excelant:testJar
> Task :poi-excelant:test
> Task :poi-excelant:check
> Task :poi-excelant:build
> Task :poi-integration:jar
> Task :poi-integration:javadoc SKIPPED
> Task :poi-integration:javadocJar SKIPPED
> Task :poi-integration:sourcesJar SKIPPED
> Task :poi-integration:assemble
> Task :poi-integration:forbiddenApisMain NO-SOURCE
> Task :poi-integration:forbiddenApisTest
> Task :poi-integration:forbiddenApis
> Task :poi-integration:test
> Task :poi-integration:check
> Task :poi-integration:build
> Task :poi-ooxml:javadoc
> Task :poi-ooxml:javadocJar
> Task :poi-ooxml:sourcesJar
> Task :poi-ooxml:assemble
> Task :poi-ooxml:forbiddenApisMain
> Task :poi-ooxml:forbiddenApisTest
> Task :poi-ooxml:forbiddenApis
> Task :poi-ooxml:test
> Task :poi-ooxml:check
> Task :poi-ooxml:build
> Task :poi-ooxml-lite:generateModuleInfo
> Task :poi-ooxml-lite:compileOoxmlLite
> Task :poi-ooxml-lite:compileJava
> Task :poi-ooxml-lite:compileJava9
> Task :poi-ooxml-lite:cacheJava9
> Task :srcDistTar
> Task :srcDistZip
> Task :fixDistDir
> Task :poi:javadoc
> Task :poi:javadocJar
> Task :poi:sourcesJar
> Task :poi:assemble
> Task :poi:forbiddenApisMain
> Task :poi:forbiddenApisTest
> Task :poi:forbiddenApis

> Task :poi:test
WARNING: Unknown module: org.junit.platform.commons specified to --add-exports
WARNING: Unknown module: org.junit.platform.commons specified to --add-exports

TestOldExcelExtractor > testMain() FAILED
    org.opentest4j.AssertionFailedError at TestOldExcelExtractor.java:331

7061 tests completed, 1 failed, 24 skipped

> Task :poi:test FAILED

FAILURE: Build failed with an exception.

* What went wrong:
Execution failed for task ':poi:test'.
> There were failing tests. See the report at: file:///F:/jenkins/jenkins-slave/712657a4/workspace/POI/POI-DSL-Windows-1.16/poi/build/reports/tests/test/index.html

* Try:
Run with --stacktrace option to get the stack trace. Run with --info or --debug option to get more log output. Run with --scan to get full insights.

* Get more help at https://help.gradle.org

Deprecated Gradle features were used in this build, making it incompatible with Gradle 8.0.

You can use '--warning-mode all' to show the individual deprecation warnings and determine if they come from your own scripts or plugins.

See https://docs.gradle.org/7.1/userguide/command_line_interface.html#sec:command_line_warnings

BUILD FAILED in 16m 50s
103 actionable tasks: 102 executed, 1 up-to-date
Build step 'Invoke Gradle script' changed build result to FAILURE
Build step 'Invoke Gradle script' marked build as failure
[SpotBugs] Skipping execution of recorder since overall result is 'FAILURE'
Archiving artifacts
Skipping publisher since build result is FAILURE
Recording test results
[Checks API] No suitable checks publisher found.

---------------------------------------------------------------------
To unsubscribe, e-mail: dev-unsubscribe@poi.apache.org
For additional commands, e-mail: dev-help@poi.apache.org


Build failed in Jenkins: POI » POI-DSL-Windows-1.16 #122

Posted by Apache Jenkins Server <je...@builds.apache.org>.
See <https://ci-builds.apache.org/job/POI/job/POI-DSL-Windows-1.16/122/display/redirect?page=changes>

Changes:

[Andreas Beeker] use gradle for windows builds


------------------------------------------
Started by user Andreas Beeker
Running as SYSTEM
[EnvInject] - Loading node environment variables.
[EnvInject] - Preparing an environment for the build.
[EnvInject] - Keeping Jenkins system variables.
[EnvInject] - Keeping Jenkins build variables.
[EnvInject] - Injecting as environment variables the properties content 
LANG=en_US.UTF-8
FORREST_HOME=f:\jenkins\tools\forrest\latest

[EnvInject] - Variables injected successfully.
[EnvInject] - Injecting contributions.
Building remotely on jenkins-win-azr-1 (Windows) in workspace <https://ci-builds.apache.org/job/POI/job/POI-DSL-Windows-1.16/ws/>
[WS-CLEANUP] Deleting project workspace...
[WS-CLEANUP] Done
Updating https://svn.apache.org/repos/asf/poi/trunk at revision '2021-08-20T20:39:49.046 +0000'
U         jenkins\create_jobs.groovy
U         poi\build.gradle
U         poi\src\main\java\org\apache\poi\ss\formula\atp\AnalysisToolPak.java
AU        poi\src\main\java\org\apache\poi\ss\formula\atp\PercentRankExcFunction.java
U         poi\src\main\java\org\apache\poi\ss\formula\atp\TextJoinFunction.java
AU        poi\src\main\java\org\apache\poi\ss\formula\atp\PercentRankIncFunction.java
AU        poi\src\main\java\org\apache\poi\ss\formula\functions\Averageifs.java
U         poi\src\main\java\org\apache\poi\ss\formula\functions\Baseifs.java
U         poi\src\main\java\org\apache\poi\ss\formula\functions\Countifs.java
AU        poi\src\main\java\org\apache\poi\ss\formula\functions\Maxifs.java
AU        poi\src\main\java\org\apache\poi\ss\formula\functions\Minifs.java
U         poi\src\main\java\org\apache\poi\ss\formula\functions\Sumifs.java
AU        poi\src\main\java\org\apache\poi\ss\formula\functions\PercentRank.java
U         poi\src\main\java\org\apache\poi\ss\formula\functions\LookupUtils.java
U         poi\src\main\java\org\apache\poi\ss\formula\eval\FunctionEval.java
U         poi\src\main\java\org\apache\poi\ss\usermodel\DateUtil.java
U         poi\src\main\java\org\apache\poi\util\TempFileCreationStrategy.java
AU        poi\src\test\java\org\apache\poi\ss\formula\functions\TestAverageifs.java
AU        poi\src\test\java\org\apache\poi\ss\formula\functions\TestMaxifs.java
AU        poi\src\test\java\org\apache\poi\ss\formula\functions\TestMinifs.java
U         poi\src\test\java\org\apache\poi\ss\formula\functions\TestAddress.java
U         poi\src\test\java\org\apache\poi\ss\formula\functions\TestAreas.java
U         poi\src\test\java\org\apache\poi\ss\formula\functions\TestClean.java
U         poi\src\test\java\org\apache\poi\ss\formula\functions\TestConcat.java
U         poi\src\test\java\org\apache\poi\ss\formula\functions\TestFind.java
U         poi\src\test\java\org\apache\poi\ss\formula\functions\TestSum.java
U         poi\src\test\java\org\apache\poi\ss\formula\functions\TestTimeValue.java
AU        poi\src\test\java\org\apache\poi\ss\formula\functions\TestPercentRank.java
U         poi\src\test\java\org\apache\poi\ss\formula\atp\TestTextJoinFunction.java
AU        poi\src\test\java\org\apache\poi\ss\formula\atp\TestPercentRankExcFunction.java
AU        poi\src\test\java\org\apache\poi\ss\formula\atp\TestPercentRankIncFunction.java
U         poi\src\test\java\org\apache\poi\ss\usermodel\BaseTestConditionalFormatting.java
U         poi\src\test\java\org\apache\poi\ss\util\Utils.java
U         poi-excelant\build.gradle
U         poi-integration\build.gradle
U         poi-scratchpad\build.gradle
U         build.gradle
U         poi-ooxml\build.gradle
U         poi-ooxml\src\main\java\org\apache\poi\xslf\draw\SVGImageRenderer.java
AU        poi-ooxml\src\main\java\org\apache\poi\xslf\draw\SVGUserAgent.java
U         poi-ooxml\src\main\java\org\apache\poi\xssf\usermodel\XSSFDataBarFormatting.java
U         poi-ooxml\src\main\java\org\apache\poi\xssf\usermodel\XSSFSheet.java
U         poi-ooxml\src\main\java\org\apache\poi\xssf\usermodel\XSSFHyperlink.java
U         poi-ooxml\src\main\java\org\apache\poi\xssf\extractor\XSSFExportToXml.java
U         poi-ooxml\src\test\java\org\apache\poi\xssf\usermodel\TestXSSFConditionalFormatting.java
U         poi-ooxml\src\test\java\org\apache\poi\xssf\usermodel\TestXSSFHyperlink.java
U         poi-ooxml\src\test\java\org\apache\poi\xssf\usermodel\TestXSSFBugs.java
AU        test-data\spreadsheet\sharedhyperlink.xlsx

<-- Got one external: documentation, svn url: https://svn.apache.org/repos/asf/poi/site/src/documentation -->
Fetching 'https://svn.apache.org/repos/asf/poi/site/src/documentation' at -1 into 'F:\jenkins\jenkins-home\712657a4\workspace\POI\POI-DSL-Windows-1.16\src\documentation'
U         src\documentation\content\xdocs\changes.xml
U         src\documentation\content\xdocs\related-projects.xml
At revision 1892480


<-- Got one external: forrest.properties, svn url: https://svn.apache.org/repos/asf/poi/site/forrest.properties -->
Fetching 'https://svn.apache.org/repos/asf/poi/site/forrest.properties' at -1 into 'F:\jenkins\jenkins-home\712657a4\workspace\POI\POI-DSL-Windows-1.16\forrest.properties'
At revision 1892480

At revision 1892480

No changes for https://svn.apache.org/repos/asf/poi/site/src/documentation since the previous build
No changes for https://svn.apache.org/repos/asf/poi/site/forrest.properties since the previous build
[POI-DSL-Windows-1.16] $ cmd /c call F:\jenkins\jenkins-home\temp\jenkins491069281835788460.bat
    X   forrest.properties
M       poi\src\main\java9\module-info.class
M       poi\src\test\java9\module-info.class
M       poi-examples\src\main\java9\module-info.class
M       poi-ooxml\src\main\java9\module-info.class
M       poi-ooxml\src\test\java9\module-info.class
M       poi-ooxml-full\src\main\java9\module-info.class
M       poi-ooxml-lite-agent\src\main\java9\module-info.class
M       poi-scratchpad\src\main\java9\module-info.class
M       poi-scratchpad\src\test\java9\module-info.class
X       src\documentation

Performing status on external item at 'src\documentation':
svn: E155010: The node 'F:\jenkins\jenkins-home\712657a4\workspace\POI\POI-DSL-Windows-1.16\poi*\src\*' was not found.
Java-Home: f:\\jenkins\\tools\\java\\latest16
 Volume in drive F is Data
 Volume Serial Number is 7082-E32C

 Directory of f:\jenkins\tools\java\latest16

07/30/2021  06:29 PM    <DIR>          .
07/30/2021  06:29 PM    <DIR>          ..
07/30/2021  06:29 PM    <DIR>          bin
07/30/2021  06:29 PM    <DIR>          conf
07/30/2021  06:29 PM    <DIR>          include
07/30/2021  06:29 PM    <DIR>          jmods
07/30/2021  06:29 PM    <DIR>          legal
07/30/2021  06:29 PM    <DIR>          lib
11/11/2020  08:41 PM             1,165 release
               1 File(s)          1,165 bytes
               8 Dir(s)  1,032,215,896,064 bytes free
openjdk version "16-ea" 2021-03-16
OpenJDK Runtime Environment (build 16-ea+24-1553)
OpenJDK 64-Bit Server VM (build 16-ea+24-1553, mixed mode, sharing)
[POI-DSL-Windows-1.16] $ cmd /c call F:\jenkins\jenkins-home\temp\jenkins6282556056514509283.bat

<https://ci-builds.apache.org/job/POI/job/POI-DSL-Windows-1.16/ws/>touch> --no-create build/*/build/test-results/TEST-*.xml build/*/build/test-results/test/TEST-*.xml 
'touch' is not recognized as an internal or external command,
operable program or batch file.

<https://ci-builds.apache.org/job/POI/job/POI-DSL-Windows-1.16/ws/>exit> 9009 
Build step 'Execute Windows batch command' marked build as failure
[SpotBugs] Skipping execution of recorder since overall result is 'FAILURE'
Archiving artifacts
Skipping publisher since build result is FAILURE
Recording test results
ERROR: Step ‘Publish JUnit test result report’ failed: No test report files were found. Configuration error?

---------------------------------------------------------------------
To unsubscribe, e-mail: dev-unsubscribe@poi.apache.org
For additional commands, e-mail: dev-help@poi.apache.org