You are viewing a plain text version of this content. The canonical link for it is here.
Posted to dev@lucene.apache.org by Policeman Jenkins Server <je...@thetaphi.de> on 2016/09/11 20:09:27 UTC

[JENKINS] Lucene-Solr-6.x-MacOSX (64bit/jdk1.8.0) - Build # 405 - Still Unstable!

Build: http://jenkins.thetaphi.de/job/Lucene-Solr-6.x-MacOSX/405/
Java: 64bit/jdk1.8.0 -XX:+UseCompressedOops -XX:+UseSerialGC

1 tests failed.
FAILED:  org.apache.solr.security.BasicAuthIntegrationTest.testBasicAuth

Error Message:
IOException occured when talking to server at: https://127.0.0.1:63622/solr

Stack Trace:
org.apache.solr.client.solrj.SolrServerException: IOException occured when talking to server at: https://127.0.0.1:63622/solr
	at __randomizedtesting.SeedInfo.seed([27C80B2E893BBF1F:9BA67D3C2D683C65]:0)
	at org.apache.solr.client.solrj.impl.HttpSolrClient.executeMethod(HttpSolrClient.java:606)
	at org.apache.solr.client.solrj.impl.HttpSolrClient.request(HttpSolrClient.java:261)
	at org.apache.solr.client.solrj.impl.HttpSolrClient.request(HttpSolrClient.java:250)
	at org.apache.solr.client.solrj.SolrClient.request(SolrClient.java:1219)
	at org.apache.solr.security.BasicAuthIntegrationTest.testBasicAuth(BasicAuthIntegrationTest.java:158)
	at sun.reflect.NativeMethodAccessorImpl.invoke0(Native Method)
	at sun.reflect.NativeMethodAccessorImpl.invoke(NativeMethodAccessorImpl.java:62)
	at sun.reflect.DelegatingMethodAccessorImpl.invoke(DelegatingMethodAccessorImpl.java:43)
	at java.lang.reflect.Method.invoke(Method.java:498)
	at com.carrotsearch.randomizedtesting.RandomizedRunner.invoke(RandomizedRunner.java:1764)
	at com.carrotsearch.randomizedtesting.RandomizedRunner$8.evaluate(RandomizedRunner.java:871)
	at com.carrotsearch.randomizedtesting.RandomizedRunner$9.evaluate(RandomizedRunner.java:907)
	at com.carrotsearch.randomizedtesting.RandomizedRunner$10.evaluate(RandomizedRunner.java:921)
	at com.carrotsearch.randomizedtesting.rules.SystemPropertiesRestoreRule$1.evaluate(SystemPropertiesRestoreRule.java:57)
	at org.apache.lucene.util.TestRuleSetupTeardownChained$1.evaluate(TestRuleSetupTeardownChained.java:49)
	at org.apache.lucene.util.AbstractBeforeAfterRule$1.evaluate(AbstractBeforeAfterRule.java:45)
	at org.apache.lucene.util.TestRuleThreadAndTestName$1.evaluate(TestRuleThreadAndTestName.java:48)
	at org.apache.lucene.util.TestRuleIgnoreAfterMaxFailures$1.evaluate(TestRuleIgnoreAfterMaxFailures.java:64)
	at org.apache.lucene.util.TestRuleMarkFailure$1.evaluate(TestRuleMarkFailure.java:47)
	at com.carrotsearch.randomizedtesting.rules.StatementAdapter.evaluate(StatementAdapter.java:36)
	at com.carrotsearch.randomizedtesting.ThreadLeakControl$StatementRunner.run(ThreadLeakControl.java:367)
	at com.carrotsearch.randomizedtesting.ThreadLeakControl.forkTimeoutingTask(ThreadLeakControl.java:809)
	at com.carrotsearch.randomizedtesting.ThreadLeakControl$3.evaluate(ThreadLeakControl.java:460)
	at com.carrotsearch.randomizedtesting.RandomizedRunner.runSingleTest(RandomizedRunner.java:880)
	at com.carrotsearch.randomizedtesting.RandomizedRunner$5.evaluate(RandomizedRunner.java:781)
	at com.carrotsearch.randomizedtesting.RandomizedRunner$6.evaluate(RandomizedRunner.java:816)
	at com.carrotsearch.randomizedtesting.RandomizedRunner$7.evaluate(RandomizedRunner.java:827)
	at com.carrotsearch.randomizedtesting.rules.StatementAdapter.evaluate(StatementAdapter.java:36)
	at com.carrotsearch.randomizedtesting.rules.SystemPropertiesRestoreRule$1.evaluate(SystemPropertiesRestoreRule.java:57)
	at org.apache.lucene.util.AbstractBeforeAfterRule$1.evaluate(AbstractBeforeAfterRule.java:45)
	at com.carrotsearch.randomizedtesting.rules.StatementAdapter.evaluate(StatementAdapter.java:36)
	at org.apache.lucene.util.TestRuleStoreClassName$1.evaluate(TestRuleStoreClassName.java:41)
	at com.carrotsearch.randomizedtesting.rules.NoShadowingOrOverridesOnMethodsRule$1.evaluate(NoShadowingOrOverridesOnMethodsRule.java:40)
	at com.carrotsearch.randomizedtesting.rules.NoShadowingOrOverridesOnMethodsRule$1.evaluate(NoShadowingOrOverridesOnMethodsRule.java:40)
	at com.carrotsearch.randomizedtesting.rules.StatementAdapter.evaluate(StatementAdapter.java:36)
	at com.carrotsearch.randomizedtesting.rules.StatementAdapter.evaluate(StatementAdapter.java:36)
	at com.carrotsearch.randomizedtesting.rules.StatementAdapter.evaluate(StatementAdapter.java:36)
	at org.apache.lucene.util.TestRuleAssertionsRequired$1.evaluate(TestRuleAssertionsRequired.java:53)
	at org.apache.lucene.util.TestRuleMarkFailure$1.evaluate(TestRuleMarkFailure.java:47)
	at org.apache.lucene.util.TestRuleIgnoreAfterMaxFailures$1.evaluate(TestRuleIgnoreAfterMaxFailures.java:64)
	at org.apache.lucene.util.TestRuleIgnoreTestSuites$1.evaluate(TestRuleIgnoreTestSuites.java:54)
	at com.carrotsearch.randomizedtesting.rules.StatementAdapter.evaluate(StatementAdapter.java:36)
	at com.carrotsearch.randomizedtesting.ThreadLeakControl$StatementRunner.run(ThreadLeakControl.java:367)
	at java.lang.Thread.run(Thread.java:745)
Caused by: javax.net.ssl.SSLHandshakeException: sun.security.validator.ValidatorException: PKIX path building failed: sun.security.provider.certpath.SunCertPathBuilderException: unable to find valid certification path to requested target
	at sun.security.ssl.Alerts.getSSLException(Alerts.java:192)
	at sun.security.ssl.SSLSocketImpl.fatal(SSLSocketImpl.java:1949)
	at sun.security.ssl.Handshaker.fatalSE(Handshaker.java:302)
	at sun.security.ssl.Handshaker.fatalSE(Handshaker.java:296)
	at sun.security.ssl.ClientHandshaker.serverCertificate(ClientHandshaker.java:1509)
	at sun.security.ssl.ClientHandshaker.processMessage(ClientHandshaker.java:216)
	at sun.security.ssl.Handshaker.processLoop(Handshaker.java:979)
	at sun.security.ssl.Handshaker.process_record(Handshaker.java:914)
	at sun.security.ssl.SSLSocketImpl.readRecord(SSLSocketImpl.java:1062)
	at sun.security.ssl.SSLSocketImpl.performInitialHandshake(SSLSocketImpl.java:1375)
	at sun.security.ssl.SSLSocketImpl.startHandshake(SSLSocketImpl.java:1403)
	at sun.security.ssl.SSLSocketImpl.startHandshake(SSLSocketImpl.java:1387)
	at org.apache.http.conn.ssl.SSLSocketFactory.connectSocket(SSLSocketFactory.java:543)
	at org.apache.http.conn.ssl.SSLSocketFactory.connectSocket(SSLSocketFactory.java:409)
	at org.apache.http.impl.conn.DefaultClientConnectionOperator.openConnection(DefaultClientConnectionOperator.java:177)
	at org.apache.http.impl.conn.ManagedClientConnectionImpl.open(ManagedClientConnectionImpl.java:304)
	at org.apache.http.impl.client.DefaultRequestDirector.tryConnect(DefaultRequestDirector.java:611)
	at org.apache.http.impl.client.DefaultRequestDirector.execute(DefaultRequestDirector.java:446)
	at org.apache.http.impl.client.AbstractHttpClient.doExecute(AbstractHttpClient.java:882)
	at org.apache.http.impl.client.CloseableHttpClient.execute(CloseableHttpClient.java:82)
	at org.apache.http.impl.client.CloseableHttpClient.execute(CloseableHttpClient.java:107)
	at org.apache.http.impl.client.CloseableHttpClient.execute(CloseableHttpClient.java:55)
	at org.apache.solr.client.solrj.impl.HttpSolrClient.executeMethod(HttpSolrClient.java:497)
	... 43 more
Caused by: sun.security.validator.ValidatorException: PKIX path building failed: sun.security.provider.certpath.SunCertPathBuilderException: unable to find valid certification path to requested target
	at sun.security.validator.PKIXValidator.doBuild(PKIXValidator.java:387)
	at sun.security.validator.PKIXValidator.engineValidate(PKIXValidator.java:292)
	at sun.security.validator.Validator.validate(Validator.java:260)
	at sun.security.ssl.X509TrustManagerImpl.validate(X509TrustManagerImpl.java:324)
	at sun.security.ssl.X509TrustManagerImpl.checkTrusted(X509TrustManagerImpl.java:229)
	at sun.security.ssl.X509TrustManagerImpl.checkServerTrusted(X509TrustManagerImpl.java:124)
	at sun.security.ssl.ClientHandshaker.serverCertificate(ClientHandshaker.java:1491)
	... 61 more
Caused by: sun.security.provider.certpath.SunCertPathBuilderException: unable to find valid certification path to requested target
	at sun.security.provider.certpath.SunCertPathBuilder.build(SunCertPathBuilder.java:141)
	at sun.security.provider.certpath.SunCertPathBuilder.engineBuild(SunCertPathBuilder.java:126)
	at java.security.cert.CertPathBuilder.build(CertPathBuilder.java:280)
	at sun.security.validator.PKIXValidator.doBuild(PKIXValidator.java:382)
	... 67 more




Build Log:
[...truncated 12444 lines...]
   [junit4] Suite: org.apache.solr.security.BasicAuthIntegrationTest
   [junit4]   2> Creating dataDir: /Users/jenkins/workspace/Lucene-Solr-6.x-MacOSX/solr/build/solr-core/test/J0/temp/solr.security.BasicAuthIntegrationTest_27C80B2E893BBF1F-001/init-core-data-001
   [junit4]   2> 3788878 INFO  (SUITE-BasicAuthIntegrationTest-seed#[27C80B2E893BBF1F]-worker) [    ] o.a.s.SolrTestCaseJ4 Randomized ssl (true) and clientAuth (false) via: @org.apache.solr.util.RandomizeSSL(reason=, value=NaN, ssl=NaN, clientAuth=NaN) w/ MAC_OS_X supressed clientAuth
   [junit4]   2> 3788880 INFO  (SUITE-BasicAuthIntegrationTest-seed#[27C80B2E893BBF1F]-worker) [    ] o.a.s.c.ZkTestServer STARTING ZK TEST SERVER
   [junit4]   2> 3788880 INFO  (Thread-5718) [    ] o.a.s.c.ZkTestServer client port:0.0.0.0/0.0.0.0:0
   [junit4]   2> 3788880 INFO  (Thread-5718) [    ] o.a.s.c.ZkTestServer Starting server
   [junit4]   2> 3788990 INFO  (SUITE-BasicAuthIntegrationTest-seed#[27C80B2E893BBF1F]-worker) [    ] o.a.s.c.ZkTestServer start zk server on port:63601
   [junit4]   2> 3788990 INFO  (SUITE-BasicAuthIntegrationTest-seed#[27C80B2E893BBF1F]-worker) [    ] o.a.s.c.c.SolrZkClient Using default ZkCredentialsProvider
   [junit4]   2> 3788991 INFO  (SUITE-BasicAuthIntegrationTest-seed#[27C80B2E893BBF1F]-worker) [    ] o.a.s.c.c.ConnectionManager Waiting for client to connect to ZooKeeper
   [junit4]   2> 3789018 INFO  (zkCallback-10104-thread-1) [    ] o.a.s.c.c.ConnectionManager Watcher org.apache.solr.common.cloud.ConnectionManager@391e93f1 name:ZooKeeperConnection Watcher:127.0.0.1:63601 got event WatchedEvent state:SyncConnected type:None path:null path:null type:None
   [junit4]   2> 3789018 INFO  (SUITE-BasicAuthIntegrationTest-seed#[27C80B2E893BBF1F]-worker) [    ] o.a.s.c.c.ConnectionManager Client is connected to ZooKeeper
   [junit4]   2> 3789018 INFO  (SUITE-BasicAuthIntegrationTest-seed#[27C80B2E893BBF1F]-worker) [    ] o.a.s.c.c.SolrZkClient Using default ZkACLProvider
   [junit4]   2> 3789019 INFO  (SUITE-BasicAuthIntegrationTest-seed#[27C80B2E893BBF1F]-worker) [    ] o.a.s.c.c.SolrZkClient makePath: /solr/solr.xml
   [junit4]   2> 3789022 INFO  (SUITE-BasicAuthIntegrationTest-seed#[27C80B2E893BBF1F]-worker) [    ] o.a.s.c.c.SolrZkClient makePath: /solr/clusterprops.json
   [junit4]   2> 3789028 INFO  (jetty-launcher-10103-thread-3) [    ] o.e.j.s.Server jetty-9.3.8.v20160314
   [junit4]   2> 3789028 INFO  (jetty-launcher-10103-thread-2) [    ] o.e.j.s.Server jetty-9.3.8.v20160314
   [junit4]   2> 3789028 INFO  (jetty-launcher-10103-thread-1) [    ] o.e.j.s.Server jetty-9.3.8.v20160314
   [junit4]   2> 3789030 INFO  (jetty-launcher-10103-thread-3) [    ] o.e.j.s.h.ContextHandler Started o.e.j.s.ServletContextHandler@6eb49141{/solr,null,AVAILABLE}
   [junit4]   2> 3789033 INFO  (jetty-launcher-10103-thread-2) [    ] o.e.j.s.h.ContextHandler Started o.e.j.s.ServletContextHandler@3f0fa821{/solr,null,AVAILABLE}
   [junit4]   2> 3789036 INFO  (jetty-launcher-10103-thread-1) [    ] o.e.j.s.h.ContextHandler Started o.e.j.s.ServletContextHandler@3cf96631{/solr,null,AVAILABLE}
   [junit4]   2> 3789037 INFO  (jetty-launcher-10103-thread-3) [    ] o.e.j.s.ServerConnector Started ServerConnector@7f82313c{SSL,[ssl, http/1.1]}{127.0.0.1:63603}
   [junit4]   2> 3789037 INFO  (jetty-launcher-10103-thread-3) [    ] o.e.j.s.Server Started @3795578ms
   [junit4]   2> 3789037 INFO  (jetty-launcher-10103-thread-3) [    ] o.a.s.c.s.e.JettySolrRunner Jetty properties: {hostContext=/solr, hostPort=63603}
   [junit4]   2> 3789037 INFO  (jetty-launcher-10103-thread-3) [    ] o.a.s.s.SolrDispatchFilter SolrDispatchFilter.init(): sun.misc.Launcher$AppClassLoader@4554617c
   [junit4]   2> 3789037 INFO  (jetty-launcher-10103-thread-3) [    ] o.a.s.c.SolrResourceLoader new SolrResourceLoader for directory: '/Users/jenkins/workspace/Lucene-Solr-6.x-MacOSX/solr/build/solr-core/test/J0/temp/solr.security.BasicAuthIntegrationTest_27C80B2E893BBF1F-001/tempDir-001/node3'
   [junit4]   2> 3789037 INFO  (jetty-launcher-10103-thread-1) [    ] o.e.j.s.ServerConnector Started ServerConnector@1e9705c7{SSL,[ssl, http/1.1]}{127.0.0.1:63605}
   [junit4]   2> 3789037 INFO  (jetty-launcher-10103-thread-3) [    ] o.a.s.c.SolrResourceLoader JNDI not configured for solr (NoInitialContextEx)
   [junit4]   2> 3789037 INFO  (jetty-launcher-10103-thread-1) [    ] o.e.j.s.Server Started @3795578ms
   [junit4]   2> 3789037 INFO  (jetty-launcher-10103-thread-3) [    ] o.a.s.c.SolrResourceLoader solr home defaulted to 'solr/' (could not find system property or JNDI)
   [junit4]   2> 3789037 INFO  (jetty-launcher-10103-thread-1) [    ] o.a.s.c.s.e.JettySolrRunner Jetty properties: {hostContext=/solr, hostPort=63605}
   [junit4]   2> 3789038 INFO  (jetty-launcher-10103-thread-1) [    ] o.a.s.s.SolrDispatchFilter SolrDispatchFilter.init(): sun.misc.Launcher$AppClassLoader@4554617c
   [junit4]   2> 3789038 INFO  (jetty-launcher-10103-thread-1) [    ] o.a.s.c.SolrResourceLoader new SolrResourceLoader for directory: '/Users/jenkins/workspace/Lucene-Solr-6.x-MacOSX/solr/build/solr-core/test/J0/temp/solr.security.BasicAuthIntegrationTest_27C80B2E893BBF1F-001/tempDir-001/node1'
   [junit4]   2> 3789038 INFO  (jetty-launcher-10103-thread-2) [    ] o.e.j.s.ServerConnector Started ServerConnector@2f61a74d{SSL,[ssl, http/1.1]}{127.0.0.1:63604}
   [junit4]   2> 3789038 INFO  (jetty-launcher-10103-thread-3) [    ] o.a.s.c.c.SolrZkClient Using default ZkCredentialsProvider
   [junit4]   2> 3789038 INFO  (jetty-launcher-10103-thread-2) [    ] o.e.j.s.Server Started @3795579ms
   [junit4]   2> 3789038 INFO  (jetty-launcher-10103-thread-2) [    ] o.a.s.c.s.e.JettySolrRunner Jetty properties: {hostContext=/solr, hostPort=63604}
   [junit4]   2> 3789038 INFO  (jetty-launcher-10103-thread-1) [    ] o.a.s.c.SolrResourceLoader JNDI not configured for solr (NoInitialContextEx)
   [junit4]   2> 3789038 INFO  (jetty-launcher-10103-thread-1) [    ] o.a.s.c.SolrResourceLoader solr home defaulted to 'solr/' (could not find system property or JNDI)
   [junit4]   2> 3789038 INFO  (jetty-launcher-10103-thread-2) [    ] o.a.s.s.SolrDispatchFilter SolrDispatchFilter.init(): sun.misc.Launcher$AppClassLoader@4554617c
   [junit4]   2> 3789038 INFO  (jetty-launcher-10103-thread-2) [    ] o.a.s.c.SolrResourceLoader new SolrResourceLoader for directory: '/Users/jenkins/workspace/Lucene-Solr-6.x-MacOSX/solr/build/solr-core/test/J0/temp/solr.security.BasicAuthIntegrationTest_27C80B2E893BBF1F-001/tempDir-001/node2'
   [junit4]   2> 3789038 INFO  (jetty-launcher-10103-thread-2) [    ] o.a.s.c.SolrResourceLoader JNDI not configured for solr (NoInitialContextEx)
   [junit4]   2> 3789038 INFO  (jetty-launcher-10103-thread-1) [    ] o.a.s.c.c.SolrZkClient Using default ZkCredentialsProvider
   [junit4]   2> 3789039 INFO  (jetty-launcher-10103-thread-2) [    ] o.a.s.c.SolrResourceLoader solr home defaulted to 'solr/' (could not find system property or JNDI)
   [junit4]   2> 3789039 INFO  (jetty-launcher-10103-thread-2) [    ] o.a.s.c.c.SolrZkClient Using default ZkCredentialsProvider
   [junit4]   2> 3789039 INFO  (jetty-launcher-10103-thread-3) [    ] o.a.s.c.c.ConnectionManager Waiting for client to connect to ZooKeeper
   [junit4]   2> 3789040 INFO  (jetty-launcher-10103-thread-1) [    ] o.a.s.c.c.ConnectionManager Waiting for client to connect to ZooKeeper
   [junit4]   2> 3789040 INFO  (jetty-launcher-10103-thread-2) [    ] o.a.s.c.c.ConnectionManager Waiting for client to connect to ZooKeeper
   [junit4]   2> 3789042 INFO  (zkCallback-10105-thread-1) [    ] o.a.s.c.c.ConnectionManager Watcher org.apache.solr.common.cloud.ConnectionManager@4d0a81b5 name:ZooKeeperConnection Watcher:127.0.0.1:63601/solr got event WatchedEvent state:SyncConnected type:None path:null path:null type:None
   [junit4]   2> 3789042 INFO  (jetty-launcher-10103-thread-3) [    ] o.a.s.c.c.ConnectionManager Client is connected to ZooKeeper
   [junit4]   2> 3789042 INFO  (jetty-launcher-10103-thread-3) [    ] o.a.s.c.c.SolrZkClient Using default ZkACLProvider
   [junit4]   2> 3789042 INFO  (zkCallback-10106-thread-1) [    ] o.a.s.c.c.ConnectionManager Watcher org.apache.solr.common.cloud.ConnectionManager@5634c5a3 name:ZooKeeperConnection Watcher:127.0.0.1:63601/solr got event WatchedEvent state:SyncConnected type:None path:null path:null type:None
   [junit4]   2> 3789042 INFO  (jetty-launcher-10103-thread-1) [    ] o.a.s.c.c.ConnectionManager Client is connected to ZooKeeper
   [junit4]   2> 3789043 INFO  (jetty-launcher-10103-thread-1) [    ] o.a.s.c.c.SolrZkClient Using default ZkACLProvider
   [junit4]   2> 3789043 INFO  (zkCallback-10107-thread-1) [    ] o.a.s.c.c.ConnectionManager Watcher org.apache.solr.common.cloud.ConnectionManager@7d87bd0b name:ZooKeeperConnection Watcher:127.0.0.1:63601/solr got event WatchedEvent state:SyncConnected type:None path:null path:null type:None
   [junit4]   2> 3789043 INFO  (jetty-launcher-10103-thread-2) [    ] o.a.s.c.c.ConnectionManager Client is connected to ZooKeeper
   [junit4]   2> 3789043 INFO  (jetty-launcher-10103-thread-2) [    ] o.a.s.c.c.SolrZkClient Using default ZkACLProvider
   [junit4]   2> 3789043 INFO  (jetty-launcher-10103-thread-3) [    ] o.a.s.s.SolrDispatchFilter solr.xml found in ZooKeeper. Loading...
   [junit4]   2> 3789044 INFO  (jetty-launcher-10103-thread-1) [    ] o.a.s.s.SolrDispatchFilter solr.xml found in ZooKeeper. Loading...
   [junit4]   2> 3789044 INFO  (jetty-launcher-10103-thread-2) [    ] o.a.s.s.SolrDispatchFilter solr.xml found in ZooKeeper. Loading...
   [junit4]   2> 3789067 INFO  (jetty-launcher-10103-thread-2) [    ] o.a.s.c.CorePropertiesLocator Config-defined core root directory: /Users/jenkins/workspace/Lucene-Solr-6.x-MacOSX/solr/build/solr-core/test/J0/temp/solr.security.BasicAuthIntegrationTest_27C80B2E893BBF1F-001/tempDir-001/node2/.
   [junit4]   2> 3789067 INFO  (jetty-launcher-10103-thread-1) [    ] o.a.s.c.CorePropertiesLocator Config-defined core root directory: /Users/jenkins/workspace/Lucene-Solr-6.x-MacOSX/solr/build/solr-core/test/J0/temp/solr.security.BasicAuthIntegrationTest_27C80B2E893BBF1F-001/tempDir-001/node1/.
   [junit4]   2> 3789067 INFO  (jetty-launcher-10103-thread-2) [    ] o.a.s.c.CoreContainer New CoreContainer 450975600
   [junit4]   2> 3789068 INFO  (jetty-launcher-10103-thread-1) [    ] o.a.s.c.CoreContainer New CoreContainer 1733963973
   [junit4]   2> 3789068 INFO  (jetty-launcher-10103-thread-2) [    ] o.a.s.c.CoreContainer Loading cores into CoreContainer [instanceDir=/Users/jenkins/workspace/Lucene-Solr-6.x-MacOSX/solr/build/solr-core/test/J0/temp/solr.security.BasicAuthIntegrationTest_27C80B2E893BBF1F-001/tempDir-001/node2]
   [junit4]   2> 3789068 INFO  (jetty-launcher-10103-thread-1) [    ] o.a.s.c.CoreContainer Loading cores into CoreContainer [instanceDir=/Users/jenkins/workspace/Lucene-Solr-6.x-MacOSX/solr/build/solr-core/test/J0/temp/solr.security.BasicAuthIntegrationTest_27C80B2E893BBF1F-001/tempDir-001/node1]
   [junit4]   2> 3789068 WARN  (jetty-launcher-10103-thread-2) [    ] o.a.s.c.CoreContainer Couldn't add files from /Users/jenkins/workspace/Lucene-Solr-6.x-MacOSX/solr/build/solr-core/test/J0/temp/solr.security.BasicAuthIntegrationTest_27C80B2E893BBF1F-001/tempDir-001/node2/lib to classpath: /Users/jenkins/workspace/Lucene-Solr-6.x-MacOSX/solr/build/solr-core/test/J0/temp/solr.security.BasicAuthIntegrationTest_27C80B2E893BBF1F-001/tempDir-001/node2/lib
   [junit4]   2> 3789067 WARN  (NIOServerCxn.Factory:0.0.0.0/0.0.0.0:0) [    ] o.a.z.s.NIOServerCnxn caught end of stream exception
   [junit4]   2> EndOfStreamException: Unable to read additional data from client sessionid 0x1571aba94d10002, likely client has closed socket
   [junit4]   2> 	at org.apache.zookeeper.server.NIOServerCnxn.doIO(NIOServerCnxn.java:228)
   [junit4]   2> 	at org.apache.zookeeper.server.NIOServerCnxnFactory.run(NIOServerCnxnFactory.java:208)
   [junit4]   2> 	at java.lang.Thread.run(Thread.java:745)
   [junit4]   2> 3789068 INFO  (jetty-launcher-10103-thread-2) [    ] o.a.s.h.c.HttpShardHandlerFactory created with socketTimeout : 90000,urlScheme : https,connTimeout : 15000,maxConnectionsPerHost : 20,maxConnections : 10000,corePoolSize : 0,maximumPoolSize : 2147483647,maxThreadIdleTime : 5,sizeOfQueue : -1,fairnessPolicy : false,useRetries : false,connectionsEvictorSleepDelay : 5000,maxConnectionIdleTime : 40000,
   [junit4]   2> 3789069 WARN  (NIOServerCxn.Factory:0.0.0.0/0.0.0.0:0) [    ] o.a.z.s.NIOServerCnxn caught end of stream exception
   [junit4]   2> EndOfStreamException: Unable to read additional data from client sessionid 0x1571aba94d10001, likely client has closed socket
   [junit4]   2> 	at org.apache.zookeeper.server.NIOServerCnxn.doIO(NIOServerCnxn.java:228)
   [junit4]   2> 	at org.apache.zookeeper.server.NIOServerCnxnFactory.run(NIOServerCnxnFactory.java:208)
   [junit4]   2> 	at java.lang.Thread.run(Thread.java:745)
   [junit4]   2> 3789068 WARN  (jetty-launcher-10103-thread-1) [    ] o.a.s.c.CoreContainer Couldn't add files from /Users/jenkins/workspace/Lucene-Solr-6.x-MacOSX/solr/build/solr-core/test/J0/temp/solr.security.BasicAuthIntegrationTest_27C80B2E893BBF1F-001/tempDir-001/node1/lib to classpath: /Users/jenkins/workspace/Lucene-Solr-6.x-MacOSX/solr/build/solr-core/test/J0/temp/solr.security.BasicAuthIntegrationTest_27C80B2E893BBF1F-001/tempDir-001/node1/lib
   [junit4]   2> 3789069 INFO  (jetty-launcher-10103-thread-1) [    ] o.a.s.h.c.HttpShardHandlerFactory created with socketTimeout : 90000,urlScheme : https,connTimeout : 15000,maxConnectionsPerHost : 20,maxConnections : 10000,corePoolSize : 0,maximumPoolSize : 2147483647,maxThreadIdleTime : 5,sizeOfQueue : -1,fairnessPolicy : false,useRetries : false,connectionsEvictorSleepDelay : 5000,maxConnectionIdleTime : 40000,
   [junit4]   2> 3789068 INFO  (jetty-launcher-10103-thread-3) [    ] o.a.s.c.CorePropertiesLocator Config-defined core root directory: /Users/jenkins/workspace/Lucene-Solr-6.x-MacOSX/solr/build/solr-core/test/J0/temp/solr.security.BasicAuthIntegrationTest_27C80B2E893BBF1F-001/tempDir-001/node3/.
   [junit4]   2> 3789069 INFO  (jetty-launcher-10103-thread-3) [    ] o.a.s.c.CoreContainer New CoreContainer 1950606045
   [junit4]   2> 3789069 INFO  (jetty-launcher-10103-thread-3) [    ] o.a.s.c.CoreContainer Loading cores into CoreContainer [instanceDir=/Users/jenkins/workspace/Lucene-Solr-6.x-MacOSX/solr/build/solr-core/test/J0/temp/solr.security.BasicAuthIntegrationTest_27C80B2E893BBF1F-001/tempDir-001/node3]
   [junit4]   2> 3789069 WARN  (jetty-launcher-10103-thread-3) [    ] o.a.s.c.CoreContainer Couldn't add files from /Users/jenkins/workspace/Lucene-Solr-6.x-MacOSX/solr/build/solr-core/test/J0/temp/solr.security.BasicAuthIntegrationTest_27C80B2E893BBF1F-001/tempDir-001/node3/lib to classpath: /Users/jenkins/workspace/Lucene-Solr-6.x-MacOSX/solr/build/solr-core/test/J0/temp/solr.security.BasicAuthIntegrationTest_27C80B2E893BBF1F-001/tempDir-001/node3/lib
   [junit4]   2> 3789070 INFO  (jetty-launcher-10103-thread-3) [    ] o.a.s.h.c.HttpShardHandlerFactory created with socketTimeout : 90000,urlScheme : https,connTimeout : 15000,maxConnectionsPerHost : 20,maxConnections : 10000,corePoolSize : 0,maximumPoolSize : 2147483647,maxThreadIdleTime : 5,sizeOfQueue : -1,fairnessPolicy : false,useRetries : false,connectionsEvictorSleepDelay : 5000,maxConnectionIdleTime : 40000,
   [junit4]   2> 3789071 INFO  (jetty-launcher-10103-thread-2) [    ] o.a.s.u.UpdateShardHandler Creating UpdateShardHandler HTTP client with params: socketTimeout=340000&connTimeout=45000&retry=true
   [junit4]   2> 3789072 INFO  (jetty-launcher-10103-thread-3) [    ] o.a.s.u.UpdateShardHandler Creating UpdateShardHandler HTTP client with params: socketTimeout=340000&connTimeout=45000&retry=true
   [junit4]   2> 3789072 INFO  (jetty-launcher-10103-thread-1) [    ] o.a.s.u.UpdateShardHandler Creating UpdateShardHandler HTTP client with params: socketTimeout=340000&connTimeout=45000&retry=true
   [junit4]   2> 3789072 INFO  (jetty-launcher-10103-thread-2) [    ] o.a.s.l.LogWatcher SLF4J impl is org.slf4j.impl.Log4jLoggerFactory
   [junit4]   2> 3789072 INFO  (jetty-launcher-10103-thread-2) [    ] o.a.s.l.LogWatcher Registering Log Listener [Log4j (org.slf4j.impl.Log4jLoggerFactory)]
   [junit4]   2> 3789072 INFO  (jetty-launcher-10103-thread-2) [    ] o.a.s.c.ZkContainer Zookeeper client=127.0.0.1:63601/solr
   [junit4]   2> 3789072 INFO  (jetty-launcher-10103-thread-2) [    ] o.a.s.c.ZkController zkHost includes chroot
   [junit4]   2> 3789072 INFO  (jetty-launcher-10103-thread-3) [    ] o.a.s.l.LogWatcher SLF4J impl is org.slf4j.impl.Log4jLoggerFactory
   [junit4]   2> 3789072 INFO  (jetty-launcher-10103-thread-2) [    ] o.a.s.c.c.SolrZkClient Using default ZkCredentialsProvider
   [junit4]   2> 3789072 INFO  (jetty-launcher-10103-thread-3) [    ] o.a.s.l.LogWatcher Registering Log Listener [Log4j (org.slf4j.impl.Log4jLoggerFactory)]
   [junit4]   2> 3789072 INFO  (jetty-launcher-10103-thread-3) [    ] o.a.s.c.ZkContainer Zookeeper client=127.0.0.1:63601/solr
   [junit4]   2> 3789073 INFO  (jetty-launcher-10103-thread-3) [    ] o.a.s.c.ZkController zkHost includes chroot
   [junit4]   2> 3789073 INFO  (jetty-launcher-10103-thread-3) [    ] o.a.s.c.c.SolrZkClient Using default ZkCredentialsProvider
   [junit4]   2> 3789073 INFO  (jetty-launcher-10103-thread-1) [    ] o.a.s.l.LogWatcher SLF4J impl is org.slf4j.impl.Log4jLoggerFactory
   [junit4]   2> 3789073 INFO  (jetty-launcher-10103-thread-1) [    ] o.a.s.l.LogWatcher Registering Log Listener [Log4j (org.slf4j.impl.Log4jLoggerFactory)]
   [junit4]   2> 3789073 INFO  (jetty-launcher-10103-thread-1) [    ] o.a.s.c.ZkContainer Zookeeper client=127.0.0.1:63601/solr
   [junit4]   2> 3789073 INFO  (jetty-launcher-10103-thread-1) [    ] o.a.s.c.ZkController zkHost includes chroot
   [junit4]   2> 3789073 INFO  (jetty-launcher-10103-thread-1) [    ] o.a.s.c.c.SolrZkClient Using default ZkCredentialsProvider
   [junit4]   2> 3789073 INFO  (jetty-launcher-10103-thread-2) [    ] o.a.s.c.c.ConnectionManager Waiting for client to connect to ZooKeeper
   [junit4]   2> 3789074 INFO  (jetty-launcher-10103-thread-1) [    ] o.a.s.c.c.ConnectionManager Waiting for client to connect to ZooKeeper
   [junit4]   2> 3789074 INFO  (jetty-launcher-10103-thread-3) [    ] o.a.s.c.c.ConnectionManager Waiting for client to connect to ZooKeeper
   [junit4]   2> 3789075 INFO  (zkCallback-10114-thread-1) [    ] o.a.s.c.c.ConnectionManager Watcher org.apache.solr.common.cloud.ConnectionManager@2be25e15 name:ZooKeeperConnection Watcher:127.0.0.1:63601 got event WatchedEvent state:SyncConnected type:None path:null path:null type:None
   [junit4]   2> 3789075 INFO  (jetty-launcher-10103-thread-2) [    ] o.a.s.c.c.ConnectionManager Client is connected to ZooKeeper
   [junit4]   2> 3789075 INFO  (zkCallback-10116-thread-1) [    ] o.a.s.c.c.ConnectionManager Watcher org.apache.solr.common.cloud.ConnectionManager@14a8132a name:ZooKeeperConnection Watcher:127.0.0.1:63601 got event WatchedEvent state:SyncConnected type:None path:null path:null type:None
   [junit4]   2> 3789075 INFO  (jetty-launcher-10103-thread-2) [    ] o.a.s.c.c.SolrZkClient Using default ZkACLProvider
   [junit4]   2> 3789075 INFO  (jetty-launcher-10103-thread-1) [    ] o.a.s.c.c.ConnectionManager Client is connected to ZooKeeper
   [junit4]   2> 3789075 INFO  (jetty-launcher-10103-thread-1) [    ] o.a.s.c.c.SolrZkClient Using default ZkACLProvider
   [junit4]   2> 3789076 INFO  (zkCallback-10115-thread-1) [    ] o.a.s.c.c.ConnectionManager Watcher org.apache.solr.common.cloud.ConnectionManager@47e9f149 name:ZooKeeperConnection Watcher:127.0.0.1:63601 got event WatchedEvent state:SyncConnected type:None path:null path:null type:None
   [junit4]   2> 3789076 INFO  (jetty-launcher-10103-thread-3) [    ] o.a.s.c.c.ConnectionManager Client is connected to ZooKeeper
   [junit4]   2> 3789076 INFO  (jetty-launcher-10103-thread-3) [    ] o.a.s.c.c.SolrZkClient Using default ZkACLProvider
   [junit4]   2> 3789077 INFO  (jetty-launcher-10103-thread-2) [n:127.0.0.1:63604_solr    ] o.a.s.c.ZkController Added new OnReconnect listener org.apache.solr.cloud.ZkController$$Lambda$69/1093425309@17507f87
   [junit4]   2> 3789077 INFO  (jetty-launcher-10103-thread-2) [n:127.0.0.1:63604_solr    ] o.a.s.c.c.ConnectionManager Waiting for client to connect to ZooKeeper
   [junit4]   2> 3789078 INFO  (jetty-launcher-10103-thread-1) [n:127.0.0.1:63605_solr    ] o.a.s.c.ZkController Added new OnReconnect listener org.apache.solr.cloud.ZkController$$Lambda$69/1093425309@15fb036b
   [junit4]   2> 3789078 WARN  (NIOServerCxn.Factory:0.0.0.0/0.0.0.0:0) [    ] o.a.z.s.NIOServerCnxn caught end of stream exception
   [junit4]   2> EndOfStreamException: Unable to read additional data from client sessionid 0x1571aba94d10005, likely client has closed socket
   [junit4]   2> 	at org.apache.zookeeper.server.NIOServerCnxn.doIO(NIOServerCnxn.java:228)
   [junit4]   2> 	at org.apache.zookeeper.server.NIOServerCnxnFactory.run(NIOServerCnxnFactory.java:208)
   [junit4]   2> 	at java.lang.Thread.run(Thread.java:745)
   [junit4]   2> 3789078 INFO  (jetty-launcher-10103-thread-1) [n:127.0.0.1:63605_solr    ] o.a.s.c.c.ConnectionManager Waiting for client to connect to ZooKeeper
   [junit4]   2> 3789078 WARN  (NIOServerCxn.Factory:0.0.0.0/0.0.0.0:0) [    ] o.a.z.s.NIOServerCnxn caught end of stream exception
   [junit4]   2> EndOfStreamException: Unable to read additional data from client sessionid 0x1571aba94d10006, likely client has closed socket
   [junit4]   2> 	at org.apache.zookeeper.server.NIOServerCnxn.doIO(NIOServerCnxn.java:228)
   [junit4]   2> 	at org.apache.zookeeper.server.NIOServerCnxnFactory.run(NIOServerCnxnFactory.java:208)
   [junit4]   2> 	at java.lang.Thread.run(Thread.java:745)
   [junit4]   2> 3789079 INFO  (jetty-launcher-10103-thread-3) [n:127.0.0.1:63603_solr    ] o.a.s.c.ZkController Added new OnReconnect listener org.apache.solr.cloud.ZkController$$Lambda$69/1093425309@166edf33
   [junit4]   2> 3789079 INFO  (jetty-launcher-10103-thread-3) [n:127.0.0.1:63603_solr    ] o.a.s.c.c.ConnectionManager Waiting for client to connect to ZooKeeper
   [junit4]   2> 3789079 INFO  (zkCallback-10117-thread-1-processing-n:127.0.0.1:63604_solr) [n:127.0.0.1:63604_solr    ] o.a.s.c.c.ConnectionManager Watcher org.apache.solr.common.cloud.ConnectionManager@219101aa name:ZooKeeperConnection Watcher:127.0.0.1:63601/solr got event WatchedEvent state:SyncConnected type:None path:null path:null type:None
   [junit4]   2> 3789080 INFO  (jetty-launcher-10103-thread-2) [n:127.0.0.1:63604_solr    ] o.a.s.c.c.ConnectionManager Client is connected to ZooKeeper
   [junit4]   2> 3789080 INFO  (zkCallback-10118-thread-1-processing-n:127.0.0.1:63605_solr) [n:127.0.0.1:63605_solr    ] o.a.s.c.c.ConnectionManager Watcher org.apache.solr.common.cloud.ConnectionManager@2db62c5d name:ZooKeeperConnection Watcher:127.0.0.1:63601/solr got event WatchedEvent state:SyncConnected type:None path:null path:null type:None
   [junit4]   2> 3789080 INFO  (jetty-launcher-10103-thread-1) [n:127.0.0.1:63605_solr    ] o.a.s.c.c.ConnectionManager Client is connected to ZooKeeper
   [junit4]   2> 3789080 INFO  (zkCallback-10119-thread-1-processing-n:127.0.0.1:63603_solr) [n:127.0.0.1:63603_solr    ] o.a.s.c.c.ConnectionManager Watcher org.apache.solr.common.cloud.ConnectionManager@51796f0 name:ZooKeeperConnection Watcher:127.0.0.1:63601/solr got event WatchedEvent state:SyncConnected type:None path:null path:null type:None
   [junit4]   2> 3789080 INFO  (jetty-launcher-10103-thread-3) [n:127.0.0.1:63603_solr    ] o.a.s.c.c.ConnectionManager Client is connected to ZooKeeper
   [junit4]   2> 3789082 INFO  (jetty-launcher-10103-thread-2) [n:127.0.0.1:63604_solr    ] o.a.s.c.c.SolrZkClient makePath: /overseer/queue
   [junit4]   2> 3789082 INFO  (jetty-launcher-10103-thread-1) [n:127.0.0.1:63605_solr    ] o.a.s.c.c.SolrZkClient makePath: /overseer/queue
   [junit4]   2> 3789082 INFO  (jetty-launcher-10103-thread-3) [n:127.0.0.1:63603_solr    ] o.a.s.c.c.SolrZkClient makePath: /overseer/queue
   [junit4]   2> 3789085 INFO  (jetty-launcher-10103-thread-1) [n:127.0.0.1:63605_solr    ] o.a.s.c.c.SolrZkClient makePath: /overseer/collection-queue-work
   [junit4]   2> 3789085 INFO  (jetty-launcher-10103-thread-3) [n:127.0.0.1:63603_solr    ] o.a.s.c.c.SolrZkClient makePath: /overseer/collection-queue-work
   [junit4]   2> 3789085 INFO  (jetty-launcher-10103-thread-2) [n:127.0.0.1:63604_solr    ] o.a.s.c.c.SolrZkClient makePath: /overseer/collection-queue-work
   [junit4]   2> 3789090 INFO  (jetty-launcher-10103-thread-3) [n:127.0.0.1:63603_solr    ] o.a.s.c.c.SolrZkClient makePath: /overseer/collection-map-running
   [junit4]   2> 3789090 INFO  (jetty-launcher-10103-thread-1) [n:127.0.0.1:63605_solr    ] o.a.s.c.c.SolrZkClient makePath: /overseer/collection-map-running
   [junit4]   2> 3789090 INFO  (jetty-launcher-10103-thread-2) [n:127.0.0.1:63604_solr    ] o.a.s.c.c.SolrZkClient makePath: /overseer/collection-map-running
   [junit4]   2> 3789093 INFO  (jetty-launcher-10103-thread-1) [n:127.0.0.1:63605_solr    ] o.a.s.c.c.SolrZkClient makePath: /overseer/collection-map-completed
   [junit4]   2> 3789093 INFO  (jetty-launcher-10103-thread-2) [n:127.0.0.1:63604_solr    ] o.a.s.c.c.SolrZkClient makePath: /overseer/collection-map-completed
   [junit4]   2> 3789093 INFO  (jetty-launcher-10103-thread-3) [n:127.0.0.1:63603_solr    ] o.a.s.c.c.SolrZkClient makePath: /overseer/collection-map-completed
   [junit4]   2> 3789096 INFO  (jetty-launcher-10103-thread-2) [n:127.0.0.1:63604_solr    ] o.a.s.c.c.SolrZkClient makePath: /overseer/collection-map-failure
   [junit4]   2> 3789096 INFO  (jetty-launcher-10103-thread-3) [n:127.0.0.1:63603_solr    ] o.a.s.c.c.SolrZkClient makePath: /overseer/collection-map-failure
   [junit4]   2> 3789096 INFO  (jetty-launcher-10103-thread-1) [n:127.0.0.1:63605_solr    ] o.a.s.c.c.SolrZkClient makePath: /overseer/collection-map-failure
   [junit4]   2> 3789099 INFO  (jetty-launcher-10103-thread-3) [n:127.0.0.1:63603_solr    ] o.a.s.c.c.SolrZkClient makePath: /live_nodes
   [junit4]   2> 3789099 INFO  (jetty-launcher-10103-thread-1) [n:127.0.0.1:63605_solr    ] o.a.s.c.c.SolrZkClient makePath: /live_nodes
   [junit4]   2> 3789099 INFO  (jetty-launcher-10103-thread-2) [n:127.0.0.1:63604_solr    ] o.a.s.c.c.SolrZkClient makePath: /live_nodes
   [junit4]   2> 3789101 INFO  (jetty-launcher-10103-thread-1) [n:127.0.0.1:63605_solr    ] o.a.s.c.c.SolrZkClient makePath: /collections
   [junit4]   2> 3789101 INFO  (jetty-launcher-10103-thread-3) [n:127.0.0.1:63603_solr    ] o.a.s.c.c.SolrZkClient makePath: /collections
   [junit4]   2> 3789101 INFO  (jetty-launcher-10103-thread-2) [n:127.0.0.1:63604_solr    ] o.a.s.c.c.SolrZkClient makePath: /collections
   [junit4]   2> 3789103 INFO  (jetty-launcher-10103-thread-1) [n:127.0.0.1:63605_solr    ] o.a.s.c.c.SolrZkClient makePath: /aliases.json
   [junit4]   2> 3789103 INFO  (jetty-launcher-10103-thread-2) [n:127.0.0.1:63604_solr    ] o.a.s.c.c.SolrZkClient makePath: /aliases.json
   [junit4]   2> 3789103 INFO  (jetty-launcher-10103-thread-3) [n:127.0.0.1:63603_solr    ] o.a.s.c.c.SolrZkClient makePath: /aliases.json
   [junit4]   2> 3789105 INFO  (jetty-launcher-10103-thread-3) [n:127.0.0.1:63603_solr    ] o.a.s.c.c.SolrZkClient makePath: /clusterstate.json
   [junit4]   2> 3789105 INFO  (jetty-launcher-10103-thread-2) [n:127.0.0.1:63604_solr    ] o.a.s.c.c.SolrZkClient makePath: /clusterstate.json
   [junit4]   2> 3789105 INFO  (jetty-launcher-10103-thread-1) [n:127.0.0.1:63605_solr    ] o.a.s.c.c.SolrZkClient makePath: /clusterstate.json
   [junit4]   2> 3789106 INFO  (jetty-launcher-10103-thread-3) [n:127.0.0.1:63603_solr    ] o.a.s.c.c.SolrZkClient makePath: /security.json
   [junit4]   2> 3789106 INFO  (jetty-launcher-10103-thread-1) [n:127.0.0.1:63605_solr    ] o.a.s.c.c.SolrZkClient makePath: /security.json
   [junit4]   2> 3789107 INFO  (jetty-launcher-10103-thread-2) [n:127.0.0.1:63604_solr    ] o.a.s.c.c.SolrZkClient makePath: /security.json
   [junit4]   2> 3789107 INFO  (jetty-launcher-10103-thread-1) [n:127.0.0.1:63605_solr    ] o.a.s.c.c.ZkStateReader Updating cluster state from ZooKeeper... 
   [junit4]   2> 3789108 INFO  (jetty-launcher-10103-thread-2) [n:127.0.0.1:63604_solr    ] o.a.s.c.c.ZkStateReader Updating cluster state from ZooKeeper... 
   [junit4]   2> 3789108 INFO  (jetty-launcher-10103-thread-3) [n:127.0.0.1:63603_solr    ] o.a.s.c.c.ZkStateReader Updating cluster state from ZooKeeper... 
   [junit4]   2> 3789109 INFO  (jetty-launcher-10103-thread-1) [n:127.0.0.1:63605_solr    ] o.a.s.c.c.ZkStateReader Loaded cluster properties: {urlScheme=https}
   [junit4]   2> 3789109 INFO  (jetty-launcher-10103-thread-2) [n:127.0.0.1:63604_solr    ] o.a.s.c.c.ZkStateReader Loaded cluster properties: {urlScheme=https}
   [junit4]   2> 3789109 INFO  (jetty-launcher-10103-thread-3) [n:127.0.0.1:63603_solr    ] o.a.s.c.c.ZkStateReader Loaded cluster properties: {urlScheme=https}
   [junit4]   2> 3789109 INFO  (jetty-launcher-10103-thread-1) [n:127.0.0.1:63605_solr    ] o.a.s.c.c.ZkStateReader Updated live nodes from ZooKeeper... (0) -> (0)
   [junit4]   2> 3789110 INFO  (jetty-launcher-10103-thread-2) [n:127.0.0.1:63604_solr    ] o.a.s.c.c.ZkStateReader Updated live nodes from ZooKeeper... (0) -> (0)
   [junit4]   2> 3789110 INFO  (jetty-launcher-10103-thread-3) [n:127.0.0.1:63603_solr    ] o.a.s.c.c.ZkStateReader Updated live nodes from ZooKeeper... (0) -> (0)
   [junit4]   2> 3789114 INFO  (jetty-launcher-10103-thread-1) [n:127.0.0.1:63605_solr    ] o.a.s.c.c.SolrZkClient makePath: /overseer_elect
   [junit4]   2> 3789114 INFO  (jetty-launcher-10103-thread-3) [n:127.0.0.1:63603_solr    ] o.a.s.c.c.SolrZkClient makePath: /overseer_elect
   [junit4]   2> 3789114 INFO  (jetty-launcher-10103-thread-2) [n:127.0.0.1:63604_solr    ] o.a.s.c.c.SolrZkClient makePath: /overseer_elect
   [junit4]   2> 3789116 INFO  (jetty-launcher-10103-thread-3) [n:127.0.0.1:63603_solr    ] o.a.s.c.c.SolrZkClient makePath: /overseer_elect/election
   [junit4]   2> 3789116 INFO  (jetty-launcher-10103-thread-2) [n:127.0.0.1:63604_solr    ] o.a.s.c.c.SolrZkClient makePath: /overseer_elect/election
   [junit4]   2> 3789116 INFO  (jetty-launcher-10103-thread-1) [n:127.0.0.1:63605_solr    ] o.a.s.c.c.SolrZkClient makePath: /overseer_elect/election
   [junit4]   2> 3789117 INFO  (jetty-launcher-10103-thread-2) [n:127.0.0.1:63604_solr    ] o.a.s.c.Overseer Overseer (id=null) closing
   [junit4]   2> 3789118 INFO  (jetty-launcher-10103-thread-1) [n:127.0.0.1:63605_solr    ] o.a.s.c.Overseer Overseer (id=null) closing
   [junit4]   2> 3789118 INFO  (jetty-launcher-10103-thread-3) [n:127.0.0.1:63603_solr    ] o.a.s.c.Overseer Overseer (id=null) closing
   [junit4]   2> 3789118 INFO  (jetty-launcher-10103-thread-2) [n:127.0.0.1:63604_solr    ] o.a.s.c.LeaderElector Joined leadership election with path: /overseer_elect/election/96575305674719239-127.0.0.1:63604_solr-n_0000000000
   [junit4]   2> 3789118 INFO  (jetty-launcher-10103-thread-1) [n:127.0.0.1:63605_solr    ] o.a.s.c.LeaderElector Joined leadership election with path: /overseer_elect/election/96575305674719240-127.0.0.1:63605_solr-n_0000000001
   [junit4]   2> 3789118 INFO  (jetty-launcher-10103-thread-3) [n:127.0.0.1:63603_solr    ] o.a.s.c.LeaderElector Joined leadership election with path: /overseer_elect/election/96575305674719241-127.0.0.1:63603_solr-n_0000000002
   [junit4]   2> 3789119 INFO  (jetty-launcher-10103-thread-2) [n:127.0.0.1:63604_solr    ] o.a.s.c.OverseerElectionContext I am going to be the leader 127.0.0.1:63604_solr
   [junit4]   2> 3789119 INFO  (jetty-launcher-10103-thread-2) [n:127.0.0.1:63604_solr    ] o.a.s.c.c.SolrZkClient makePath: /overseer_elect/leader
   [junit4]   2> 3789119 INFO  (jetty-launcher-10103-thread-1) [n:127.0.0.1:63605_solr    ] o.a.s.c.LeaderElector Watching path /overseer_elect/election/96575305674719239-127.0.0.1:63604_solr-n_0000000000 to know if I could be the leader
   [junit4]   2> 3789119 INFO  (jetty-launcher-10103-thread-3) [n:127.0.0.1:63603_solr    ] o.a.s.c.LeaderElector Watching path /overseer_elect/election/96575305674719240-127.0.0.1:63605_solr-n_0000000001 to know if I could be the leader
   [junit4]   2> 3789120 INFO  (jetty-launcher-10103-thread-1) [n:127.0.0.1:63605_solr    ] o.a.s.c.ZkController Register node as live in ZooKeeper:/live_nodes/127.0.0.1:63605_solr
   [junit4]   2> 3789120 INFO  (jetty-launcher-10103-thread-1) [n:127.0.0.1:63605_solr    ] o.a.s.c.c.SolrZkClient makePath: /live_nodes/127.0.0.1:63605_solr
   [junit4]   2> 3789120 INFO  (jetty-launcher-10103-thread-3) [n:127.0.0.1:63603_solr    ] o.a.s.c.ZkController Register node as live in ZooKeeper:/live_nodes/127.0.0.1:63603_solr
   [junit4]   2> 3789120 INFO  (jetty-launcher-10103-thread-3) [n:127.0.0.1:63603_solr    ] o.a.s.c.c.SolrZkClient makePath: /live_nodes/127.0.0.1:63603_solr
   [junit4]   2> 3789121 INFO  (jetty-launcher-10103-thread-2) [n:127.0.0.1:63604_solr    ] o.a.s.c.Overseer Overseer (id=96575305674719239-127.0.0.1:63604_solr-n_0000000000) starting
   [junit4]   2> 3789122 INFO  (zkCallback-10118-thread-1-processing-n:127.0.0.1:63605_solr) [n:127.0.0.1:63605_solr    ] o.a.s.c.c.ZkStateReader A live node change: [WatchedEvent state:SyncConnected type:NodeChildrenChanged path:/live_nodes], has occurred - updating... (live nodes size: [0])
   [junit4]   2> 3789122 INFO  (zkCallback-10117-thread-1-processing-n:127.0.0.1:63604_solr) [n:127.0.0.1:63604_solr    ] o.a.s.c.c.ZkStateReader A live node change: [WatchedEvent state:SyncConnected type:NodeChildrenChanged path:/live_nodes], has occurred - updating... (live nodes size: [0])
   [junit4]   2> 3789122 INFO  (zkCallback-10119-thread-1-processing-n:127.0.0.1:63603_solr) [n:127.0.0.1:63603_solr    ] o.a.s.c.c.ZkStateReader A live node change: [WatchedEvent state:SyncConnected type:NodeChildrenChanged path:/live_nodes], has occurred - updating... (live nodes size: [0])
   [junit4]   2> 3789123 INFO  (zkCallback-10118-thread-1-processing-n:127.0.0.1:63605_solr) [n:127.0.0.1:63605_solr    ] o.a.s.c.c.ZkStateReader Updated live nodes from ZooKeeper... (0) -> (2)
   [junit4]   2> 3789124 INFO  (zkCallback-10119-thread-1-processing-n:127.0.0.1:63603_solr) [n:127.0.0.1:63603_solr    ] o.a.s.c.c.ZkStateReader Updated live nodes from ZooKeeper... (0) -> (2)
   [junit4]   2> 3789124 INFO  (zkCallback-10117-thread-1-processing-n:127.0.0.1:63604_solr) [n:127.0.0.1:63604_solr    ] o.a.s.c.c.ZkStateReader Updated live nodes from ZooKeeper... (0) -> (2)
   [junit4]   2> 3789133 INFO  (jetty-launcher-10103-thread-2) [n:127.0.0.1:63604_solr    ] o.a.s.c.c.SolrZkClient makePath: /overseer/queue-work
   [junit4]   2> 3789134 INFO  (jetty-launcher-10103-thread-1) [n:127.0.0.1:63605_solr    ] o.a.s.c.CoreContainer Security conf doesn't exist. Skipping setup for authorization module.
   [junit4]   2> 3789135 INFO  (jetty-launcher-10103-thread-1) [n:127.0.0.1:63605_solr    ] o.a.s.c.CoreContainer No authentication plugin used.
   [junit4]   2> 3789138 INFO  (jetty-launcher-10103-thread-1) [n:127.0.0.1:63605_solr    ] o.a.s.c.CorePropertiesLocator Looking for core definitions underneath /Users/jenkins/workspace/Lucene-Solr-6.x-MacOSX/solr/build/solr-core/test/J0/temp/solr.security.BasicAuthIntegrationTest_27C80B2E893BBF1F-001/tempDir-001/node1/.
   [junit4]   2> 3789139 INFO  (jetty-launcher-10103-thread-1) [n:127.0.0.1:63605_solr    ] o.a.s.c.CorePropertiesLocator Found 0 core definitions
   [junit4]   2> 3789139 INFO  (jetty-launcher-10103-thread-3) [n:127.0.0.1:63603_solr    ] o.a.s.c.CoreContainer Security conf doesn't exist. Skipping setup for authorization module.
   [junit4]   2> 3789139 INFO  (jetty-launcher-10103-thread-3) [n:127.0.0.1:63603_solr    ] o.a.s.c.CoreContainer No authentication plugin used.
   [junit4]   2> 3789140 INFO  (jetty-launcher-10103-thread-3) [n:127.0.0.1:63603_solr    ] o.a.s.c.CorePropertiesLocator Looking for core definitions underneath /Users/jenkins/workspace/Lucene-Solr-6.x-MacOSX/solr/build/solr-core/test/J0/temp/solr.security.BasicAuthIntegrationTest_27C80B2E893BBF1F-001/tempDir-001/node3/.
   [junit4]   2> 3789140 INFO  (jetty-launcher-10103-thread-1) [n:127.0.0.1:63605_solr    ] o.a.s.s.SolrDispatchFilter user.dir=/Users/jenkins/workspace/Lucene-Solr-6.x-MacOSX/solr/build/solr-core/test/J0
   [junit4]   2> 3789140 INFO  (jetty-launcher-10103-thread-1) [n:127.0.0.1:63605_solr    ] o.a.s.s.SolrDispatchFilter SolrDispatchFilter.init() done
   [junit4]   2> 3789140 INFO  (jetty-launcher-10103-thread-3) [n:127.0.0.1:63603_solr    ] o.a.s.c.CorePropertiesLocator Found 0 core definitions
   [junit4]   2> 3789141 INFO  (jetty-launcher-10103-thread-3) [n:127.0.0.1:63603_solr    ] o.a.s.s.SolrDispatchFilter user.dir=/Users/jenkins/workspace/Lucene-Solr-6.x-MacOSX/solr/build/solr-core/test/J0
   [junit4]   2> 3789141 INFO  (jetty-launcher-10103-thread-3) [n:127.0.0.1:63603_solr    ] o.a.s.s.SolrDispatchFilter SolrDispatchFilter.init() done
   [junit4]   2> 3789144 INFO  (jetty-launcher-10103-thread-2) [n:127.0.0.1:63604_solr    ] o.a.s.c.OverseerAutoReplicaFailoverThread Starting OverseerAutoReplicaFailoverThread autoReplicaFailoverWorkLoopDelay=10000 autoReplicaFailoverWaitAfterExpiration=30000 autoReplicaFailoverBadNodeExpiration=60000
   [junit4]   2> 3789145 INFO  (OverseerCollectionConfigSetProcessor-96575305674719239-127.0.0.1:63604_solr-n_0000000000) [n:127.0.0.1:63604_solr    ] o.a.s.c.OverseerTaskProcessor Process current queue of overseer operations
   [junit4]   2> 3789145 INFO  (OverseerStateUpdate-96575305674719239-127.0.0.1:63604_solr-n_0000000000) [n:127.0.0.1:63604_solr    ] o.a.s.c.Overseer Starting to work on the main queue
   [junit4]   2> 3789146 INFO  (jetty-launcher-10103-thread-2) [n:127.0.0.1:63604_solr    ] o.a.s.c.ZkController Publish node=127.0.0.1:63604_solr as DOWN
   [junit4]   2> 3789147 INFO  (OverseerStateUpdate-96575305674719239-127.0.0.1:63604_solr-n_0000000000) [n:127.0.0.1:63604_solr    ] o.a.s.c.c.ZkStateReader Updated live nodes from ZooKeeper... (2) -> (2)
   [junit4]   2> 3789148 INFO  (jetty-launcher-10103-thread-2) [n:127.0.0.1:63604_solr    ] o.a.s.c.ZkController Register node as live in ZooKeeper:/live_nodes/127.0.0.1:63604_solr
   [junit4]   2> 3789148 INFO  (jetty-launcher-10103-thread-2) [n:127.0.0.1:63604_solr    ] o.a.s.c.c.SolrZkClient makePath: /live_nodes/127.0.0.1:63604_solr
   [junit4]   2> 3789150 INFO  (zkCallback-10119-thread-1-processing-n:127.0.0.1:63603_solr) [n:127.0.0.1:63603_solr    ] o.a.s.c.c.ZkStateReader A live node change: [WatchedEvent state:SyncConnected type:NodeChildrenChanged path:/live_nodes], has occurred - updating... (live nodes size: [2])
   [junit4]   2> 3789150 INFO  (zkCallback-10118-thread-1-processing-n:127.0.0.1:63605_solr) [n:127.0.0.1:63605_solr    ] o.a.s.c.c.ZkStateReader A live node change: [WatchedEvent state:SyncConnected type:NodeChildrenChanged path:/live_nodes], has occurred - updating... (live nodes size: [2])
   [junit4]   2> 3789150 INFO  (zkCallback-10117-thread-1-processing-n:127.0.0.1:63604_solr) [n:127.0.0.1:63604_solr    ] o.a.s.c.c.ZkStateReader A live node change: [WatchedEvent state:SyncConnected type:NodeChildrenChanged path:/live_nodes], has occurred - updating... (live nodes size: [2])
   [junit4]   2> 3789150 INFO  (OverseerStateUpdate-96575305674719239-127.0.0.1:63604_solr-n_0000000000) [n:127.0.0.1:63604_solr    ] o.a.s.c.Overseer processMessage: queueSize: 1, message = {
   [junit4]   2>   "operation":"downnode",
   [junit4]   2>   "node_name":"127.0.0.1:63604_solr"} current state version: 0
   [junit4]   2> 3789150 INFO  (OverseerStateUpdate-96575305674719239-127.0.0.1:63604_solr-n_0000000000) [n:127.0.0.1:63604_solr    ] o.a.s.c.o.NodeMutator DownNode state invoked for node: 127.0.0.1:63604_solr
   [junit4]   2> 3789151 INFO  (zkCallback-10119-thread-1-processing-n:127.0.0.1:63603_solr) [n:127.0.0.1:63603_solr    ] o.a.s.c.c.ZkStateReader Updated live nodes from ZooKeeper... (2) -> (3)
   [junit4]   2> 3789151 INFO  (zkCallback-10118-thread-1-processing-n:127.0.0.1:63605_solr) [n:127.0.0.1:63605_solr    ] o.a.s.c.c.ZkStateReader Updated live nodes from ZooKeeper... (2) -> (3)
   [junit4]   2> 3789151 INFO  (zkCallback-10117-thread-1-processing-n:127.0.0.1:63604_solr) [n:127.0.0.1:63604_solr    ] o.a.s.c.c.ZkStateReader Updated live nodes from ZooKeeper... (2) -> (3)
   [junit4]   2> 3789160 INFO  (jetty-launcher-10103-thread-2) [n:127.0.0.1:63604_solr    ] o.a.s.c.CoreContainer Security conf doesn't exist. Skipping setup for authorization module.
   [junit4]   2> 3789160 INFO  (jetty-launcher-10103-thread-2) [n:127.0.0.1:63604_solr    ] o.a.s.c.CoreContainer No authentication plugin used.
   [junit4]   2> 3789161 INFO  (jetty-launcher-10103-thread-2) [n:127.0.0.1:63604_solr    ] o.a.s.c.CorePropertiesLocator Looking for core definitions underneath /Users/jenkins/workspace/Lucene-Solr-6.x-MacOSX/solr/build/solr-core/test/J0/temp/solr.security.BasicAuthIntegrationTest_27C80B2E893BBF1F-001/tempDir-001/node2/.
   [junit4]   2> 3789162 INFO  (jetty-launcher-10103-thread-2) [n:127.0.0.1:63604_solr    ] o.a.s.c.CorePropertiesLocator Found 0 core definitions
   [junit4]   2> 3789163 INFO  (jetty-launcher-10103-thread-2) [n:127.0.0.1:63604_solr    ] o.a.s.s.SolrDispatchFilter user.dir=/Users/jenkins/workspace/Lucene-Solr-6.x-MacOSX/solr/build/solr-core/test/J0
   [junit4]   2> 3789163 INFO  (jetty-launcher-10103-thread-2) [n:127.0.0.1:63604_solr    ] o.a.s.s.SolrDispatchFilter SolrDispatchFilter.init() done
   [junit4]   2> 3789163 INFO  (SUITE-BasicAuthIntegrationTest-seed#[27C80B2E893BBF1F]-worker) [    ] o.a.s.c.c.SolrZkClient Using default ZkCredentialsProvider
   [junit4]   2> 3789164 INFO  (SUITE-BasicAuthIntegrationTest-seed#[27C80B2E893BBF1F]-worker) [    ] o.a.s.c.c.ConnectionManager Waiting for client to connect to ZooKeeper
   [junit4]   2> 3789165 INFO  (zkCallback-10123-thread-1) [    ] o.a.s.c.c.ConnectionManager Watcher org.apache.solr.common.cloud.ConnectionManager@4173af82 name:ZooKeeperConnection Watcher:127.0.0.1:63601 got event WatchedEvent state:SyncConnected type:None path:null path:null type:None
   [junit4]   2> 3789165 INFO  (SUITE-BasicAuthIntegrationTest-seed#[27C80B2E893BBF1F]-worker) [    ] o.a.s.c.c.ConnectionManager Client is connected to ZooKeeper
   [junit4]   2> 3789165 INFO  (SUITE-BasicAuthIntegrationTest-seed#[27C80B2E893BBF1F]-worker) [    ] o.a.s.c.c.SolrZkClient Using default ZkACLProvider
   [junit4]   2> 3789167 INFO  (SUITE-BasicAuthIntegrationTest-seed#[27C80B2E893BBF1F]-worker) [    ] o.a.s.c.c.SolrZkClient Using default ZkCredentialsProvider
   [junit4]   2> 3789168 INFO  (SUITE-BasicAuthIntegrationTest-seed#[27C80B2E893BBF1F]-worker) [    ] o.a.s.c.c.ConnectionManager Waiting for client to connect to ZooKeeper
   [junit4]   2> 3789169 INFO  (zkCallback-10126-thread-1) [    ] o.a.s.c.c.ConnectionManager Watcher org.apache.solr.common.cloud.ConnectionManager@44fe2f92 name:ZooKeeperConnection Watcher:127.0.0.1:63601/solr got event WatchedEvent state:SyncConnected type:None path:null path:null type:None
   [junit4]   2> 3789169 INFO  (SUITE-BasicAuthIntegrationTest-seed#[27C80B2E893BBF1F]-worker) [    ] o.a.s.c.c.ConnectionManager Client is connected to ZooKeeper
   [junit4]   2> 3789169 INFO  (SUITE-BasicAuthIntegrationTest-seed#[27C80B2E893BBF1F]-worker) [    ] o.a.s.c.c.SolrZkClient Using default ZkACLProvider
   [junit4]   2> 3789169 INFO  (SUITE-BasicAuthIntegrationTest-seed#[27C80B2E893BBF1F]-worker) [    ] o.a.s.c.c.ZkStateReader Updating cluster state from ZooKeeper... 
   [junit4]   2> 3789170 INFO  (SUITE-BasicAuthIntegrationTest-seed#[27C80B2E893BBF1F]-worker) [    ] o.a.s.c.c.ZkStateReader Loaded cluster properties: {urlScheme=https}
   [junit4]   2> 3789171 INFO  (SUITE-BasicAuthIntegrationTest-seed#[27C80B2E893BBF1F]-worker) [    ] o.a.s.c.c.ZkStateReader Updated live nodes from ZooKeeper... (0) -> (3)
   [junit4]   2> 3789173 INFO  (SUITE-BasicAuthIntegrationTest-seed#[27C80B2E893BBF1F]-worker) [    ] o.a.s.c.c.SolrZkClient makePath: /configs/conf/schema.xml
   [junit4]   2> 3789177 INFO  (SUITE-BasicAuthIntegrationTest-seed#[27C80B2E893BBF1F]-worker) [    ] o.a.s.c.c.SolrZkClient makePath: /configs/conf/solrconfig.xml
   [junit4]   2> 3789199 INFO  (qtp510864253-45069) [n:127.0.0.1:63605_solr    ] o.a.s.h.a.CollectionsHandler Invoked Collection Action :create with params replicationFactor=1&collection.configName=conf&name=authCollection&action=CREATE&numShards=3&wt=javabin&version=2 and sendToOCPQueue=true
   [junit4]   2> 3789202 INFO  (OverseerCollectionConfigSetProcessor-96575305674719239-127.0.0.1:63604_solr-n_0000000000) [n:127.0.0.1:63604_solr    ] o.a.s.c.OverseerTaskProcessor Overseer Collection Message Handler: Get the message id:/overseer/collection-queue-work/qn-0000000000 message:{
   [junit4]   2>   "name":"authCollection",
   [junit4]   2>   "fromApi":"true",
   [junit4]   2>   "replicationFactor":"1",
   [junit4]   2>   "collection.configName":"conf",
   [junit4]   2>   "numShards":"3",
   [junit4]   2>   "stateFormat":"2",
   [junit4]   2>   "operation":"create"}
   [junit4]   2> 3789203 INFO  (OverseerThreadFactory-13299-thread-1-processing-n:127.0.0.1:63604_solr) [n:127.0.0.1:63604_solr    ] o.a.s.c.OverseerCollectionMessageHandler OverseerCollectionMessageHandler.processMessage : create , {
   [junit4]   2>   "name":"authCollection",
   [junit4]   2>   "fromApi":"true",
   [junit4]   2>   "replicationFactor":"1",
   [junit4]   2>   "collection.configName":"conf",
   [junit4]   2>   "numShards":"3",
   [junit4]   2>   "stateFormat":"2",
   [junit4]   2>   "operation":"create"}
   [junit4]   2> 3789203 INFO  (OverseerThreadFactory-13299-thread-1-processing-n:127.0.0.1:63604_solr) [n:127.0.0.1:63604_solr    ] o.a.s.c.CreateCollectionCmd Create collection authCollection
   [junit4]   2> 3789203 INFO  (OverseerThreadFactory-13299-thread-1-processing-n:127.0.0.1:63604_solr) [n:127.0.0.1:63604_solr    ] o.a.s.c.OverseerCollectionMessageHandler creating collections conf node /collections/authCollection 
   [junit4]   2> 3789204 INFO  (OverseerThreadFactory-13299-thread-1-processing-n:127.0.0.1:63604_solr) [n:127.0.0.1:63604_solr    ] o.a.s.c.c.SolrZkClient makePath: /collections/authCollection
   [junit4]   2> 3789206 INFO  (zkCallback-10118-thread-1-processing-n:127.0.0.1:63605_solr) [n:127.0.0.1:63605_solr    ] o.a.s.c.c.ZkStateReader A collections change: [WatchedEvent state:SyncConnected type:NodeChildrenChanged path:/collections], has occurred - updating...
   [junit4]   2> 3789206 INFO  (zkCallback-10119-thread-1-processing-n:127.0.0.1:63603_solr) [n:127.0.0.1:63603_solr    ] o.a.s.c.c.ZkStateReader A collections change: [WatchedEvent state:SyncConnected type:NodeChildrenChanged path:/collections], has occurred - updating...
   [junit4]   2> 3789206 INFO  (zkCallback-10117-thread-1-processing-n:127.0.0.1:63604_solr) [n:127.0.0.1:63604_solr    ] o.a.s.c.c.ZkStateReader A collections change: [WatchedEvent state:SyncConnected type:NodeChildrenChanged path:/collections], has occurred - updating...
   [junit4]   2> 3789206 INFO  (zkCallback-10126-thread-1) [    ] o.a.s.c.c.ZkStateReader A collections change: [WatchedEvent state:SyncConnected type:NodeChildrenChanged path:/collections], has occurred - updating...
   [junit4]   2> 3789210 INFO  (OverseerStateUpdate-96575305674719239-127.0.0.1:63604_solr-n_0000000000) [n:127.0.0.1:63604_solr    ] o.a.s.c.Overseer processMessage: queueSize: 1, message = {
   [junit4]   2>   "name":"authCollection",
   [junit4]   2>   "fromApi":"true",
   [junit4]   2>   "replicationFactor":"1",
   [junit4]   2>   "collection.configName":"conf",
   [junit4]   2>   "numShards":"3",
   [junit4]   2>   "stateFormat":"2",
   [junit4]   2>   "operation":"create"} current state version: 0
   [junit4]   2> 3789210 INFO  (OverseerStateUpdate-96575305674719239-127.0.0.1:63604_solr-n_0000000000) [n:127.0.0.1:63604_solr    ] o.a.s.c.o.ClusterStateMutator building a new cName: authCollection
   [junit4]   2> 3789211 INFO  (OverseerStateUpdate-96575305674719239-127.0.0.1:63604_solr-n_0000000000) [n:127.0.0.1:63604_solr    ] o.a.s.c.o.ZkStateWriter going to create_collection /collections/authCollection/state.json
   [junit4]   2> 3789319 INFO  (OverseerThreadFactory-13299-thread-1-processing-n:127.0.0.1:63604_solr) [n:127.0.0.1:63604_solr    ] o.a.s.c.CreateCollectionCmd Creating SolrCores for new collection authCollection, shardNames [shard1, shard2, shard3] , replicationFactor : 1
   [junit4]   2> 3789319 INFO  (OverseerThreadFactory-13299-thread-1-processing-n:127.0.0.1:63604_solr) [n:127.0.0.1:63604_solr    ] o.a.s.c.CreateCollectionCmd Creating core authCollection_shard1_replica1 as part of shard shard1 of collection authCollection on 127.0.0.1:63603_solr
   [junit4]   2> 3789319 INFO  (OverseerThreadFactory-13299-thread-1-processing-n:127.0.0.1:63604_solr) [n:127.0.0.1:63604_solr    ] o.a.s.c.CreateCollectionCmd Creating core authCollection_shard2_replica1 as part of shard shard2 of collection authCollection on 127.0.0.1:63605_solr
   [junit4]   2> 3789319 INFO  (OverseerThreadFactory-13299-thread-1-processing-n:127.0.0.1:63604_solr) [n:127.0.0.1:63604_solr    ] o.a.s.c.CreateCollectionCmd Creating core authCollection_shard3_replica1 as part of shard shard3 of collection authCollection on 127.0.0.1:63604_solr
   [junit4]   2> 3789333 INFO  (qtp510864253-45072) [n:127.0.0.1:63605_solr    ] o.a.s.h.a.CoreAdminOperation core create command qt=/admin/cores&collection.configName=conf&name=authCollection_shard2_replica1&action=CREATE&numShards=3&collection=authCollection&shard=shard2&wt=javabin&version=2
   [junit4]   2> 3789334 INFO  (qtp510864253-45072) [n:127.0.0.1:63605_solr    ] o.a.s.c.CoreDescriptor Created CoreDescriptor: {name=authCollection_shard2_replica1, collection.configName=conf, config=solrconfig.xml, transient=false, schema=schema.xml, loadOnStartup=true, configSetProperties=configsetprops.json, collection=authCollection, numShards=3, dataDir=data/, shard=shard2}
   [junit4]   2> 3789334 INFO  (qtp510864253-45072) [n:127.0.0.1:63605_solr c:authCollection s:shard2  x:authCollection_shard2_replica1] o.a.s.c.ZkController publishing state=down
   [junit4]   2> 3789336 INFO  (qtp510864253-45072) [n:127.0.0.1:63605_solr c:authCollection s:shard2  x:authCollection_shard2_replica1] o.a.s.c.ZkController Registering watch for collection authCollection
   [junit4]   2> 3789337 INFO  (qtp510864253-45072) [n:127.0.0.1:63605_solr c:authCollection s:shard2  x:authCollection_shard2_replica1] o.a.s.c.c.ZkStateReader Add data for [authCollection] ver [0]
   [junit4]   2> 3789338 INFO  (qtp510864253-45072) [n:127.0.0.1:63605_solr c:authCollection s:shard2  x:authCollection_shard2_replica1] o.a.s.c.ZkController look for our core node name
   [junit4]   2> 3789338 INFO  (OverseerStateUpdate-96575305674719239-127.0.0.1:63604_solr-n_0000000000) [n:127.0.0.1:63604_solr    ] o.a.s.c.Overseer processMessage: queueSize: 1, message = {
   [junit4]   2>   "core":"authCollection_shard2_replica1",
   [junit4]   2>   "roles":null,
   [junit4]   2>   "base_url":"https://127.0.0.1:63605/solr",
   [junit4]   2>   "node_name":"127.0.0.1:63605_solr",
   [junit4]   2>   "numShards":"3",
   [junit4]   2>   "state":"down",
   [junit4]   2>   "shard":"shard2",
   [junit4]   2>   "collection":"authCollection",
   [junit4]   2>   "operation":"state"} current state version: 0
   [junit4]   2> 3789338 INFO  (OverseerStateUpdate-96575305674719239-127.0.0.1:63604_solr-n_0000000000) [n:127.0.0.1:63604_solr    ] o.a.s.c.o.ReplicaMutator Update state numShards=3 message={
   [junit4]   2>   "core":"authCollection_shard2_replica1",
   [junit4]   2>   "roles":null,
   [junit4]   2>   "base_url":"https://127.0.0.1:63605/solr",
   [junit4]   2>   "node_name":"127.0.0.1:63605_solr",
   [junit4]   2>   "numShards":"3",
   [junit4]   2>   "state":"down",
   [junit4]   2>   "shard":"shard2",
   [junit4]   2>   "collection":"authCollection",
   [junit4]   2>   "operation":"state"}
   [junit4]   2> 3789347 INFO  (qtp1533116156-45050) [n:127.0.0.1:63603_solr    ] o.a.s.h.a.CoreAdminOperation core create command qt=/admin/cores&collection.configName=conf&name=authCollection_shard1_replica1&action=CREATE&numShards=3&collection=authCollection&shard=shard1&wt=javabin&version=2
   [junit4]   2> 3789348 INFO  (qtp1533116156-45050) [n:127.0.0.1:63603_solr    ] o.a.s.c.CoreDescriptor Created CoreDescriptor: {name=authCollection_shard1_replica1, collection.configName=conf, config=solrconfig.xml, transient=false, schema=schema.xml, loadOnStartup=true, configSetProperties=configsetprops.json, collection=authCollection, numShards=3, dataDir=data/, shard=shard1}
   [junit4]   2> 3789349 INFO  (qtp1533116156-45050) [n:127.0.0.1:63603_solr c:authCollection s:shard1  x:authCollection_shard1_replica1] o.a.s.c.ZkController publishing state=down
   [junit4]   2> 3789349 INFO  (qtp231565691-45060) [n:127.0.0.1:63604_solr    ] o.a.s.h.a.CoreAdminOperation core create command qt=/admin/cores&collection.configName=conf&name=authCollection_shard3_replica1&action=CREATE&numShards=3&collection=authCollection&shard=shard3&wt=javabin&version=2
   [junit4]   2> 3789349 INFO  (qtp231565691-45060) [n:127.0.0.1:63604_solr    ] o.a.s.c.CoreDescriptor Created CoreDescriptor: {name=authCollection_shard3_replica1, collection.configName=conf, config=solrconfig.xml, transient=false, schema=schema.xml, loadOnStartup=true, configSetProperties=configsetprops.json, collection=authCollection, numShards=3, dataDir=data/, shard=shard3}
   [junit4]   2> 3789350 INFO  (qtp1533116156-45050) [n:127.0.0.1:63603_solr c:authCollection s:shard1  x:authCollection_shard1_replica1] o.a.s.c.ZkController Registering watch for collection authCollection
   [junit4]   2> 3789350 INFO  (qtp231565691-45060) [n:127.0.0.1:63604_solr c:authCollection s:shard3  x:authCollection_shard3_replica1] o.a.s.c.ZkController publishing state=down
   [junit4]   2> 3789352 INFO  (qtp1533116156-45050) [n:127.0.0.1:63603_solr c:authCollection s:shard1  x:authCollection_shard1_replica1] o.a.s.c.c.ZkStateReader Add data for [authCollection] ver [0]
   [junit4]   2> 3789352 INFO  (OverseerStateUpdate-96575305674719239-127.0.0.1:63604_solr-n_0000000000) [n:127.0.0.1:63604_solr    ] o.a.s.c.Overseer processMessage: queueSize: 1, message = {
   [junit4]   2>   "core":"authCollection_shard1_replica1",
   [junit4]   2>   "roles":null,
   [junit4]   2>   "base_url":"https://127.0.0.1:63603/solr",
   [junit4]   2>   "node_name":"127.0.0.1:63603_solr",
   [junit4]   2>   "numShards":"3",
   [junit4]   2>   "state":"down",
   [junit4]   2>   "shard":"shard1",
   [junit4]   2>   "collection":"authCollection",
   [junit4]   2>   "operation":"state"} current state version: 0
   [junit4]   2> 3789352 INFO  (OverseerStateUpdate-96575305674719239-127.0.0.1:63604_solr-n_0000000000) [n:127.0.0.1:63604_solr    ] o.a.s.c.o.ReplicaMutator Update state numShards=3 message={
   [junit4]   2>   "core":"authCollection_shard1_replica1",
   [junit4]   2>   "roles":null,
   [junit4]   2>   "base_url":"https://127.0.0.1:63603/solr",
   [junit4]   2>   "node_name":"127.0.0.1:63603_solr",
   [junit4]   2>   "numShards":"3",
   [junit4]   2>   "state":"down",
   [junit4]   2>   "shard":"shard1",
   [junit4]   2>   "collection":"authCollection",
   [junit4]   2>   "operation":"state"}
   [junit4]   2> 3789352 INFO  (qtp1533116156-45050) [n:127.0.0.1:63603_solr c:authCollection s:shard1  x:authCollection_shard1_replica1] o.a.s.c.ZkController look for our core node name
   [junit4]   2> 3789354 INFO  (qtp231565691-45060) [n:127.0.0.1:63604_solr c:authCollection s:shard3  x:authCollection_shard3_replica1] o.a.s.c.ZkController Registering watch for collection authCollection
   [junit4]   2> 3789354 INFO  (qtp231565691-45060) [n:127.0.0.1:63604_solr c:authCollection s:shard3  x:authCollection_shard3_replica1] o.a.s.c.c.ZkStateReader Add data for [authCollection] ver [0]
   [junit4]   2> 3789355 INFO  (qtp231565691-45060) [n:127.0.0.1:63604_solr c:authCollection s:shard3  x:authCollection_shard3_replica1] o.a.s.c.ZkController look for our core node name
   [junit4]   2> 3789356 INFO  (OverseerStateUpdate-96575305674719239-127.0.0.1:63604_solr-n_0000000000) [n:127.0.0.1:63604_solr    ] o.a.s.c.Overseer processMessage: queueSize: 2, message = {
   [junit4]   2>   "core":"authCollection_shard3_replica1",
   [junit4]   2>   "roles":null,
   [junit4]   2>   "base_url":"https://127.0.0.1:63604/solr",
   [junit4]   2>   "node_name":"127.0.0.1:63604_solr",
   [junit4]   2>   "numShards":"3",
   [junit4]   2>   "state":"down",
   [junit4]   2>   "shard":"shard3",
   [junit4]   2>   "collection":"authCollection",
   [junit4]   2>   "operation":"state"} current state version: 0
   [junit4]   2> 3789356 INFO  (OverseerStateUpdate-96575305674719239-127.0.0.1:63604_solr-n_0000000000) [n:127.0.0.1:63604_solr    ] o.a.s.c.o.ReplicaMutator Update state numShards=3 message={
   [junit4]   2>   "core":"authCollection_shard3_replica1",
   [junit4]   2>   "roles":null,
   [junit4]   2>   "base_url":"https://127.0.0.1:63604/solr",
   [junit4]   2>   "node_name":"127.0.0.1:63604_solr",
   [junit4]   2>   "numShards":"3",
   [junit4]   2>   "state":"down",
   [junit4]   2>   "shard":"shard3",
   [junit4]   2>   "collection":"authCollection",
   [junit4]   2>   "operation":"state"}
   [junit4]   2> 3789470 INFO  (OverseerStateUpdate-96575305674719239-127.0.0.1:63604_solr-n_0000000000) [n:127.0.0.1:63604_solr    ] o.a.s.c.o.ZkStateWriter going to update_collection /collections/authCollection/state.json version: 0
   [junit4]   2> 3789471 INFO  (zkCallback-10118-thread-1-processing-n:127.0.0.1:63605_solr) [n:127.0.0.1:63605_solr    ] o.a.s.c.c.ZkStateReader A cluster state change: [WatchedEvent state:SyncConnected type:NodeDataChanged path:/collections/authCollection/state.json] for collection [authCollection] has occurred - updating... (live nodes size: [3])
   [junit4]   2> 3789471 INFO  (zkCallback-10119-thread-1-processing-n:127.0.0.1:63603_solr) [n:127.0.0.1:63603_solr    ] o.a.s.c.c.ZkStateReader A cluster state change: [WatchedEvent state:SyncConnected type:NodeDataChanged path:/collections/authCollection/state.json] for collection [authCollection] has occurred - updating... (live nodes size: [3])
   [junit4]   2> 3789471 INFO  (zkCallback-10117-thread-3-processing-n:127.0.0.1:63604_solr) [n:127.0.0.1:63604_solr    ] o.a.s.c.c.ZkStateReader A cluster state change: [WatchedEvent state:SyncConnected type:NodeDataChanged path:/collections/authCollection/state.json] for collection [authCollection] has occurred - updating... (live nodes size: [3])
   [junit4]   2> 3789472 INFO  (zkCallback-10118-thread-1-processing-n:127.0.0.1:63605_solr) [n:127.0.0.1:63605_solr    ] o.a.s.c.c.ZkStateReader Updating data for [authCollection] from [0] to [1]
   [junit4]   2> 3789472 INFO  (zkCallback-10119-thread-1-processing-n:127.0.0.1:63603_solr) [n:127.0.0.1:63603_solr    ] o.a.s.c.c.ZkStateReader Updating data for [authCollection] from [0] to [1]
   [junit4]   2> 3789472 INFO  (zkCallback-10117-thread-3-processing-n:127.0.0.1:63604_solr) [n:127.0.0.1:63604_solr    ] o.a.s.c.c.ZkStateReader Updating data for [authCollection] from [0] to [1]
   [junit4]   2> 3790339 INFO  (qtp510864253-45072) [n:127.0.0.1:63605_solr c:authCollection s:shard2  x:authCollection_shard2_replica1] o.a.s.c.ZkController waiting to find shard id in clusterstate for authCollection_shard2_replica1
   [junit4]   2> 3790339 INFO  (qtp510864253-45072) [n:127.0.0.1:63605_solr c:authCollection s:shard2  x:authCollection_shard2_replica1] o.a.s.c.ZkController Check for collection zkNode:authCollection
   [junit4]   2> 3790340 INFO  (qtp510864253-45072) [n:127.0.0.1:63605_solr c:authCollection s:shard2  x:authCollection_shard2_replica1] o.a.s.c.ZkController Collection zkNode exists
   [junit4]   2> 3790340 INFO  (qtp510864253-45072) [n:127.0.0.1:63605_solr c:authCollection s:shard2  x:authCollection_shard2_replica1] o.a.s.c.c.ZkStateReader Load collection config from: [/collections/authCollection]
   [junit4]   2> 3790342 INFO  (qtp510864253-45072) [n:127.0.0.1:63605_solr c:authCollection s:shard2  x:authCollection_shard2_replica1] o.a.s.c.c.ZkStateReader path=[/collections/authCollection] [configName]=[conf] specified config exists in ZooKeeper
   [junit4]   2> 3790342 INFO  (qtp510864253-45072) [n:127.0.0.1:63605_solr c:authCollection s:shard2  x:authCollection_shard2_replica1] o.a.s.c.SolrResourceLoader new SolrResourceLoader for directory: '/Users/jenkins/workspace/Lucene-Solr-6.x-MacOSX/solr/build/solr-core/test/J0/temp/solr.security.BasicAuthIntegrationTest_27C80B2E893BBF1F-001/tempDir-001/node1/authCollection_shard2_replica1'
   [junit4]   2> 3790342 INFO  (qtp510864253-45072) [n:127.0.0.1:63605_solr c:authCollection s:shard2  x:authCollection_shard2_replica1] o.a.s.c.SolrResourceLoader JNDI not configured for solr (NoInitialContextEx)
   [junit4]   2> 3790342 INFO  (qtp510864253-45072) [n:127.0.0.1:63605_solr c:authCollection s:shard2  x:authCollection_shard2_replica1] o.a.s.c.SolrResourceLoader solr home defaulted to 'solr/' (could not find system property or JNDI)
   [junit4]   2> 3790345 INFO  (qtp510864253-45072) [n:127.0.0.1:63605_solr c:authCollection s:shard2  x:authCollection_shard2_replica1] o.a.s.c.Config loaded config solrconfig.xml with version 0 
   [junit4]   2> 3790348 INFO  (qtp510864253-45072) [n:127.0.0.1:63605_solr c:authCollection s:shard2  x:authCollection_shard2_replica1] o.a.s.c.SolrConfig current version of requestparams : -1
   [junit4]   2> 3790350 INFO  (qtp510864253-45072) [n:127.0.0.1:63605_solr c:authCollection s:shard2  x:authCollection_shard2_replica1] o.a.s.c.SolrConfig Using Lucene MatchVersion: 6.3.0
   [junit4]   2> 3790354 INFO  (qtp510864253-45072) [n:127.0.0.1:63605_solr c:authCollection s:shard2  x:authCollection_shard2_replica1] o.a.s.c.SolrConfig Loaded SolrConfig: solrconfig.xml
   [junit4]   2> 3790357 INFO  (qtp510864253-45072) [n:127.0.0.1:63605_solr c:authCollection s:shard2  x:authCollection_shard2_replica1] o.a.s.s.IndexSchema [authCollection_shard2_replica1] Schema name=minimal
   [junit4]   2> 3790361 INFO  (qtp510864253-45072) [n:127.0.0.1:63605_solr c:authCollection s:shard2  x:authCollection_shard2_replica1] o.a.s.s.IndexSchema unique key field: id
   [junit4]   2> 3790361 INFO  (qtp1533116156-45050) [n:127.0.0.1:63603_solr c:authCollection s:shard1  x:authCollection_shard1_replica1] o.a.s.c.ZkController waiting to find shard id in clusterstate for authCollection_shard1_replica1
   [junit4]   2> 3790361 INFO  (qtp231565691-45060) [n:127.0.0.1:63604_solr c:authCollection s:shard3  x:authCollection_shard3_replica1] o.a.s.c.ZkController waiting to find shard id in clusterstate for authCollection_shard3_replica1
   [junit4]   2> 3790361 INFO  (qtp1533116156-45050) [n:127.0.0.1:63603_solr c:authCollection s:shard1  x:authCollection_shard1_replica1] o.a.s.c.ZkController Check for collection zkNode:authCollection
   [junit4]   2> 3790361 INFO  (qtp231565691-45060) [n:127.0.0.1:63604_solr c:authCollection s:shard3  x:authCollection_shard3_replica1] o.a.s.c.ZkController Check for collection zkNode:authCollection
   [junit4]   2> 3790362 INFO  (qtp1533116156-45050) [n:127.0.0.1:63603_solr c:authCollection s:shard1  x:authCollection_shard1_replica1] o.a.s.c.ZkController Collection zkNode exists
   [junit4]   2> 3790362 INFO  (qtp231565691-45060) [n:127.0.0.1:63604_solr c:authCollection s:shard3  x:authCollection_shard3_replica1] o.a.s.c.ZkController Collection zkNode exists
   [junit4]   2> 3790362 INFO  (qtp1533116156-45050) [n:127.0.0.1:63603_solr c:authCollection s:shard1  x:authCollection_shard1_replica1] o.a.s.c.c.ZkStateReader Load collection config from: [/collections/authCollection]
   [junit4]   2> 3790362 INFO  (qtp231565691-45060) [n:127.0.0.1:63604_solr c:authCollection s:shard3  x:authCollection_shard3_replica1] o.a.s.c.c.ZkStateReader Load collection config from: [/collections/authCollection]
   [junit4]   2> 3790363 INFO  (qtp510864253-45072) [n:127.0.0.1:63605_solr c:authCollection s:shard2  x:authCollection_shard2_replica1] o.a.s.c.ConfigSetProperties Did not find ConfigSet properties, assuming default properties: Can't find resource 'configsetprops.json' in classpath or '/configs/conf', cwd=/Users/jenkins/workspace/Lucene-Solr-6.x-MacOSX/solr/build/solr-core/test/J0
   [junit4]   2> 3790363 INFO  (qtp510864253-45072) [n:127.0.0.1:63605_solr c:authCollection s:shard2  x:authCollection_shard2_replica1] o.a.s.c.CoreContainer Creating SolrCore 'authCollection_shard2_replica1' using configuration from collection authCollection
   [junit4]   2> 3790363 INFO  (qtp1533116156-45050) [n:127.0.0.1:63603_solr c:authCollection s:shard1  x:authCollection_shard1_replica1] o.a.s.c.c.ZkStateReader path=[/collections/authCollection] [configName]=[conf] specified config exists in ZooKeeper
   [junit4]   2> 3790363 INFO  (qtp1533116156-45050) [n:127.0.0.1:63603_solr c:authCollection s:shard1  x:authCollection_shard1_replica1] o.a.s.c.SolrResourceLoader new SolrResourceLoader for directory: '/Users/jenkins/workspace/Lucene-Solr-6.x-MacOSX/solr/build/solr-core/test/J0/temp/solr.security.BasicAuthIntegrationTest_27C80B2E893BBF1F-001/tempDir-001/node3/authCollection_shard1_replica1'
   [junit4]   2> 3790363 INFO  (qtp231565691-45060) [n:127.0.0.1:63604_solr c:authCollection s:shard3  x:authCollection_shard3_replica1] o.a.s.c.c.ZkStateReader path=[/collections/authCollection] [configName]=[conf] specified config exists in ZooKeeper
   [junit4]   2> 3790363 INFO  (qtp510864253-45072) [n:127.0.0.1:63605_solr c:authCollection s:shard2 r:core_node1 x:authCollection_shard2_replica1] o.a.s.c.SolrCore org.apache.solr.core.MockDirectoryFactory
   [junit4]   2> 3790364 INFO  (qtp231565691-45060) [n:127.0.0.1:63604_solr c:authCollection s:shard3  x:authCollection_shard3_replica1] o.a.s.c.SolrResourceLoader new SolrResourceLoader for directory: '/Users/jenkins/workspace/Lucene-Solr-6.x-MacOSX/solr/build/solr-core/test/J0/temp/solr.security.BasicAuthIntegrationTest_27C80B2E893BBF1F-001/tempDir-001/node2/authCollection_shard3_replica1'
   [junit4]   2> 3790364 INFO  (qtp510864253-45072) [n:127.0.0.1:63605_solr c:authCollection s:shard2 r:core_node1 x:authCollection_shard2_replica1] o.a.s.c.SolrCore [[authCollection_shard2_replica1] ] Opening new SolrCore at [/Users/jenkins/workspace/Lucene-Solr-6.x-MacOSX/solr/build/solr-core/test/J0/temp/solr.security.BasicAuthIntegrationTest_27C80B2E893BBF1F-001/tempDir-001/node1/authCollection_shard2_replica1], dataDir=[/Users/jenkins/workspace/Lucene-Solr-6.x-MacOSX/solr/build/solr-core/test/J0/temp/solr.security.BasicAuthIntegrationTest_27C80B2E893BBF1F-001/tempDir-001/node1/./authCollection_shard2_replica1/data/]
   [junit4]   2> 3790364 INFO  (qtp231565691-45060) [n:127.0.0.1:63604_solr c:authCollection s:shard3  x:authCollection_shard3_replica1] o.a.s.c.SolrResourceLoader JNDI not configured for solr (NoInitialContextEx)
   [junit4]   2> 3790364 INFO  (qtp510864253-45072) [n:127.0.0.1:63605_solr c:authCollection s:shard2 r:core_node1 x:authCollection_shard2_replica1] o.a.s.c.SolrCore JMX monitoring not detected for core: authCollection_shard2_replica1
   [junit4]   2> 3790364 INFO  (qtp231565691-45060) [n:127.0.0.1:63604_solr c:authCollection s:shard3  x:authCollection_shard3_replica1] o.a.s.c.SolrResourceLoader solr home defaulted to 'solr/' (could not find system property or JNDI)
   [junit4]   2> 3790364 INFO  (qtp1533116156-45050) [n:127.0.0.1:63603_solr c:authCollection s:shard1  x:authCollection_shard1_replica1] o.a.s.c.SolrResourceLoader JNDI not configured for solr (NoInitialContextEx)
   [junit4]   2> 3790364 INFO  (qtp1533116156-45050) [n:127.0.0.1:63603_solr c:authCollection s:shard1  x:authCollection_shard1_replica1] o.a.s.c.SolrResourceLoader solr home defaulted to 'solr/' (could not find system property or JNDI)
   [junit4]   2> 3790364 INFO  (qtp510864253-45072) [n:127.0.0.1:63605_solr c:authCollection s:shard2 r:core_node1 x:authCollection_shard2_replica1] o.a.s.c.CachingDirectoryFactory return new directory for /Users/jenkins/workspace/Lucene-Solr-6.x-MacOSX/solr/build/solr-core/test/J0/temp/solr.security.BasicAuthIntegrationTest_27C80B2E893BBF1F-001/tempDir-001/node1/./authCollection_shard2_replica1/data/snapshot_metadata
   [junit4]   2> 3790364 INFO  (qtp510864253-45072) [n:127.0.0.1:63605_solr c:authCollection s:shard2 r:core_node1 x:authCollection_shard2_replica1] o.a.s.c.s.SolrSnapshotMetaDataManager Loading from snapshot metadata file...
   [junit4]   2> 3790365 INFO  (qtp510864253-45072) [n:127.0.0.1:63605_solr c:authCollection s:shard2 r:core_node1 x:authCollection_shard2_replica1] o.a.s.c.CachingDirectoryFactory return new directory for /Users/jenkins/workspace/Lucene-Solr-6.x-MacOSX/solr/build/solr-core/test/J0/temp/solr.security.BasicAuthIntegrationTest_27C80B2E893BBF1F-001/tempDir-001/node1/./authCollection_shard2_replica1/data
   [junit4]   2> 3790365 INFO  (qtp510864253-45072) [n:127.0.0.1:63605_solr c:authCollection s:shard2 r:core_node1 x:authCollection_shard2_replica1] o.a.s.c.SolrCore New index directory detected: old=null new=/Users/jenkins/workspace/Lucene-Solr-6.x-MacOSX/solr/build/solr-core/test/J0/temp/solr.security.BasicAuthIntegrationTest_27C80B2E893BBF1F-001/tempDir-001/node1/./authCollection_shard2_replica1/data/index/
   [junit4]   2> 3790365 WARN  (qtp510864253-45072) [n:127.0.0.1:63605_solr c:authCollection s:shard2 r:core_node1 x:authCollection_shard2_replica1] o.a.s.c.SolrCore [authCollection_shard2_replica1] Solr index directory '/Users/jenkins/workspace/Lucene-Solr-6.x-MacOSX/solr/build/solr-core/test/J0/temp/solr.security.BasicAuthIntegrationTest_27C80B2E893BBF1F-001/tempDir-001/node1/./authCollection_shard2_replica1/data/index' doesn't exist. Creating new index...
   [junit4]   2> 3790365 INFO  (qtp510864253-45072) [n:127.0.0.1:63605_solr c:authCollection s:shard2 r:core_node1 x:authCollection_shard2_replica1] o.a.s.c.CachingDirectoryFactory return new directory for /Users/jenkins/workspace/Lucene-Solr-6.x-MacOSX/solr/build/solr-core/test/J0/temp/solr.security.BasicAuthIntegrationTest_27C80B2E893BBF1F-001/tempDir-001/node1/./authCollection_shard2_replica1/data/index
   [junit4]   2> 3790366 INFO  (qtp231565691-45060) [n:127.0.0.1:63604_solr c:authCollection s:shard3  x:authCollection_shard3_replica1] o.a.s.c.Config loaded config solrconfig.xml with version 0 
   [junit4]   2> 3790366 INFO  (qtp1533116156-45050) [n:127.0.0.1:63603_solr c:authCollection s:shard1  x:authCollection_shard1_replica1] o.a.s.c.Config loaded config solrconfig.xml with version 0 
   [junit4]   2> 3790367 INFO  (qtp510864253-45072) [n:127.0.0.1:63605_solr c:authCollection s:shard2 r:core_node1 x:authCollection_shard2_replica1] o.a.s.c.SolrDeletionPolicy SolrDeletionPolicy.onCommit: commits: num=1
   [junit4]   2> 	commit{dir=MockDirectoryWrapper(RAMDirectory@67a74af7 lockFactory=org.apache.lucene.store.SingleInstanceLockFactory@8711794),segFN=segments_1,generation=1}
   [junit4]   2> 3790367 INFO  (qtp510864253-45072) [n:127.0.0.1:63605_solr c:authCollection s:shard2 r:core_node1 x:authCollection_shard2_replica1] o.a.s.c.SolrDeletionPolicy newest commit generation = 1
   [junit4]   2> 3790367 INFO  (OldIndexDirectoryCleanupThreadForCore-authCollection_shard2_replica1) [n:127.0.0.1:63605_solr c:authCollection s:shard2 r:core_node1 x:authCollection_shard2_replica1] o.a.s.c.SolrCore Looking for old index directories to cleanup for core authCollection_shard2_replica1 in /Users/jenkins/workspace/Lucene-Solr-6.x-MacOSX/solr/build/solr-core/test/J0/temp/solr.security.BasicAuthIntegrationTest_27C80B2E893BBF1F-001/tempDir-001/node1/./authCollection_shard2_replica1/data/
   [junit4]   2> 3790368 WARN  (OldIndexDirectoryCleanupThreadForCore-authCollection_shard2_replica1) [n:127.0.0.1:63605_solr c:authCollection s:shard2 r:core_node1 x:authCollection_shard2_replica1] o.a.s.c.DirectoryFactory /Users/jenkins/workspace/Lucene-Solr-6.x-MacOSX/solr/build/solr-core/test/J0/temp/solr.security.BasicAuthIntegrationTest_27C80B2E893BBF1F-001/tempDir-001/node1/./authCollection_shard2_replica1/data/ does not point to a valid data directory; skipping clean-up of old index directories.
   [junit4]   2> 3790369 INFO  (qtp510864253-45072) [n:127.0.0.1:63605_solr c:authCollection s:shard2 r:core_node1 x:authCollection_shard2_replica1] o.a.s.c.SolrCore no updateRequestProcessorChain defined as default, creating implicit default
   [junit4]   2> 3790369 INFO  (qtp231565691-45060) [n:127.0.0.1:63604_solr c:authCollection s:shard3  x:authCollection_shard3_replica1] o.a.s.c.SolrConfig current version of requestparams : -1
   [junit4]   2> 3790369 INFO  (qtp1533116156-45050) [n:127.0.0.1:63603_solr c:authCollection s:shard1  x:authCollection_shard1_replica1] o.a.s.c.SolrConfig current version of requestparams : -1
   [junit4]   2> 3790371 INFO  (qtp231565691-45060) [n:127.0.0.1:63604_solr c:authCollection s:shard3  x:authCollection_shard3_replica1] o.a.s.c.SolrConfig Using Lucene MatchVersion: 6.3.0
   [junit4]   2> 3790371 INFO  (qtp1533116156-45050) [n:127.0.0.1:63603_solr c:authCollection s:shard1  x:authCollection_shard1_replica1] o.a.s.c.SolrConfig Using Lucene MatchVersion: 6.3.0
   [junit4]   2> 3790372 INFO  (qtp510864253-45072) [n:127.0.0.1:63605_solr c:authCollection s:shard2 r:core_node1 x:authCollection_shard2_replica1] o.a.s.h.l.XMLLoader xsltCacheLifetimeSeconds=60
   [junit4]   2> 3790374 INFO  (qtp510864253-45072) [n:127.0.0.1:63605_solr c:authCollection s:shard2 r:core_node1 x:authCollection_shard2_replica1] o.a.s.h.l.XMLLoader xsltCacheLifetimeSeconds=60
   [junit4]   2> 3790375 INFO  (qtp510864253-45072) [n:127.0.0.1:63605_solr c:authCollection s:shard2 r:core_node1 x:authCollection_shard2_replica1] o.a.s.h.l.XMLLoader xsltCacheLifetimeSeconds=60
   [junit4]   2> 3790375 INFO  (qtp231565691-45060) [n:127.0.0.1:63604_solr c:authCollection s:shard3  x:authCollection_shard3_replica1] o.a.s.c.SolrConfig Loaded SolrConfig: solrconfig.xml
   [junit4]   2> 3790375 INFO  (qtp1533116156-45050) [n:127.0.0.1:63603_solr c:authCollection s:shard1  x:authCollection_shard1_replica1] o.a.s.c.SolrConfig Loaded SolrConfig: solrconfig.xml
   [junit4]   2> 3790376 INFO  (qtp510864253-45072) [n:127.0.0.1:63605_solr c:authCollection s:shard2 r:core_node1 x:authCollection_shard2_replica1] o.a.s.h.l.XMLLoader xsltCacheLifetimeSeconds=60
   [junit4]   2> 3790378 INFO  (qtp510864253-45072) [n:127.0.0.1:63605_solr c:authCollection s:shard2 r:core_node1 x:authCollection_shard2_replica1] o.a.s.c.RequestHandlers Registered paths: /admin/mbeans,/update/json/docs,/admin/luke,/export,/get,/admin/properties,/update/json,/admin/threads,/update/csv,/sql,/graph,/select,/admin/segments,/admin/system,/replication,/config,/stream,/schema,/admin/plugins,/admin/logging,/admin/ping,/update,/admin/file,/terms
   [junit4]   2> 3790378 INFO  (qtp510864253-45072) [n:127.0.0.1:63605_solr c:authCollection s:shard2 r:core_node1 x:authCollection_shard2_replica1] o.a.s.c.SolrCore Using default statsCache cache: org.apache.solr.search.stats.LocalStatsCache
   [junit4]   2> 3790393 INFO  (qtp510864253-45072) [n:127.0.0.1:63605_solr c:authCollection s:shard2 r:core_node1 x:authCollection_shard2_replica1] o.a.s.u.UpdateHandler Using UpdateLog implementation: org.apache.solr.update.UpdateLog
   [junit4]   2> 3790393 INFO  (qtp510864253-45072) [n:127.0.0.1:63605_solr c:authCollection s:shard2 r:core_node1 x:authCollection_shard2_replica1] o.a.s.u.UpdateLog Initializing UpdateLog: dataDir=null defaultSyncLevel=FLUSH numRecordsToKeep=100 maxNumLogsToKeep=10 numVersionBuckets=65536
   [junit4]   2> 3790394 INFO  (qtp1533116156-45050) [n:127.0.0.1:63603_solr c:authCollection s:shard1  x:authCollection_shard1_replica1] o.a.s.s.IndexSchema [authCollection_shard1_replica1] Schema name=minimal
   [junit4]   2> 3790394 INFO  (qtp231565691-45060) [n:127.0.0.1:63604_solr c:authCollection s:shard3  x:authCollection_shard3_replica1] o.a.s.s.IndexSchema [authCollection_shard3_replica1] Schema name=minimal
   [junit4]   2> 3790395 INFO  (qtp510864253-45072) [n:127.0.0.1:63605_solr c:authCollection s:shard2 r:core_node1 x:authCollection_shard2_replica1] o.a.s.u.CommitTracker Hard AutoCommit: disabled
   [junit4]   2> 3790395 INFO  (qtp510864253-45072) [n:127.0.0.1:63605_solr c:authCollection s:shard2 r:core_node1 x:authCollection_shard2_replica1] o.a.s.u.CommitTracker Soft AutoCommit: disabled
   [junit4]   2> 3790395 INFO  (qtp510864253-45072) [n:127.0.0.1:63605_solr c:authCollection s:shard2 r:core_node1 x:authCollection_shard2_replica1] o.a.s.c.SolrDeletionPolicy SolrDeletionPolicy.onInit: commits: num=1
   [junit4]   2> 	commit{dir=MockDirectoryWrapper(RAMDirectory@67a74af7 lockFactory=org.apache.lucene.store.SingleInstanceLockFactory@8711794),segFN=segments_1,generation=1}
   [junit4]   2> 3790395 INFO  (qtp510864253-45072) [n:127.0.0.1:63605_solr c:authCollection s:shard2 r:core_node1 x:authCollection_shard2_replica1] o.a.s.c.SolrDeletionPolicy newest commit generation = 1
   [junit4]   2> 3790396 INFO  (qtp510864253-45072) [n:127.0.0.1:63605_solr c:authCollection s:shard2 r:core_node1 x:authCollection_shard2_replica1] o.a.s.s.SolrIndexSearcher Opening [Searcher@15544c69[authCollection_shard2_replica1] main]
   [junit4]   2> 3790396 INFO  (qtp510864253-45072) [n:127.0.0.1:63605_solr c:authCollection s:shard2 r:core_node1 x:authCollection_shard2_replica1] o.a.s.c.c.ZkStateReader Load collection config from: [/collections/authCollection]
   [junit4]   2> 3790396 INFO  (qtp231565691-45060) [n:127.0.0.1:63604_solr c:authCollection s:shard3  x:authCollection_shard3_replica1] o.a.s.s.IndexSchema unique key field: id
   [junit4]   2> 3790396 INFO  (qtp1533116156-45050) [n:127.0.0.1:63603_solr c:authCollection s:shard1  x:authCollection_shard1_replica1] o.a.s.s.IndexSchema unique key field: id
   [junit4]   2> 3790397 INFO  (qtp1533116156-45050) [n:127.0.0.1:63603_solr c:authCollection s:shard1  x:authCollection_shard1_replica1] o.a.s.c.ConfigSetProperties Did not find ConfigSet properties, assuming default properties: Can't find resource 'configsetprops.json' in classpath or '/configs/conf', cwd=/Users/jenkins/workspace/Lucene-Solr-6.x-MacOSX/solr/build/solr-core/test/J0
   [junit4]   2> 3790397 INFO  (qtp231565691-45060) [n:127.0.0.1:63604_solr c:authCollection s:shard3  x:authCollection_shard3_replica1] o.a.s.c.ConfigSetProperties Did not find ConfigSet properties, assuming default properties: Can't find resource 'configsetprops.json' in classpath or '/configs/conf', cwd=/Users/jenkins/workspace/Lucene-Solr-6.x-MacOSX/solr/build/solr-core/test/J0
   [junit4]   2> 3790397 INFO  (qtp231565691-45060) [n:127.0.0.1:63604_solr c:authCollection s:shard3  x:authCollection_shard3_replica1] o.a.s.c.CoreContainer Creating SolrCore 'authCollection_shard3_replica1' using configuration from collection authCollection
   [junit4]   2> 3790397 INFO  (qtp1533116156-45050) [n:127.0.0.1:63603_solr c:authCollection s:shard1  x:authCollection_shard1_replica1] o.a.s.c.CoreContainer Creating SolrCore 'authCollection_shard1_replica1' using configuration from collection authCollection
   [junit4]   2> 3790397 INFO  (qtp510864253-45072) [n:127.0.0.1:63605_solr c:authCollection s:shard2 r:core_node1 x:authCollection_shard2_replica1] o.a.s.c.c.ZkStateReader path=[/collections/authCollection] [configName]=[conf] specified config exists in ZooKeeper
   [junit4]   2> 3790398 INFO  (qtp231565691-45060) [n:127.0.0.1:63604_solr c:authCollection s:shard3 r:core_node3 x:authCollection_shard3_replica1] o.a.s.c.SolrCore org.apache.solr.core.MockDirectoryFactory
   [junit4]   2> 3790398 INFO  (qtp510864253-45072) [n:127.0.0.1:63605_solr c:authCollection s:shard2 r:core_node1 x:authCollection_shard2_replica1] o.a.s.r.ManagedResourceStorage Setting up ZooKeeper-based storage for the RestManager with znodeBase: /configs/conf
   [junit4]   2> 3790398 INFO  (qtp1533116156-45050) [n:127.0.0.1:63603_solr c:authCollection s:shard1 r:core_node2 x:authCollection_shard1_replica1] o.a.s.c.SolrCore org.apache.solr.core.MockDirectoryFactory
   [junit4]   2> 3790398 INFO  (qtp231565691-45060) [n:127.0.0.1:63604_solr c:authCollection s:shard3 r:core_node3 x:authCollection_shard3_replica1] o.a.s.c.SolrCore [[authCollection_shard3_replica1] ] Opening new SolrCore at [/Users/jenkins/workspace/Lucene-Solr-6.x-MacOSX/solr/build/solr-core/test/J0/temp/solr.security.BasicAuthIntegrationTest_27C80B2E893BBF1F-001/tempDir-001/node2/authCollection_shard3_replica1], dataDir=[/Users/jenkins/workspace/Lucene-Solr-6.x-MacOSX/solr/build/solr-core/test/J0/temp/solr.security.BasicAuthIntegrationTest_27C80B2E893BBF1F-001/tempDir-001/node2/./authCollection_shard3_replica1/data/]
   [junit4]   2> 3790398 INFO  (qtp1533116156-45050) [n:127.0.0.1:63603_solr c:authCollection s:shard1 r:core_node2 x:authCollection_shard1_replica1] o.a.s.c.SolrCore [[authCollection_shard1_replica1] ] Opening new SolrCore at [/Users/jenkins/workspace/Lucene-Solr-6.x-MacOSX/solr/build/solr-core/test/J0/temp/solr.security.BasicAuthIntegrationTest_27C80B2E893BBF1F-001/tempDir-001/node3/authCollection_shard1_replica1], dataDir=[/Users/jenkins/workspace/Lucene-Solr-6.x-MacOSX/solr/build/solr-core/test/J0/temp/solr.security.BasicAuthIntegrationTest_27C80B2E893BBF1F-001/tempDir-001/node3/./authCollection_shard1_replica1/data/]
   [junit4]   2> 3790398 INFO  (qtp1533116156-45050) [n:127.0.0.1:63603_solr c:authCollection s:shard1 r:core_node2 x:authCollection_shard1

[...truncated too long message...]

kCallback-10117-thread-4-processing-n:127.0.0.1:63604_solr) [n:127.0.0.1:63604_solr    ] o.a.s.c.c.ZkStateReader ZooKeeper watch triggered, but Solr cannot talk to ZK: [KeeperErrorCode = Session expired for /live_nodes]
   [junit4]   2> 3793576 INFO  (jetty-launcher-10103-thread-1) [    ] o.e.j.s.h.ContextHandler Stopped o.e.j.s.ServletContextHandler@3f0fa821{/solr,null,UNAVAILABLE}
   [junit4]   2> 3795080 WARN  (zkCallback-10119-thread-3-processing-n:127.0.0.1:63603_solr) [n:127.0.0.1:63603_solr    ] o.a.s.c.c.ZkStateReader ZooKeeper watch triggered, but Solr cannot talk to ZK: [KeeperErrorCode = Session expired for /live_nodes]
   [junit4]   2> 3795081 INFO  (jetty-launcher-10103-thread-3) [    ] o.e.j.s.h.ContextHandler Stopped o.e.j.s.ServletContextHandler@6eb49141{/solr,null,UNAVAILABLE}
   [junit4]   2> 3795083 INFO  (SUITE-BasicAuthIntegrationTest-seed#[27C80B2E893BBF1F]-worker) [    ] o.a.s.c.ZkTestServer connecting to 127.0.0.1:63601 63601
   [junit4]   2> 3795135 INFO  (Thread-5718) [    ] o.a.s.c.ZkTestServer connecting to 127.0.0.1:63601 63601
   [junit4]   2> 3802229 WARN  (Thread-5718) [    ] o.a.s.c.ZkTestServer Watch limit violations: 
   [junit4]   2> Maximum concurrent create/delete watches above limit:
   [junit4]   2> 
   [junit4]   2> 	5	/solr/aliases.json
   [junit4]   2> 	4	/solr/security.json
   [junit4]   2> 	4	/solr/configs/conf
   [junit4]   2> 
   [junit4]   2> Maximum concurrent data watches above limit:
   [junit4]   2> 
   [junit4]   2> 	5	/solr/clusterstate.json
   [junit4]   2> 	5	/solr/clusterprops.json
   [junit4]   2> 	4	/solr/collections/authCollection/state.json
   [junit4]   2> 	2	/solr/overseer_elect/election/96575305674719239-127.0.0.1:63604_solr-n_0000000000
   [junit4]   2> 
   [junit4]   2> Maximum concurrent children watches above limit:
   [junit4]   2> 
   [junit4]   2> 	20	/solr/overseer/queue
   [junit4]   2> 	5	/solr/collections
   [junit4]   2> 	5	/solr/overseer/collection-queue-work
   [junit4]   2> 	4	/solr/live_nodes
   [junit4]   2> 	2	/solr/overseer/queue-work
   [junit4]   2> 
   [junit4]   2> 3802230 INFO  (SUITE-BasicAuthIntegrationTest-seed#[27C80B2E893BBF1F]-worker) [    ] o.a.s.SolrTestCaseJ4 ###deleteCore
   [junit4]   2> NOTE: leaving temporary files on disk at: /Users/jenkins/workspace/Lucene-Solr-6.x-MacOSX/solr/build/solr-core/test/J0/temp/solr.security.BasicAuthIntegrationTest_27C80B2E893BBF1F-001
   [junit4]   2> NOTE: test params are: codec=Asserting(Lucene62): {}, docValues:{}, maxPointsInLeafNode=257, maxMBSortInHeap=5.952364262345251, sim=ClassicSimilarity, locale=es-PA, timezone=Asia/Krasnoyarsk
   [junit4]   2> NOTE: Mac OS X 10.11.6 x86_64/Oracle Corporation 1.8.0_102 (64-bit)/cpus=3,threads=1,free=114909432,total=391573504
   [junit4]   2> NOTE: All tests run in this JVM: [PingRequestHandlerTest, TestReloadAndDeleteDocs, DistributedFacetPivotLongTailTest, BlockJoinFacetDistribTest, TestImplicitCoreProperties, TestRestoreCore, TestComponentsName, TestSchemaSimilarityResource, HLLUtilTest, StatelessScriptUpdateProcessorFactoryTest, TestManagedStopFilterFactory, RestartWhileUpdatingTest, TestNumericTerms64, TestReplicationHandler, TestUpdate, TestLeaderInitiatedRecoveryThread, TestElisionMultitermQuery, ConfigSetsAPITest, HdfsSyncSliceTest, TestStandardQParsers, ShardSplitTest, TestReRankQParserPlugin, DirectSolrConnectionTest, CurrencyFieldXmlFileTest, TestStressCloudBlindAtomicUpdates, TestSubQueryTransformer, HdfsRecoveryZkTest, TestMissingGroups, HdfsBasicDistributedZkTest, PrimUtilsTest, DeleteNodeTest, TestFieldCacheReopen, TestDownShardTolerantSearch, ZkCLITest, RecoveryZkTest, TestDFISimilarityFactory, TestGraphMLResponseWriter, ZkStateWriterTest, DOMUtilTest, HdfsNNFailoverTest, TestHdfsCloudBackupRestore, TestGraphTermsQParserPlugin, DeleteShardTest, AnalyticsQueryTest, AddSchemaFieldsUpdateProcessorFactoryTest, CursorPagingTest, TestIBSimilarityFactory, TestSimpleQParserPlugin, SortSpecParsingTest, DistributedSpellCheckComponentTest, TestConfigReload, NumericFieldsTest, TestHighlightDedupGrouping, CreateCollectionCleanupTest, PrimitiveFieldTypeTest, DistributedSuggestComponentTest, TestCopyFieldCollectionResource, TestSolrQueryParserResource, TestXmlQParserPlugin, SOLR749Test, HardAutoCommitTest, TestSortingResponseWriter, TestRTGBase, TestBM25SimilarityFactory, TestCoreContainer, TestSubQueryTransformerDistrib, DocValuesMissingTest, TestDistribIDF, DistributedQueryComponentCustomSortTest, SolrXmlInZkTest, TestPhraseSuggestions, CollectionTooManyReplicasTest, TestCharFilters, TestScoreJoinQPNoScore, TestStressRecovery, PluginInfoTest, TestSolrCLIRunExample, TestSolrCloudWithDelegationTokens, SoftAutoCommitTest, TestObjectReleaseTracker, ResponseHeaderTest, TestSolr4Spatial2, SolrTestCaseJ4Test, FullHLLTest, FastVectorHighlighterTest, TestSort, TestXIncludeConfig, TestShortCircuitedRequests, TestCustomDocTransformer, TestCollectionAPI, QueryElevationComponentTest, VMParamsZkACLAndCredentialsProvidersTest, TestFieldTypeCollectionResource, TestHdfsUpdateLog, BlobRepositoryCloudTest, TestCloudDeleteByQuery, BigEndianAscendingWordDeserializerTest, TestFunctionQuery, DocExpirationUpdateProcessorFactoryTest, TermsComponentTest, SolrRequestParserTest, TestBulkSchemaAPI, ClusterStateUpdateTest, RecoveryAfterSoftCommitTest, TestSolrConfigHandlerCloud, AssignTest, TestExactStatsCache, TestRandomCollapseQParserPlugin, DistribJoinFromCollectionTest, SolrCLIZkUtilsTest, IndexBasedSpellCheckerTest, DistributedMLTComponentTest, TestCollationField, SecurityConfHandlerTest, DistributedDebugComponentTest, ShardRoutingTest, LeaderElectionTest, WrapperMergePolicyFactoryTest, TestPartialUpdateDeduplication, TestFieldCacheSort, AnalysisAfterCoreReloadTest, TestConfigSetImmutable, DirectoryFactoryTest, QueryEqualityTest, TestRuleBasedAuthorizationPlugin, TestSchemaNameResource, TestSolrXml, TestEmbeddedSolrServerConstructors, TestAnalyzeInfixSuggestions, ChaosMonkeyNothingIsSafeTest, TestRandomDVFaceting, DistributedFacetExistsSmallTest, HdfsChaosMonkeySafeLeaderTest, RequiredFieldsTest, IndexSchemaRuntimeFieldTest, StandardRequestHandlerTest, TestStressReorder, TestUseDocValuesAsStored2, TestStressLucene, TestConfigSetsAPIExclusivity, TestCryptoKeys, TestRandomRequestDistribution, DistribCursorPagingTest, TestFieldSortValues, SpatialHeatmapFacetsTest, TestSerializedLuceneMatchVersion, TestPerFieldSimilarity, DeleteInactiveReplicaTest, HdfsWriteToMultipleCollectionsTest, TestHighFrequencyDictionaryFactory, PeerSyncTest, TestConfigSets, TestFieldCacheVsDocValues, BasicDistributedZkTest, ChaosMonkeySafeLeaderTest, UnloadDistributedZkTest, OpenCloseCoreStressTest, OverseerTest, AutoCommitTest, TestFaceting, TestHashPartitioner, TermVectorComponentDistributedTest, ZkControllerTest, TestReload, TestStressVersions, DistributedTermsComponentTest, TestRangeQuery, SimpleFacetsTest, TestSolr4Spatial, SolrCoreTest, SpellCheckComponentTest, TestGroupingSearch, SolrCmdDistributorTest, BadIndexSchemaTest, TestLazyCores, HighlighterTest, DistributedQueryElevationComponentTest, SuggesterFSTTest, TestFoldingMultitermQuery, DocValuesTest, DirectUpdateHandlerOptimizeTest, TestRemoteStreaming, SolrInfoMBeanTest, CacheHeaderTest, DisMaxRequestHandlerTest, DirectSolrSpellCheckerTest, TestOmitPositions, DocumentBuilderTest, PathHierarchyTokenizerFactoryTest, TermVectorComponentTest, SolrPluginUtilsTest, JSONWriterTest, MBeansHandlerTest, UniqFieldsUpdateProcessorFactoryTest, JsonLoaderTest, TestBinaryResponseWriter, UpdateParamsTest, AlternateDirectoryTest, TestSolrIndexConfig, TestQuerySenderNoQuery, ResponseLogComponentTest, SolrIndexConfigTest, BadComponentTest, MultiTermTest, SampleTest, TestBinaryField, TestSearchPerf, MinimalSchemaTest, TestConfig, OutputWriterTest, TestFuzzyAnalyzedSuggestions, TestPostingsSolrHighlighter, TestLuceneMatchVersion, SpellPossibilityIteratorTest, SynonymTokenizerTest, EchoParamsTest, TestSweetSpotSimilarityFactory, TestFastWriter, TimeZoneUtilsTest, TestFastOutputStream, TestFastLRUCache, TestSuggestSpellingConverter, DateFieldTest, RAMDirectoryFactoryTest, TestLRUCache, TestDocumentBuilder, SliceStateTest, SystemInfoHandlerTest, FileUtilsTest, DistributedIntervalFacetingTest, AliasIntegrationTest, CdcrBootstrapTest, CollectionReloadTest, CollectionsAPISolrJTest, HttpPartitionTest, OverseerCollectionConfigSetProcessorTest, OverseerModifyCollectionTest, OverseerTaskQueueTest, PeerSyncReplicationTest, TestAuthenticationFramework, TestDistribDocBasedVersion, TestRandomFlRTGCloud, TestRequestForwarding, TestRequestStatusCollectionAPI, TestStressLiveNodes, TestTolerantUpdateProcessorCloud, HdfsChaosMonkeyNothingIsSafeTest, HdfsRestartWhileUpdatingTest, HdfsTlogReplayBufferedWhileIndexingTest, HdfsUnloadDistributedZkTest, StressHdfsTest, TestClusterStateMutator, RuleEngineTest, CachingDirectoryFactoryTest, CoreSorterTest, HdfsDirectoryFactoryTest, QueryResultKeyTest, TestBackupRepositoryFactory, TestConfigOverlay, TestConfigSetProperties, TestDynamicLoading, TestSolrConfigHandlerConcurrent, CoreMergeIndexesAdminHandlerTest, DistributedExpandComponentTest, DistributedQueryComponentOptimizationTest, TestDistributedStatsComponentCardinality, TestCloudManagedSchema, TestCloudSchemaless, TestCollationFieldDocValues, TestManagedSchema, TestManagedSchemaAPI, TestSchemaManager, TestUseDocValuesAsStored, CursorMarkTest, MergeStrategyTest, RankQueryTest, TestComplexPhraseQParserPlugin, TestCustomSort, TestInitQParser, TestOverriddenPrefixQueryForCustomFieldType, TestRecoveryHdfs, TestReloadDeadlock, TestSolrFieldCacheMBean, TestTrieFacet, TestJsonFacets, TestMinMaxOnMultiValuedField, TestSortByMinMaxFunction, BJQParserTest, BlockJoinFacetRandomTest, BlockJoinFacetSimpleTest, TestJsonRequest, SimpleMLTQParserTest, TestPerFieldSimilarityClassic, TestDefaultStatsCache, TestExactSharedStatsCache, TestLRUStatsCache, BasicAuthIntegrationTest]
   [junit4] Completed [595/630 (1!)] on J0 in 13.37s, 1 test, 1 error <<< FAILURES!

[...truncated 60409 lines...]