You are viewing a plain text version of this content. The canonical link for it is here.
Posted to yarn-dev@hadoop.apache.org by Apache Jenkins Server <je...@builds.apache.org> on 2013/10/25 11:36:42 UTC

Failed: YARN-1333 PreCommit Build #2281

Jira: https://issues.apache.org/jira/browse/YARN-1333
Build: https://builds.apache.org/job/PreCommit-YARN-Build/2281/

###################################################################################
########################## LAST 60 LINES OF THE CONSOLE ###########################
[...truncated 70 lines...]
patching file hadoop-yarn-project/hadoop-yarn/hadoop-yarn-server/hadoop-yarn-server-resourcemanager/src/main/java/org/apache/hadoop/yarn/server/resourcemanager/scheduler/SchedulerAppUtils.java
patching file hadoop-yarn-project/hadoop-yarn/hadoop-yarn-server/hadoop-yarn-server-resourcemanager/src/main/java/org/apache/hadoop/yarn/server/resourcemanager/scheduler/common/fica/FiCaSchedulerUtils.java
patching file hadoop-yarn-project/hadoop-yarn/hadoop-yarn-server/hadoop-yarn-server-resourcemanager/src/main/java/org/apache/hadoop/yarn/server/resourcemanager/scheduler/fair/AppSchedulable.java
patching file hadoop-yarn-project/hadoop-yarn/hadoop-yarn-server/hadoop-yarn-server-resourcemanager/src/main/java/org/apache/hadoop/yarn/server/resourcemanager/scheduler/fair/FSSchedulerApp.java
patching file hadoop-yarn-project/hadoop-yarn/hadoop-yarn-server/hadoop-yarn-server-resourcemanager/src/main/java/org/apache/hadoop/yarn/server/resourcemanager/scheduler/fair/FairScheduler.java
patching file hadoop-yarn-project/hadoop-yarn/hadoop-yarn-server/hadoop-yarn-server-resourcemanager/src/test/java/org/apache/hadoop/yarn/server/resourcemanager/scheduler/fair/TestFairScheduler.java


======================================================================
======================================================================
    Determining number of patched javac warnings.
======================================================================
======================================================================


/home/jenkins/tools/maven/latest/bin/mvn clean test -DskipTests -DHadoopPatchProcess -Pnative -Ptest-patch > /home/jenkins/jenkins-slave/workspace/PreCommit-YARN-Build/patchprocess/patchJavacWarnings.txt 2>&1




{color:red}-1 overall{color}.  Here are the results of testing the latest attachment 
  http://issues.apache.org/jira/secure/attachment/12610296/YARN-1333.2.patch
  against trunk revision .

    {color:green}+1 @author{color}.  The patch does not contain any @author tags.

    {color:green}+1 tests included{color}.  The patch appears to include 1 new or modified test files.

    {color:red}-1 javac{color:red}.  The patch appears to cause the build to fail.

Console output: https://builds.apache.org/job/PreCommit-YARN-Build/2281//console

This message is automatically generated.


======================================================================
======================================================================
    Adding comment to Jira.
======================================================================
======================================================================


Comment added.
f1930a6b2fb74fd4aef75cd43a836212c35b42c9 logged out


======================================================================
======================================================================
    Finished build.
======================================================================
======================================================================


Build step 'Execute shell' marked build as failure
Archiving artifacts
[description-setter] Could not determine description.
Recording test results
Email was triggered for: Failure
Sending email for trigger: Failure



###################################################################################
############################## FAILED TESTS (if any) ##############################
No tests ran.

Success: YARN-1068 PreCommit Build #2287

Posted by Apache Jenkins Server <je...@builds.apache.org>.
Jira: https://issues.apache.org/jira/browse/YARN-1068
Build: https://builds.apache.org/job/PreCommit-YARN-Build/2287/

###################################################################################
########################## LAST 60 LINES OF THE CONSOLE ###########################
[...truncated 4328 lines...]

/bin/kill -9 17602 
kill: No such process
NOP




{color:green}+1 overall{color}.  Here are the results of testing the latest attachment 
  http://issues.apache.org/jira/secure/attachment/12610366/yarn-1068-14.patch
  against trunk revision .

    {color:green}+1 @author{color}.  The patch does not contain any @author tags.

    {color:green}+1 tests included{color}.  The patch appears to include 3 new or modified test files.

    {color:green}+1 javac{color}.  The applied patch does not increase the total number of javac compiler warnings.

    {color:green}+1 javadoc{color}.  The javadoc tool did not generate any warning messages.

    {color:green}+1 eclipse:eclipse{color}.  The patch built with eclipse:eclipse.

    {color:green}+1 findbugs{color}.  The patch does not introduce any new Findbugs (version 1.3.9) warnings.

    {color:green}+1 release audit{color}.  The applied patch does not increase the total number of release audit warnings.

    {color:green}+1 core tests{color}.  The patch passed unit tests in hadoop-common-project/hadoop-common hadoop-yarn-project/hadoop-yarn/hadoop-yarn-api hadoop-yarn-project/hadoop-yarn/hadoop-yarn-client hadoop-yarn-project/hadoop-yarn/hadoop-yarn-common hadoop-yarn-project/hadoop-yarn/hadoop-yarn-server/hadoop-yarn-server-resourcemanager.

    {color:green}+1 contrib tests{color}.  The patch passed contrib unit tests.

Test results: https://builds.apache.org/job/PreCommit-YARN-Build/2287//testReport/
Console output: https://builds.apache.org/job/PreCommit-YARN-Build/2287//console

This message is automatically generated.


======================================================================
======================================================================
    Adding comment to Jira.
======================================================================
======================================================================


Comment added.
c082fc48a374f2abb3e2efc1f1d46030aec1e6eb logged out


======================================================================
======================================================================
    Finished build.
======================================================================
======================================================================


Archiving artifacts
Description set: YARN-1068
Recording test results
Email was triggered for: Success
Sending email for trigger: Success



###################################################################################
############################## FAILED TESTS (if any) ##############################
All tests passed

Failed: YARN-1349 PreCommit Build #2286

Posted by Apache Jenkins Server <je...@builds.apache.org>.
Jira: https://issues.apache.org/jira/browse/YARN-1349
Build: https://builds.apache.org/job/PreCommit-YARN-Build/2286/

###################################################################################
########################## LAST 60 LINES OF THE CONSOLE ###########################
[...truncated 68 lines...]

Going to apply patch with: /usr/bin/patch -p0
patching file hadoop-yarn-project/hadoop-yarn/bin/yarn.cmd


======================================================================
======================================================================
    Determining number of patched javac warnings.
======================================================================
======================================================================


/home/jenkins/tools/maven/latest/bin/mvn clean test -DskipTests -DHadoopPatchProcess -Pnative -Ptest-patch > /home/jenkins/jenkins-slave/workspace/PreCommit-YARN-Build/patchprocess/patchJavacWarnings.txt 2>&1




{color:red}-1 overall{color}.  Here are the results of testing the latest attachment 
  http://issues.apache.org/jira/secure/attachment/12610357/YARN-1349.2.patch
  against trunk revision .

    {color:green}+1 @author{color}.  The patch does not contain any @author tags.

    {color:red}-1 tests included{color}.  The patch doesn't appear to include any new or modified tests.
                        Please justify why no new tests are needed for this patch.
                        Also please list what manual steps were performed to verify this patch.

    {color:red}-1 javac{color:red}.  The patch appears to cause the build to fail.

Console output: https://builds.apache.org/job/PreCommit-YARN-Build/2286//console

This message is automatically generated.


======================================================================
======================================================================
    Adding comment to Jira.
======================================================================
======================================================================


Comment added.
e7ecd9c65e965dffb7002f2aa49955a4cee79f8c logged out


======================================================================
======================================================================
    Finished build.
======================================================================
======================================================================


Build step 'Execute shell' marked build as failure
Archiving artifacts
[description-setter] Could not determine description.
Recording test results
Editable Email Notification is waiting for a checkpoint on PreCommit-YARN-Build #2284
Email was triggered for: Failure
Sending email for trigger: Failure



###################################################################################
############################## FAILED TESTS (if any) ##############################
No tests ran.

Failed: YARN-891 PreCommit Build #2285

Posted by Apache Jenkins Server <je...@builds.apache.org>.
Jira: https://issues.apache.org/jira/browse/YARN-891
Build: https://builds.apache.org/job/PreCommit-YARN-Build/2285/

###################################################################################
########################## LAST 60 LINES OF THE CONSOLE ###########################
[...truncated 96 lines...]
patching file hadoop-yarn-project/hadoop-yarn/hadoop-yarn-server/hadoop-yarn-server-resourcemanager/src/test/java/org/apache/hadoop/yarn/server/resourcemanager/TestRMRestart.java
patching file hadoop-yarn-project/hadoop-yarn/hadoop-yarn-server/hadoop-yarn-server-resourcemanager/src/test/java/org/apache/hadoop/yarn/server/resourcemanager/recovery/RMStateStoreTestBase.java
patching file hadoop-yarn-project/hadoop-yarn/hadoop-yarn-server/hadoop-yarn-server-resourcemanager/src/test/java/org/apache/hadoop/yarn/server/resourcemanager/rmapp/MockRMApp.java
patching file hadoop-yarn-project/hadoop-yarn/hadoop-yarn-server/hadoop-yarn-server-resourcemanager/src/test/java/org/apache/hadoop/yarn/server/resourcemanager/rmapp/TestRMAppTransitions.java
patching file hadoop-yarn-project/hadoop-yarn/hadoop-yarn-server/hadoop-yarn-server-resourcemanager/src/test/java/org/apache/hadoop/yarn/server/resourcemanager/rmapp/attempt/TestRMAppAttemptTransitions.java


======================================================================
======================================================================
    Determining number of patched javac warnings.
======================================================================
======================================================================


/home/jenkins/tools/maven/latest/bin/mvn clean test -DskipTests -DHadoopPatchProcess -Pnative -Ptest-patch > /home/jenkins/jenkins-slave/workspace/PreCommit-YARN-Build/patchprocess/patchJavacWarnings.txt 2>&1




{color:red}-1 overall{color}.  Here are the results of testing the latest attachment 
  http://issues.apache.org/jira/secure/attachment/12610216/YARN-891.7.patch
  against trunk revision .

    {color:green}+1 @author{color}.  The patch does not contain any @author tags.

    {color:green}+1 tests included{color}.  The patch appears to include 6 new or modified test files.

    {color:red}-1 javac{color:red}.  The patch appears to cause the build to fail.

Console output: https://builds.apache.org/job/PreCommit-YARN-Build/2285//console

This message is automatically generated.


======================================================================
======================================================================
    Adding comment to Jira.
======================================================================
======================================================================


Comment added.
26ec45ecfac1627d0dc01e20f2a17218955d9f33 logged out


======================================================================
======================================================================
    Finished build.
======================================================================
======================================================================


Build step 'Execute shell' marked build as failure
Archiving artifacts
[description-setter] Could not determine description.
Recording test results
Editable Email Notification is waiting for a checkpoint on PreCommit-YARN-Build #2284
Email was triggered for: Failure
Sending email for trigger: Failure



###################################################################################
############################## FAILED TESTS (if any) ##############################
No tests ran.

Failed: YARN-1351 PreCommit Build #2284

Posted by Apache Jenkins Server <je...@builds.apache.org>.
Jira: https://issues.apache.org/jira/browse/YARN-1351
Build: https://builds.apache.org/job/PreCommit-YARN-Build/2284/

###################################################################################
########################## LAST 60 LINES OF THE CONSOLE ###########################
[...truncated 3009 lines...]
NOP




{color:red}-1 overall{color}.  Here are the results of testing the latest attachment 
  http://issues.apache.org/jira/secure/attachment/12610355/fixprnt.patch
  against trunk revision .

    {color:green}+1 @author{color}.  The patch does not contain any @author tags.

    {color:red}-1 tests included{color}.  The patch doesn't appear to include any new or modified tests.
                        Please justify why no new tests are needed for this patch.
                        Also please list what manual steps were performed to verify this patch.

    {color:green}+1 javac{color}.  The applied patch does not increase the total number of javac compiler warnings.

    {color:green}+1 javadoc{color}.  The javadoc tool did not generate any warning messages.

    {color:green}+1 eclipse:eclipse{color}.  The patch built with eclipse:eclipse.

    {color:green}+1 findbugs{color}.  The patch does not introduce any new Findbugs (version 1.3.9) warnings.

    {color:green}+1 release audit{color}.  The applied patch does not increase the total number of release audit warnings.

    {color:green}+1 core tests{color}.  The patch passed unit tests in hadoop-yarn-project/hadoop-yarn/hadoop-yarn-server/hadoop-yarn-server-resourcemanager.

    {color:green}+1 contrib tests{color}.  The patch passed contrib unit tests.

Test results: https://builds.apache.org/job/PreCommit-YARN-Build/2284//testReport/
Console output: https://builds.apache.org/job/PreCommit-YARN-Build/2284//console

This message is automatically generated.


======================================================================
======================================================================
    Adding comment to Jira.
======================================================================
======================================================================


Comment added.
7a14132c625f1dc62b54d6ff717d170982a24781 logged out


======================================================================
======================================================================
    Finished build.
======================================================================
======================================================================


Build step 'Execute shell' marked build as failure
Archiving artifacts
[description-setter] Could not determine description.
Recording test results
Email was triggered for: Failure
Sending email for trigger: Failure



###################################################################################
############################## FAILED TESTS (if any) ##############################
All tests passed

Failed: YARN-1349 PreCommit Build #2283

Posted by Apache Jenkins Server <je...@builds.apache.org>.
Jira: https://issues.apache.org/jira/browse/YARN-1349
Build: https://builds.apache.org/job/PreCommit-YARN-Build/2283/

###################################################################################
########################## LAST 60 LINES OF THE CONSOLE ###########################
[...truncated 68 lines...]

Going to apply patch with: /usr/bin/patch -p0
patching file hadoop-yarn-project/hadoop-yarn/bin/yarn.cmd


======================================================================
======================================================================
    Determining number of patched javac warnings.
======================================================================
======================================================================


/home/jenkins/tools/maven/latest/bin/mvn clean test -DskipTests -DHadoopPatchProcess -Pnative -Ptest-patch > /home/jenkins/jenkins-slave/workspace/PreCommit-YARN-Build/patchprocess/patchJavacWarnings.txt 2>&1




{color:red}-1 overall{color}.  Here are the results of testing the latest attachment 
  http://issues.apache.org/jira/secure/attachment/12610350/YARN-1349.1.patch
  against trunk revision .

    {color:green}+1 @author{color}.  The patch does not contain any @author tags.

    {color:red}-1 tests included{color}.  The patch doesn't appear to include any new or modified tests.
                        Please justify why no new tests are needed for this patch.
                        Also please list what manual steps were performed to verify this patch.

    {color:red}-1 javac{color:red}.  The patch appears to cause the build to fail.

Console output: https://builds.apache.org/job/PreCommit-YARN-Build/2283//console

This message is automatically generated.


======================================================================
======================================================================
    Adding comment to Jira.
======================================================================
======================================================================


Comment added.
4993891bd159464247b344e1718ee04a3323cd4e logged out


======================================================================
======================================================================
    Finished build.
======================================================================
======================================================================


Build step 'Execute shell' marked build as failure
Archiving artifacts
[description-setter] Could not determine description.
Recording test results
Editable Email Notification is waiting for a checkpoint on PreCommit-YARN-Build #2282
Email was triggered for: Failure
Sending email for trigger: Failure



###################################################################################
############################## FAILED TESTS (if any) ##############################
No tests ran.

Failed: YARN-674 PreCommit Build #2282

Posted by Apache Jenkins Server <je...@builds.apache.org>.
Jira: https://issues.apache.org/jira/browse/YARN-674
Build: https://builds.apache.org/job/PreCommit-YARN-Build/2282/

###################################################################################
########################## LAST 60 LINES OF THE CONSOLE ###########################
[...truncated 3021 lines...]




{color:red}-1 overall{color}.  Here are the results of testing the latest attachment 
  http://issues.apache.org/jira/secure/attachment/12610181/YARN-674.1.patch
  against trunk revision .

    {color:green}+1 @author{color}.  The patch does not contain any @author tags.

    {color:green}+1 tests included{color}.  The patch appears to include 1 new or modified test files.

    {color:green}+1 javac{color}.  The applied patch does not increase the total number of javac compiler warnings.

    {color:green}+1 javadoc{color}.  The javadoc tool did not generate any warning messages.

    {color:green}+1 eclipse:eclipse{color}.  The patch built with eclipse:eclipse.

    {color:red}-1 findbugs{color}.  The patch appears to introduce 2 new Findbugs (version 1.3.9) warnings.

    {color:green}+1 release audit{color}.  The applied patch does not increase the total number of release audit warnings.

    {color:red}-1 core tests{color}.  The patch failed these unit tests in hadoop-yarn-project/hadoop-yarn/hadoop-yarn-server/hadoop-yarn-server-resourcemanager:

                  org.apache.hadoop.yarn.server.resourcemanager.TestRMRestart

    {color:green}+1 contrib tests{color}.  The patch passed contrib unit tests.

Test results: https://builds.apache.org/job/PreCommit-YARN-Build/2282//testReport/
Findbugs warnings: https://builds.apache.org/job/PreCommit-YARN-Build/2282//artifact/trunk/patchprocess/newPatchFindbugsWarningshadoop-yarn-server-resourcemanager.html
Console output: https://builds.apache.org/job/PreCommit-YARN-Build/2282//console

This message is automatically generated.


======================================================================
======================================================================
    Adding comment to Jira.
======================================================================
======================================================================


Comment added.
942df18714735e694d668cf5d4f8f429b0d604fa logged out


======================================================================
======================================================================
    Finished build.
======================================================================
======================================================================


Build step 'Execute shell' marked build as failure
Archiving artifacts
[description-setter] Could not determine description.
Recording test results
Email was triggered for: Failure
Sending email for trigger: Failure



###################################################################################
############################## FAILED TESTS (if any) ##############################
2 tests failed.
REGRESSION:  org.apache.hadoop.yarn.server.resourcemanager.TestRMRestart.testDelegationTokenRestoredInDelegationTokenRenewer

Error Message:
expected:<[Kind: RM_DELEGATION_TOKEN, Service: localhost:8032, Ident: (owner=user1, renewer=renewer1, realUser=user1, issueDate=1382724435602, maxDate=1383329235602, sequenceNumber=1, masterKeyId=2), Kind: RM_DELEGATION_TOKEN, Service: localhost:8032, Ident: (owner=user2, renewer=renewer2, realUser=user2, issueDate=1382724435603, maxDate=1383329235603, sequenceNumber=2, masterKeyId=2)]> but was:<[]>

Stack Trace:
java.lang.AssertionError: expected:<[Kind: RM_DELEGATION_TOKEN, Service: localhost:8032, Ident: (owner=user1, renewer=renewer1, realUser=user1, issueDate=1382724435602, maxDate=1383329235602, sequenceNumber=1, masterKeyId=2), Kind: RM_DELEGATION_TOKEN, Service: localhost:8032, Ident: (owner=user2, renewer=renewer2, realUser=user2, issueDate=1382724435603, maxDate=1383329235603, sequenceNumber=2, masterKeyId=2)]> but was:<[]>
	at org.junit.Assert.fail(Assert.java:93)
	at org.junit.Assert.failNotEquals(Assert.java:647)
	at org.junit.Assert.assertEquals(Assert.java:128)
	at org.junit.Assert.assertEquals(Assert.java:147)
	at org.apache.hadoop.yarn.server.resourcemanager.TestRMRestart.testDelegationTokenRestoredInDelegationTokenRenewer(TestRMRestart.java:499)


REGRESSION:  org.apache.hadoop.yarn.server.resourcemanager.TestRMRestart.testRMDelegationTokenRestoredOnRMRestart

Error Message:
null

Stack Trace:
java.lang.AssertionError: null
	at org.junit.Assert.fail(Assert.java:92)
	at org.junit.Assert.assertTrue(Assert.java:43)
	at org.junit.Assert.assertTrue(Assert.java:54)
	at org.apache.hadoop.yarn.server.resourcemanager.TestRMRestart.testRMDelegationTokenRestoredOnRMRestart(TestRMRestart.java:719)