You are viewing a plain text version of this content. The canonical link for it is here.
Posted to issues@tez.apache.org by Apache Jenkins Server <je...@builds.apache.org> on 2016/06/08 11:52:18 UTC
Failed: TEZ-3292 PreCommit Build #1778
Jira: https://issues.apache.org/jira/browse/TEZ-3292
Build: https://builds.apache.org/job/PreCommit-TEZ-Build/1778/
###################################################################################
########################## LAST 60 LINES OF THE CONSOLE ###########################
[...truncated 3959 lines...]
[ERROR] [Help 1] http://cwiki.apache.org/confluence/display/MAVEN/MojoFailureException
[ERROR] [Help 2] http://cwiki.apache.org/confluence/display/MAVEN/MojoExecutionException
[ERROR]
[ERROR] After correcting the problems, you can resume the build with the command
[ERROR] mvn <goals> -rf :tez-tests
[INFO] Build failures were ignored.
{color:red}-1 overall{color}. Here are the results of testing the latest attachment
http://issues.apache.org/jira/secure/attachment/12808894/TEZ-3292.1.patch
against master revision 05d7725.
{color:green}+1 @author{color}. The patch does not contain any @author tags.
{color:green}+1 tests included{color}. The patch appears to include 1 new or modified test files.
{color:green}+1 javac{color}. The applied patch does not increase the total number of javac compiler warnings.
{color:green}+1 javadoc{color}. There were no new javadoc warning messages.
{color:green}+1 findbugs{color}. The patch does not introduce any new Findbugs (version 3.0.1) warnings.
{color:green}+1 release audit{color}. The applied patch does not increase the total number of release audit warnings.
{color:red}-1 core tests{color}. The patch failed these unit tests in :
org.apache.tez.mapreduce.TestMRRJobsDAGApi
Test results: https://builds.apache.org/job/PreCommit-TEZ-Build/1778//testReport/
Console output: https://builds.apache.org/job/PreCommit-TEZ-Build/1778//console
This message is automatically generated.
======================================================================
======================================================================
Adding comment to Jira.
======================================================================
======================================================================
Comment added.
7daca95f73030379bd6eb7fb65903843724ef93b logged out
======================================================================
======================================================================
Finished build.
======================================================================
======================================================================
Build step 'Execute shell' marked build as failure
Archiving artifacts
[description-setter] Could not determine description.
Recording test results
Email was triggered for: Failure - Any
Sending email for trigger: Failure - Any
###################################################################################
############################## FAILED TESTS (if any) ##############################
6 tests failed.
FAILED: org.apache.tez.mapreduce.TestMRRJobsDAGApi.testMultipleMRRSleepJobViaSession
Error Message:
expected:<READY> but was:<RUNNING>
Stack Trace:
java.lang.AssertionError: expected:<READY> but was:<RUNNING>
at org.junit.Assert.fail(Assert.java:88)
at org.junit.Assert.failNotEquals(Assert.java:743)
at org.junit.Assert.assertEquals(Assert.java:118)
at org.junit.Assert.assertEquals(Assert.java:144)
at org.apache.tez.mapreduce.TestMRRJobsDAGApi.testMultipleMRRSleepJobViaSession(TestMRRJobsDAGApi.java:500)
FAILED: org.apache.tez.mapreduce.TestMRRJobsDAGApi.testNonDefaultFSStagingDir
Error Message:
test timed out after 60000 milliseconds
Stack Trace:
java.lang.Exception: test timed out after 60000 milliseconds
at java.lang.Thread.sleep(Native Method)
at org.apache.tez.client.TezClient.waitNonSessionTillReady(TezClient.java:944)
at org.apache.tez.client.TezClient.submitDAGApplication(TezClient.java:1040)
at org.apache.tez.client.TezClient.submitDAGApplication(TezClient.java:995)
at org.apache.tez.client.TezClient.submitDAG(TezClient.java:506)
at org.apache.tez.mapreduce.TestMRRJobsDAGApi.testNonDefaultFSStagingDir(TestMRRJobsDAGApi.java:244)
FAILED: org.apache.tez.mapreduce.TestMRRJobsDAGApi.testMRRSleepJobDagSubmit
Error Message:
test timed out after 60000 milliseconds
Stack Trace:
java.lang.Exception: test timed out after 60000 milliseconds
at java.lang.Thread.sleep(Native Method)
at org.apache.tez.client.TezClient.waitNonSessionTillReady(TezClient.java:944)
at org.apache.tez.client.TezClient.submitDAGApplication(TezClient.java:1040)
at org.apache.tez.client.TezClient.submitDAGApplication(TezClient.java:995)
at org.apache.tez.client.TezClient.submitDAG(TezClient.java:506)
at org.apache.tez.mapreduce.TestMRRJobsDAGApi.testMRRSleepJobDagSubmitCore(TestMRRJobsDAGApi.java:699)
at org.apache.tez.mapreduce.TestMRRJobsDAGApi.testMRRSleepJobDagSubmitCore(TestMRRJobsDAGApi.java:542)
at org.apache.tez.mapreduce.TestMRRJobsDAGApi.testMRRSleepJobDagSubmit(TestMRRJobsDAGApi.java:324)
FAILED: org.apache.tez.mapreduce.TestMRRJobsDAGApi.testMRRSleepJobDagSubmitAndKillViaRPC
Error Message:
test timed out after 60000 milliseconds
Stack Trace:
java.lang.Exception: test timed out after 60000 milliseconds
at java.lang.Thread.sleep(Native Method)
at org.apache.tez.client.TezClient.waitForProxy(TezClient.java:975)
at org.apache.tez.client.TezClient.submitDAGSession(TezClient.java:592)
at org.apache.tez.client.TezClient.submitDAG(TezClient.java:504)
at org.apache.tez.mapreduce.TestMRRJobsDAGApi.testMRRSleepJobDagSubmitCore(TestMRRJobsDAGApi.java:745)
at org.apache.tez.mapreduce.TestMRRJobsDAGApi.testMRRSleepJobDagSubmitCore(TestMRRJobsDAGApi.java:542)
at org.apache.tez.mapreduce.TestMRRJobsDAGApi.testMRRSleepJobDagSubmitAndKillViaRPC(TestMRRJobsDAGApi.java:515)
FAILED: org.apache.tez.mapreduce.TestMRRJobsDAGApi.testMRRSleepJobDagSubmitAndKill
Error Message:
test timed out after 60000 milliseconds
Stack Trace:
java.lang.Exception: test timed out after 60000 milliseconds
at java.lang.Thread.sleep(Native Method)
at org.apache.tez.client.TezClient.waitNonSessionTillReady(TezClient.java:944)
at org.apache.tez.client.TezClient.submitDAGApplication(TezClient.java:1040)
at org.apache.tez.client.TezClient.submitDAGApplication(TezClient.java:995)
at org.apache.tez.client.TezClient.submitDAG(TezClient.java:506)
at org.apache.tez.mapreduce.TestMRRJobsDAGApi.testMRRSleepJobDagSubmitCore(TestMRRJobsDAGApi.java:699)
at org.apache.tez.mapreduce.TestMRRJobsDAGApi.testMRRSleepJobDagSubmitCore(TestMRRJobsDAGApi.java:542)
at org.apache.tez.mapreduce.TestMRRJobsDAGApi.testMRRSleepJobDagSubmitAndKill(TestMRRJobsDAGApi.java:335)
FAILED: org.apache.tez.mapreduce.TestMRRJobsDAGApi.testAMRelocalizationConflict
Error Message:
test timed out after 120000 milliseconds
Stack Trace:
java.lang.Exception: test timed out after 120000 milliseconds
at java.lang.Thread.sleep(Native Method)
at org.apache.tez.client.TezClient.waitForProxy(TezClient.java:975)
at org.apache.tez.client.TezClient.submitDAGSession(TezClient.java:592)
at org.apache.tez.client.TezClient.submitDAG(TezClient.java:504)
at org.apache.tez.mapreduce.TestMRRJobsDAGApi.testMRRSleepJobDagSubmitCore(TestMRRJobsDAGApi.java:745)
at org.apache.tez.mapreduce.TestMRRJobsDAGApi.testAMRelocalizationConflict(TestMRRJobsDAGApi.java:436)
Success: TEZ-3293 PreCommit Build #1779
Posted by Apache Jenkins Server <je...@builds.apache.org>.
Jira: https://issues.apache.org/jira/browse/TEZ-3293
Build: https://builds.apache.org/job/PreCommit-TEZ-Build/1779/
###################################################################################
########################## LAST 60 LINES OF THE CONSOLE ###########################
[...truncated 4110 lines...]
[INFO] Tez ............................................... SUCCESS [ 0.023 s]
[INFO] ------------------------------------------------------------------------
[INFO] BUILD SUCCESS
[INFO] ------------------------------------------------------------------------
[INFO] Total time: 59:16 min
[INFO] Finished at: 2016-06-08T22:20:19+00:00
[INFO] Final Memory: 75M/1334M
[INFO] ------------------------------------------------------------------------
{color:green}+1 overall{color}. Here are the results of testing the latest attachment
http://issues.apache.org/jira/secure/attachment/12809030/TEZ-3293.001.patch
against master revision d980262.
{color:green}+1 @author{color}. The patch does not contain any @author tags.
{color:green}+1 tests included{color}. The patch appears to include 1 new or modified test files.
{color:green}+1 javac{color}. The applied patch does not increase the total number of javac compiler warnings.
{color:green}+1 javadoc{color}. There were no new javadoc warning messages.
{color:green}+1 findbugs{color}. The patch does not introduce any new Findbugs (version 3.0.1) warnings.
{color:green}+1 release audit{color}. The applied patch does not increase the total number of release audit warnings.
{color:green}+1 core tests{color}. The patch passed unit tests in .
Test results: https://builds.apache.org/job/PreCommit-TEZ-Build/1779//testReport/
Console output: https://builds.apache.org/job/PreCommit-TEZ-Build/1779//console
This message is automatically generated.
======================================================================
======================================================================
Adding comment to Jira.
======================================================================
======================================================================
Comment added.
cba4f1cf00ddf9c5cb128d839c7baf2d74694f7c logged out
======================================================================
======================================================================
Finished build.
======================================================================
======================================================================
Archiving artifacts
[description-setter] Description set: TEZ-3293
Recording test results
Email was triggered for: Success
Sending email for trigger: Success
###################################################################################
############################## FAILED TESTS (if any) ##############################
All tests passed