You are viewing a plain text version of this content. The canonical link for it is here.
Posted to server-dev@james.apache.org by Apache Jenkins Server <je...@builds.apache.org> on 2014/04/02 14:11:28 UTC

Build failed in Jenkins: jdkim-trunk #1985

See <https://builds.apache.org/job/jdkim-trunk/1985/>

------------------------------------------
[...truncated 50 lines...]
Downloaded: https://repository.apache.org/content/repositories/snapshots/org/apache/james/jdkim/apache-jdkim-project/maven-metadata.xml (300 B at 0.3 KB/sec)
Uploading: https://repository.apache.org/content/repositories/snapshots/org/apache/james/jdkim/apache-jdkim-project/0.3-SNAPSHOT/maven-metadata.xml
Uploaded: https://repository.apache.org/content/repositories/snapshots/org/apache/james/jdkim/apache-jdkim-project/0.3-SNAPSHOT/maven-metadata.xml (830 B at 0.5 KB/sec)
Uploading: https://repository.apache.org/content/repositories/snapshots/org/apache/james/jdkim/apache-jdkim-project/maven-metadata.xml
Uploaded: https://repository.apache.org/content/repositories/snapshots/org/apache/james/jdkim/apache-jdkim-project/maven-metadata.xml (300 B at 0.2 KB/sec)
Uploading: https://repository.apache.org/content/repositories/snapshots/org/apache/james/jdkim/apache-jdkim-project/0.3-SNAPSHOT/apache-jdkim-project-0.3-20140402.114441-769-site.xml
Uploaded: https://repository.apache.org/content/repositories/snapshots/org/apache/james/jdkim/apache-jdkim-project/0.3-SNAPSHOT/apache-jdkim-project-0.3-20140402.114441-769-site.xml (2 KB at 1.0 KB/sec)
Uploading: https://repository.apache.org/content/repositories/snapshots/org/apache/james/jdkim/apache-jdkim-project/0.3-SNAPSHOT/maven-metadata.xml
Uploaded: https://repository.apache.org/content/repositories/snapshots/org/apache/james/jdkim/apache-jdkim-project/0.3-SNAPSHOT/maven-metadata.xml (830 B at 0.4 KB/sec)
[INFO]                                                                         
[INFO] ------------------------------------------------------------------------
[INFO] Building Apache James :: jDKIM 0.3-SNAPSHOT
[INFO] ------------------------------------------------------------------------
[INFO] 
[INFO] --- maven-clean-plugin:2.4.1:clean (default-clean) @ apache-jdkim-library ---
[INFO] Deleting <https://builds.apache.org/job/jdkim-trunk/ws/trunk/main/target>
[TASKS] Scanning folder '<https://builds.apache.org/job/jdkim-trunk/ws/trunk/main'> for files matching the pattern '**/*.java' - excludes: 
[TASKS] Found 41 files to scan for tasks
Found 24 open tasks.
[TASKS] Computing warning deltas based on reference build #1984
[INFO] 
[INFO] --- maven-remote-resources-plugin:1.2.1:process (default) @ apache-jdkim-library ---
[INFO] 
[INFO] --- maven-resources-plugin:2.5:resources (default-resources) @ apache-jdkim-library ---
[debug] execute contextualize
[INFO] Using 'UTF-8' encoding to copy filtered resources.
[INFO] skip non existing resourceDirectory <https://builds.apache.org/job/jdkim-trunk/ws/trunk/main/src/main/resources>
[INFO] Copying 3 resources
[INFO] 
[INFO] --- maven-compiler-plugin:2.3.2:compile (default-compile) @ apache-jdkim-library ---
[INFO] Compiling 25 source files to <https://builds.apache.org/job/jdkim-trunk/ws/trunk/main/target/classes>
[INFO] 
[INFO] --- maven-resources-plugin:2.5:testResources (default-testResources) @ apache-jdkim-library ---
[debug] execute contextualize
[INFO] Using 'UTF-8' encoding to copy filtered resources.
[INFO] Copying 78 resources
[INFO] Copying 3 resources
[INFO] 
[INFO] --- maven-compiler-plugin:2.3.2:testCompile (default-testCompile) @ apache-jdkim-library ---
[INFO] Compiling 16 source files to <https://builds.apache.org/job/jdkim-trunk/ws/trunk/main/target/test-classes>
[INFO] 
[INFO] --- maven-surefire-plugin:2.10:test (default-test) @ apache-jdkim-library ---
[INFO] Surefire report directory: <https://builds.apache.org/job/jdkim-trunk/ws/trunk/main/target/surefire-reports>

-------------------------------------------------------
 T E S T S
-------------------------------------------------------

-------------------------------------------------------
 T E S T S
-------------------------------------------------------
Running org.apache.james.jdkim.DKIMVerifierTest
Tests run: 1, Failures: 0, Errors: 0, Skipped: 0, Time elapsed: 0.172 sec
Running org.apache.james.jdkim.PerlDKIMTest
Tests run: 69, Failures: 0, Errors: 0, Skipped: 0, Time elapsed: 0.792 sec
Running org.apache.james.jdkim.MultiplexingPublicKeyRecordRetrieverTest
Tests run: 4, Failures: 0, Errors: 0, Skipped: 0, Time elapsed: 0.314 sec
Running org.apache.james.jdkim.tagvalue.TagValueTest
Tests run: 16, Failures: 0, Errors: 0, Skipped: 0, Time elapsed: 0.086 sec
Running org.apache.james.jdkim.DNSPublicKeyRetrieverTest
Tests run: 5, Failures: 0, Errors: 0, Skipped: 0, Time elapsed: 1.88 sec
Running org.apache.james.jdkim.FileBasedTest
Tests run: 6, Failures: 0, Errors: 0, Skipped: 0, Time elapsed: 0.433 sec
Running org.apache.james.jdkim.PublicKeyRecordTest
Tests run: 10, Failures: 0, Errors: 0, Skipped: 0, Time elapsed: 1.022 sec
Running org.apache.james.jdkim.canon.RelaxedBodyCanonicalizerTest
Tests run: 2, Failures: 0, Errors: 0, Skipped: 0, Time elapsed: 0.037 sec
Running org.apache.james.jdkim.canon.SimpleBodyCanonicalizerTest
Tests run: 10, Failures: 0, Errors: 0, Skipped: 0, Time elapsed: 0.087 sec
Running org.apache.james.jdkim.canon.LimitedOutputStreamTest
Tests run: 3, Failures: 0, Errors: 0, Skipped: 0, Time elapsed: 0.047 sec
Running org.apache.james.jdkim.canon.CompoundOutputStreamTest
Tests run: 2, Failures: 0, Errors: 0, Skipped: 0, Time elapsed: 0.053 sec
Running org.apache.james.jdkim.canon.DigestOutputStreamTest
Tests run: 3, Failures: 0, Errors: 0, Skipped: 0, Time elapsed: 0.195 sec
Running org.apache.james.jdkim.SignatureRecordImplTest
Tests run: 5, Failures: 0, Errors: 0, Skipped: 0, Time elapsed: 0.074 sec
Running org.apache.james.jdkim.SignatureRecordTest
Tests run: 5, Failures: 0, Errors: 0, Skipped: 0, Time elapsed: 0.074 sec

Results :

Tests run: 141, Failures: 0, Errors: 0, Skipped: 0

[JENKINS] Recording test results
[INFO] 
[INFO] --- maven-bundle-plugin:2.3.7:bundle (default-bundle) @ apache-jdkim-library ---
[INFO] 
[INFO] --- maven-jar-plugin:2.3.2:test-jar (default) @ apache-jdkim-library ---
[INFO] Building jar: <https://builds.apache.org/job/jdkim-trunk/ws/trunk/main/target/apache-jdkim-library-0.3-SNAPSHOT-tests.jar>
[INFO] 
[INFO] --- maven-site-plugin:3.0:attach-descriptor (attach-descriptor) @ apache-jdkim-library ---
[INFO] 
[INFO] --- maven-shade-plugin:1.5:shade (default) @ apache-jdkim-library ---
[INFO] Excluding org.apache.geronimo.specs:geronimo-activation_1.1_spec:jar:1.1 from the shaded jar.
[INFO] Excluding org.apache.geronimo.javamail:geronimo-javamail_1.4_mail:jar:1.8.3 from the shaded jar.
[INFO] Including commons-codec:commons-codec:jar:1.7 in the shaded jar.
[INFO] Excluding org.apache.james:apache-mailet-base:jar:2.5.0 from the shaded jar.
[INFO] Excluding org.apache.james:apache-mailet-api:jar:2.5.0 from the shaded jar.
[INFO] Excluding org.apache.james:apache-mime4j-core:jar:0.7.2 from the shaded jar.
[INFO] Excluding org.apache.james:apache-mime4j-dom:jar:0.7.2 from the shaded jar.
[INFO] Excluding log4j:log4j:jar:1.2.16 from the shaded jar.
[INFO] Excluding dnsjava:dnsjava:jar:2.1.1 from the shaded jar.
[INFO] Replacing original artifact with shaded artifact.
[INFO] Replacing <https://builds.apache.org/job/jdkim-trunk/ws/trunk/main/target/apache-jdkim-library-0.3-SNAPSHOT.jar> with <https://builds.apache.org/job/jdkim-trunk/ws/trunk/main/target/apache-jdkim-library-0.3-SNAPSHOT-shaded.jar>
[INFO] 
[INFO] --- apache-rat-plugin:0.8:check (default) @ apache-jdkim-library ---
[INFO] Exclude: src/test/resources/org/apache/james/jdkim/corpus/*
[INFO] Exclude: src/test/resources/org/apache/james/jdkim/Mail-DKIM/FAKE_DNS.dat
[INFO] Exclude: src/test/resources/org/apache/james/jdkim/Mail-DKIM/corpus/*
[INFO] Exclude: release.properties
[INFO] Exclude: dependency-reduced-pom.xml
[INFO] Exclude: nbactions.xml
[INFO] Exclude: **/.*/**/*
[INFO] 
[INFO] --- maven-install-plugin:2.3.1:install (default-install) @ apache-jdkim-library ---
[INFO] Installing <https://builds.apache.org/job/jdkim-trunk/ws/trunk/main/target/apache-jdkim-library-0.3-SNAPSHOT.jar> to /export/home/hudson/hudson-slave/maven-repositories/0/org/apache/james/jdkim/apache-jdkim-library/0.3-SNAPSHOT/apache-jdkim-library-0.3-SNAPSHOT.jar
[INFO] Installing <https://builds.apache.org/job/jdkim-trunk/ws/trunk/main/dependency-reduced-pom.xml> to /export/home/hudson/hudson-slave/maven-repositories/0/org/apache/james/jdkim/apache-jdkim-library/0.3-SNAPSHOT/apache-jdkim-library-0.3-SNAPSHOT.pom
[INFO] Installing <https://builds.apache.org/job/jdkim-trunk/ws/trunk/main/target/apache-jdkim-library-0.3-SNAPSHOT-tests.jar> to /export/home/hudson/hudson-slave/maven-repositories/0/org/apache/james/jdkim/apache-jdkim-library/0.3-SNAPSHOT/apache-jdkim-library-0.3-SNAPSHOT-tests.jar
[INFO] 
[INFO] --- maven-bundle-plugin:2.3.7:install (default-install) @ apache-jdkim-library ---
[INFO] Installing org/apache/james/jdkim/apache-jdkim-library/0.3-SNAPSHOT/apache-jdkim-library-0.3-SNAPSHOT.jar
[INFO] Writing OBR metadata
[INFO] 
[INFO] --- maven-deploy-plugin:2.7:deploy (default-deploy) @ apache-jdkim-library ---
Downloading: https://repository.apache.org/content/repositories/snapshots/org/apache/james/jdkim/apache-jdkim-library/0.3-SNAPSHOT/maven-metadata.xml
Downloaded: https://repository.apache.org/content/repositories/snapshots/org/apache/james/jdkim/apache-jdkim-library/0.3-SNAPSHOT/maven-metadata.xml (1004 B at 0.6 KB/sec)
Uploading: https://repository.apache.org/content/repositories/snapshots/org/apache/james/jdkim/apache-jdkim-library/0.3-SNAPSHOT/apache-jdkim-library-0.3-20140402.115156-753.jar
Uploaded: https://repository.apache.org/content/repositories/snapshots/org/apache/james/jdkim/apache-jdkim-library/0.3-SNAPSHOT/apache-jdkim-library-0.3-20140402.115156-753.jar (241 KB at 96.8 KB/sec)
Uploading: https://repository.apache.org/content/repositories/snapshots/org/apache/james/jdkim/apache-jdkim-library/0.3-SNAPSHOT/apache-jdkim-library-0.3-20140402.115156-753.pom
Uploaded: https://repository.apache.org/content/repositories/snapshots/org/apache/james/jdkim/apache-jdkim-library/0.3-SNAPSHOT/apache-jdkim-library-0.3-20140402.115156-753.pom (8 KB at 3.2 KB/sec)
Downloading: https://repository.apache.org/content/repositories/snapshots/org/apache/james/jdkim/apache-jdkim-library/maven-metadata.xml
Downloaded: https://repository.apache.org/content/repositories/snapshots/org/apache/james/jdkim/apache-jdkim-library/maven-metadata.xml (300 B at 0.3 KB/sec)
Uploading: https://repository.apache.org/content/repositories/snapshots/org/apache/james/jdkim/apache-jdkim-library/0.3-SNAPSHOT/maven-metadata.xml
Uploaded: https://repository.apache.org/content/repositories/snapshots/org/apache/james/jdkim/apache-jdkim-library/0.3-SNAPSHOT/maven-metadata.xml (1004 B at 0.7 KB/sec)
Uploading: https://repository.apache.org/content/repositories/snapshots/org/apache/james/jdkim/apache-jdkim-library/maven-metadata.xml
Uploaded: https://repository.apache.org/content/repositories/snapshots/org/apache/james/jdkim/apache-jdkim-library/maven-metadata.xml (300 B at 0.1 KB/sec)
Uploading: https://repository.apache.org/content/repositories/snapshots/org/apache/james/jdkim/apache-jdkim-library/0.3-SNAPSHOT/apache-jdkim-library-0.3-20140402.115156-753-tests.jar
Uploaded: https://repository.apache.org/content/repositories/snapshots/org/apache/james/jdkim/apache-jdkim-library/0.3-SNAPSHOT/apache-jdkim-library-0.3-20140402.115156-753-tests.jar (112 KB at 35.2 KB/sec)
Uploading: https://repository.apache.org/content/repositories/snapshots/org/apache/james/jdkim/apache-jdkim-library/0.3-SNAPSHOT/maven-metadata.xml
Uploaded: https://repository.apache.org/content/repositories/snapshots/org/apache/james/jdkim/apache-jdkim-library/0.3-SNAPSHOT/maven-metadata.xml (1004 B at 0.5 KB/sec)
[INFO] 
[INFO] --- maven-bundle-plugin:2.3.7:deploy (default-deploy) @ apache-jdkim-library ---
[INFO] Remote OBR update disabled (enable with -DremoteOBR)
[INFO]                                                                         
[INFO] ------------------------------------------------------------------------
[INFO] Building Apache James :: jDKIM :: Mailets 0.3-SNAPSHOT
[INFO] ------------------------------------------------------------------------
[INFO] 
[INFO] --- maven-clean-plugin:2.4.1:clean (default-clean) @ apache-jdkim-mailets ---
[INFO] Deleting <https://builds.apache.org/job/jdkim-trunk/ws/trunk/mailets/target>
[TASKS] Scanning folder '<https://builds.apache.org/job/jdkim-trunk/ws/trunk/mailets'> for files matching the pattern '**/*.java' - excludes: 
[TASKS] Found 8 files to scan for tasks
Found 0 open tasks.
[TASKS] Computing warning deltas based on reference build #1984
[INFO] 
[INFO] --- maven-remote-resources-plugin:1.2.1:process (default) @ apache-jdkim-mailets ---
[INFO] 
[INFO] --- maven-resources-plugin:2.5:resources (default-resources) @ apache-jdkim-mailets ---
[debug] execute contextualize
[INFO] Using 'UTF-8' encoding to copy filtered resources.
[INFO] Copying 0 resource
[INFO] Copying 3 resources
[INFO] 
[INFO] --- maven-compiler-plugin:2.3.2:compile (default-compile) @ apache-jdkim-mailets ---
[INFO] Compiling 6 source files to <https://builds.apache.org/job/jdkim-trunk/ws/trunk/mailets/target/classes>
[INFO] 
[INFO] --- maven-resources-plugin:2.5:testResources (default-testResources) @ apache-jdkim-mailets ---
[debug] execute contextualize
[INFO] Using 'UTF-8' encoding to copy filtered resources.
[INFO] Copying 0 resource
[INFO] Copying 3 resources
[INFO] 
[INFO] --- maven-compiler-plugin:2.3.2:testCompile (default-testCompile) @ apache-jdkim-mailets ---
[INFO] Compiling 2 source files to <https://builds.apache.org/job/jdkim-trunk/ws/trunk/mailets/target/test-classes>
[INFO] 
[INFO] --- maven-surefire-plugin:2.10:test (default-test) @ apache-jdkim-mailets ---
[INFO] Surefire report directory: <https://builds.apache.org/job/jdkim-trunk/ws/trunk/mailets/target/surefire-reports>

-------------------------------------------------------
 T E S T S
-------------------------------------------------------

-------------------------------------------------------
 T E S T S
-------------------------------------------------------
Running org.apache.james.jdkim.mailets.DKIMSignTest
Tests run: 6, Failures: 0, Errors: 0, Skipped: 0, Time elapsed: 2.797 sec
Running org.apache.james.jdkim.mailets.DKIMVerifyTest
Tests run: 4, Failures: 0, Errors: 0, Skipped: 0, Time elapsed: 0.291 sec

Results :

Tests run: 10, Failures: 0, Errors: 0, Skipped: 0

[JENKINS] Recording test results
[INFO] 
[INFO] --- maven-bundle-plugin:2.3.7:bundle (default-bundle) @ apache-jdkim-mailets ---
[INFO] 
[INFO] --- maven-site-plugin:3.0:attach-descriptor (attach-descriptor) @ apache-jdkim-mailets ---
[INFO] 
[INFO] --- maven-install-plugin:2.3.1:install (default-install) @ apache-jdkim-mailets ---
[INFO] Installing <https://builds.apache.org/job/jdkim-trunk/ws/trunk/mailets/target/apache-jdkim-mailets-0.3-SNAPSHOT.jar> to /export/home/hudson/hudson-slave/maven-repositories/0/org/apache/james/jdkim/apache-jdkim-mailets/0.3-SNAPSHOT/apache-jdkim-mailets-0.3-SNAPSHOT.jar
[INFO] Installing <https://builds.apache.org/job/jdkim-trunk/ws/trunk/mailets/pom.xml> to /export/home/hudson/hudson-slave/maven-repositories/0/org/apache/james/jdkim/apache-jdkim-mailets/0.3-SNAPSHOT/apache-jdkim-mailets-0.3-SNAPSHOT.pom
[INFO] 
[INFO] --- maven-bundle-plugin:2.3.7:install (default-install) @ apache-jdkim-mailets ---
[INFO] Installing org/apache/james/jdkim/apache-jdkim-mailets/0.3-SNAPSHOT/apache-jdkim-mailets-0.3-SNAPSHOT.jar
[INFO] Writing OBR metadata
[INFO] 
[INFO] --- maven-deploy-plugin:2.7:deploy (default-deploy) @ apache-jdkim-mailets ---
Downloading: https://repository.apache.org/content/repositories/snapshots/org/apache/james/jdkim/apache-jdkim-mailets/0.3-SNAPSHOT/maven-metadata.xml
[WARNING] Could not transfer metadata org.apache.james.jdkim:apache-jdkim-mailets:0.3-SNAPSHOT/maven-metadata.xml from/to apache.snapshots.https (https://repository.apache.org/content/repositories/snapshots): Failed to transfer file: https://repository.apache.org/content/repositories/snapshots/org/apache/james/jdkim/apache-jdkim-mailets/0.3-SNAPSHOT/maven-metadata.xml. Return code is: 503, ReasonPhrase:Service Temporarily Unavailable.
[INFO] ------------------------------------------------------------------------
[INFO] Reactor Summary:
[INFO] 
[INFO] Apache James :: jDKIM :: DomainKey Project ........ SUCCESS [2:05.633s]
[INFO] Apache James :: jDKIM ............................. SUCCESS [2:13.364s]
[INFO] Apache James :: jDKIM :: Mailets .................. FAILURE [1:55.189s]
[INFO] Apache James :: jDKIM :: Assembly ................. SKIPPED
[INFO] ------------------------------------------------------------------------
[INFO] BUILD FAILURE
[INFO] ------------------------------------------------------------------------
[INFO] Total time: 21:41.984s
[INFO] Finished at: Wed Apr 02 12:04:22 GMT+00:00 2014
[INFO] Final Memory: 32M/244M
[INFO] ------------------------------------------------------------------------
Waiting for Jenkins to finish collecting data
[ERROR] Failed to execute goal org.apache.maven.plugins:maven-deploy-plugin:2.7:deploy (default-deploy) on project apache-jdkim-mailets: Failed to retrieve remote metadata org.apache.james.jdkim:apache-jdkim-mailets:0.3-SNAPSHOT/maven-metadata.xml: Could not transfer metadata org.apache.james.jdkim:apache-jdkim-mailets:0.3-SNAPSHOT/maven-metadata.xml from/to apache.snapshots.https (https://repository.apache.org/content/repositories/snapshots): Failed to transfer file: https://repository.apache.org/content/repositories/snapshots/org/apache/james/jdkim/apache-jdkim-mailets/0.3-SNAPSHOT/maven-metadata.xml. Return code is: 503, ReasonPhrase:Service Temporarily Unavailable. -> [Help 1]
[JENKINS] Archiving <https://builds.apache.org/job/jdkim-trunk/ws/trunk/mailets/pom.xml> to org.apache.james.jdkim/apache-jdkim-mailets/0.3-SNAPSHOT/apache-jdkim-mailets-0.3-SNAPSHOT.pom
[JENKINS] Archiving <https://builds.apache.org/job/jdkim-trunk/ws/trunk/mailets/target/apache-jdkim-mailets-0.3-SNAPSHOT.jar> to org.apache.james.jdkim/apache-jdkim-mailets/0.3-SNAPSHOT/apache-jdkim-mailets-0.3-SNAPSHOT.jar
[ERROR] 
[ERROR] To see the full stack trace of the errors, re-run Maven with the -e switch.
[ERROR] Re-run Maven using the -X switch to enable full debug logging.
[ERROR] 
[ERROR] For more information about the errors and possible solutions, please read the following articles:
[ERROR] [Help 1] http://cwiki.apache.org/confluence/display/MAVEN/MojoExecutionException
[ERROR] 
[ERROR] After correcting the problems, you can resume the build with the command
[ERROR]   mvn <goals> -rf :apache-jdkim-mailets
[JENKINS] Archiving <https://builds.apache.org/job/jdkim-trunk/ws/trunk/pom.xml> to org.apache.james.jdkim/apache-jdkim-project/0.3-SNAPSHOT/apache-jdkim-project-0.3-SNAPSHOT.pom
[JENKINS] Archiving <https://builds.apache.org/job/jdkim-trunk/ws/trunk/target/apache-jdkim-project-0.3-SNAPSHOT-site.xml> to org.apache.james.jdkim/apache-jdkim-project/0.3-20140402.114441-769/apache-jdkim-project-0.3-20140402.114441-769-site.xml
[JENKINS] Archiving <https://builds.apache.org/job/jdkim-trunk/ws/trunk/assemble/pom.xml> to org.apache.james.jdkim/apache-jdkim/0.3-SNAPSHOT/apache-jdkim-0.3-SNAPSHOT.pom
[JENKINS] Archiving <https://builds.apache.org/job/jdkim-trunk/ws/trunk/main/dependency-reduced-pom.xml> to org.apache.james.jdkim/apache-jdkim-library/0.3-SNAPSHOT/apache-jdkim-library-0.3-SNAPSHOT.pom
[JENKINS] Archiving <https://builds.apache.org/job/jdkim-trunk/ws/trunk/main/target/apache-jdkim-library-0.3-SNAPSHOT.jar> to org.apache.james.jdkim/apache-jdkim-library/0.3-20140402.115156-753/apache-jdkim-library-0.3-20140402.115156-753.jar
[JENKINS] Archiving <https://builds.apache.org/job/jdkim-trunk/ws/trunk/main/target/apache-jdkim-library-0.3-SNAPSHOT-tests.jar> to org.apache.james.jdkim/apache-jdkim-library/0.3-20140402.115156-753/apache-jdkim-library-0.3-20140402.115156-753-tests.jar
Sending e-mails to: server-dev@james.apache.org
channel stopped
[locks-and-latches] Releasing all the locks
[locks-and-latches] All the locks released

---------------------------------------------------------------------
To unsubscribe, e-mail: server-dev-unsubscribe@james.apache.org
For additional commands, e-mail: server-dev-help@james.apache.org


Jenkins build is back to normal : jdkim-trunk #1986

Posted by Apache Jenkins Server <je...@builds.apache.org>.
See <https://builds.apache.org/job/jdkim-trunk/1986/>


---------------------------------------------------------------------
To unsubscribe, e-mail: server-dev-unsubscribe@james.apache.org
For additional commands, e-mail: server-dev-help@james.apache.org