You are viewing a plain text version of this content. The canonical link for it is here.
Posted to builds@beam.apache.org by Apache Jenkins Server <je...@builds.apache.org> on 2019/05/17 20:34:40 UTC
Build failed in Jenkins: beam_PerformanceTests_WordCountIT_Py35 #6
See <https://builds.apache.org/job/beam_PerformanceTests_WordCountIT_Py35/6/display/redirect>
------------------------------------------
[...truncated 152.27 KB...]
writing apache_beam.egg-info/PKG-INFO
writing top-level names to apache_beam.egg-info/top_level.txt
writing dependency_links to apache_beam.egg-info/dependency_links.txt
writing requirements to apache_beam.egg-info/requires.txt
writing entry points to apache_beam.egg-info/entry_points.txt
reading manifest file 'apache_beam.egg-info/SOURCES.txt'
reading manifest template 'MANIFEST.in'
writing manifest file 'apache_beam.egg-info/SOURCES.txt'
STDERR: beam_fn_api.proto: warning: Import google/protobuf/descriptor.proto but not used.
beam_fn_api.proto: warning: Import google/protobuf/wrappers.proto but not used.
root: Generating grammar tables from /usr/lib/python3.5/lib2to3/PatternGrammar.txt
RefactoringTool: Adding transformation: apply
root: Generating grammar tables from /usr/lib/python3.5/lib2to3/PatternGrammar.txt
root: Generating grammar tables from /usr/lib/python3.5/lib2to3/PatternGrammar.txt
root: Generating grammar tables from /usr/lib/python3.5/lib2to3/PatternGrammar.txt
RefactoringTool: Adding transformation: dict
root: Generating grammar tables from /usr/lib/python3.5/lib2to3/PatternGrammar.txt
RefactoringTool: Adding transformation: except
root: Generating grammar tables from /usr/lib/python3.5/lib2to3/PatternGrammar.txt
RefactoringTool: Adding transformation: exec
root: Generating grammar tables from /usr/lib/python3.5/lib2to3/PatternGrammar.txt
RefactoringTool: Adding transformation: exitfunc
root: Generating grammar tables from /usr/lib/python3.5/lib2to3/PatternGrammar.txt
RefactoringTool: Adding transformation: filter
root: Generating grammar tables from /usr/lib/python3.5/lib2to3/PatternGrammar.txt
RefactoringTool: Adding transformation: funcattrs
root: Generating grammar tables from /usr/lib/python3.5/lib2to3/PatternGrammar.txt
RefactoringTool: Adding transformation: getcwdu
root: Generating grammar tables from /usr/lib/python3.5/lib2to3/PatternGrammar.txt
RefactoringTool: Adding transformation: has_key
root: Generating grammar tables from /usr/lib/python3.5/lib2to3/PatternGrammar.txt
RefactoringTool: Skipping optional fixer: idioms
root: Generating grammar tables from /usr/lib/python3.5/lib2to3/PatternGrammar.txt
root: Generating grammar tables from /usr/lib/python3.5/lib2to3/PatternGrammar.txt
RefactoringTool: Adding transformation: input
root: Generating grammar tables from /usr/lib/python3.5/lib2to3/PatternGrammar.txt
RefactoringTool: Adding transformation: intern
root: Generating grammar tables from /usr/lib/python3.5/lib2to3/PatternGrammar.txt
RefactoringTool: Adding transformation: isinstance
root: Generating grammar tables from /usr/lib/python3.5/lib2to3/PatternGrammar.txt
RefactoringTool: Adding transformation: itertools
root: Generating grammar tables from /usr/lib/python3.5/lib2to3/PatternGrammar.txt
RefactoringTool: Adding transformation: itertools_imports
root: Generating grammar tables from /usr/lib/python3.5/lib2to3/PatternGrammar.txt
RefactoringTool: Adding transformation: long
root: Generating grammar tables from /usr/lib/python3.5/lib2to3/PatternGrammar.txt
RefactoringTool: Adding transformation: map
root: Generating grammar tables from /usr/lib/python3.5/lib2to3/PatternGrammar.txt
RefactoringTool: Adding transformation: methodattrs
RefactoringTool: Adding transformation: ne
root: Generating grammar tables from /usr/lib/python3.5/lib2to3/PatternGrammar.txt
RefactoringTool: Adding transformation: next
root: Generating grammar tables from /usr/lib/python3.5/lib2to3/PatternGrammar.txt
RefactoringTool: Adding transformation: nonzero
RefactoringTool: Adding transformation: numliterals
root: Generating grammar tables from /usr/lib/python3.5/lib2to3/PatternGrammar.txt
RefactoringTool: Adding transformation: operator
root: Generating grammar tables from /usr/lib/python3.5/lib2to3/PatternGrammar.txt
RefactoringTool: Adding transformation: paren
root: Generating grammar tables from /usr/lib/python3.5/lib2to3/PatternGrammar.txt
RefactoringTool: Adding transformation: raw_input
root: Generating grammar tables from /usr/lib/python3.5/lib2to3/PatternGrammar.txt
RefactoringTool: Adding transformation: reduce
root: Generating grammar tables from /usr/lib/python3.5/lib2to3/PatternGrammar.txt
RefactoringTool: Adding transformation: renames
root: Generating grammar tables from /usr/lib/python3.5/lib2to3/PatternGrammar.txt
RefactoringTool: Adding transformation: repr
root: Generating grammar tables from /usr/lib/python3.5/lib2to3/PatternGrammar.txt
RefactoringTool: Adding transformation: standarderror
root: Generating grammar tables from /usr/lib/python3.5/lib2to3/PatternGrammar.txt
RefactoringTool: Adding transformation: sys_exc
root: Generating grammar tables from /usr/lib/python3.5/lib2to3/PatternGrammar.txt
RefactoringTool: Adding transformation: throw
root: Generating grammar tables from /usr/lib/python3.5/lib2to3/PatternGrammar.txt
RefactoringTool: Adding transformation: tuple_params
root: Generating grammar tables from /usr/lib/python3.5/lib2to3/PatternGrammar.txt
RefactoringTool: Adding transformation: types
root: Generating grammar tables from /usr/lib/python3.5/lib2to3/PatternGrammar.txt
RefactoringTool: Skipping optional fixer: ws_comma
root: Generating grammar tables from /usr/lib/python3.5/lib2to3/PatternGrammar.txt
RefactoringTool: Adding transformation: xreadlines
root: Generating grammar tables from /usr/lib/python3.5/lib2to3/PatternGrammar.txt
RefactoringTool: Adding transformation: zip
root: Generating grammar tables from /usr/lib/python3.5/lib2to3/PatternGrammar.txt
RefactoringTool: Adding transformation: absolute_import
root: Generating grammar tables from /usr/lib/python3.5/lib2to3/PatternGrammar.txt
RefactoringTool: Adding transformation: basestring
root: Generating grammar tables from /usr/lib/python3.5/lib2to3/PatternGrammar.txt
RefactoringTool: Adding transformation: cmp
root: Generating grammar tables from /usr/lib/python3.5/lib2to3/PatternGrammar.txt
RefactoringTool: Adding transformation: division_safe
root: Generating grammar tables from /usr/lib/python3.5/lib2to3/PatternGrammar.txt
RefactoringTool: Adding transformation: execfile
root: Generating grammar tables from /usr/lib/python3.5/lib2to3/PatternGrammar.txt
RefactoringTool: Adding transformation: future_builtins
root: Generating grammar tables from /usr/lib/python3.5/lib2to3/PatternGrammar.txt
RefactoringTool: Adding transformation: future_standard_library
root: Generating grammar tables from /usr/lib/python3.5/lib2to3/PatternGrammar.txt
RefactoringTool: Adding transformation: future_standard_library_urllib
root: Generating grammar tables from /usr/lib/python3.5/lib2to3/PatternGrammar.txt
RefactoringTool: Adding transformation: metaclass
root: Generating grammar tables from /usr/lib/python3.5/lib2to3/PatternGrammar.txt
RefactoringTool: Adding transformation: next_call
root: Generating grammar tables from /usr/lib/python3.5/lib2to3/PatternGrammar.txt
RefactoringTool: Adding transformation: object
root: Generating grammar tables from /usr/lib/python3.5/lib2to3/PatternGrammar.txt
root: Generating grammar tables from /usr/lib/python3.5/lib2to3/PatternGrammar.txt
RefactoringTool: Adding transformation: print_with_import
root: Generating grammar tables from /usr/lib/python3.5/lib2to3/PatternGrammar.txt
RefactoringTool: Adding transformation: raise
root: Generating grammar tables from /usr/lib/python3.5/lib2to3/PatternGrammar.txt
RefactoringTool: Adding transformation: unicode_keep_u
root: Generating grammar tables from /usr/lib/python3.5/lib2to3/PatternGrammar.txt
root: Generating grammar tables from /usr/lib/python3.5/lib2to3/PatternGrammar.txt
root: Generating grammar tables from /usr/lib/python3.5/lib2to3/PatternGrammar.txt
RefactoringTool: Adding transformation: xrange_with_import
root: Generating grammar tables from /usr/lib/python3.5/lib2to3/PatternGrammar.txt
RefactoringTool: Adding transformation: newstyle
RefactoringTool: Descending into <https://builds.apache.org/job/beam_PerformanceTests_WordCountIT_Py35/ws/src/sdks/python/test-suites/dataflow/py35/build/srcs/sdks/python/apache_beam/portability/api>
RefactoringTool: Refactoring <https://builds.apache.org/job/beam_PerformanceTests_WordCountIT_Py35/ws/src/sdks/python/test-suites/dataflow/py35/build/srcs/sdks/python/apache_beam/portability/api/__init__.py>
RefactoringTool: No changes in <https://builds.apache.org/job/beam_PerformanceTests_WordCountIT_Py35/ws/src/sdks/python/test-suites/dataflow/py35/build/srcs/sdks/python/apache_beam/portability/api/__init__.py>
RefactoringTool: Refactoring <https://builds.apache.org/job/beam_PerformanceTests_WordCountIT_Py35/ws/src/sdks/python/test-suites/dataflow/py35/build/srcs/sdks/python/apache_beam/portability/api/beam_artifact_api_pb2.py>
RefactoringTool: No changes to <https://builds.apache.org/job/beam_PerformanceTests_WordCountIT_Py35/ws/src/sdks/python/test-suites/dataflow/py35/build/srcs/sdks/python/apache_beam/portability/api/beam_artifact_api_pb2.py>
RefactoringTool: No changes to <https://builds.apache.org/job/beam_PerformanceTests_WordCountIT_Py35/ws/src/sdks/python/test-suites/dataflow/py35/build/srcs/sdks/python/apache_beam/portability/api/beam_artifact_api_pb2.py>
RefactoringTool: Refactoring <https://builds.apache.org/job/beam_PerformanceTests_WordCountIT_Py35/ws/src/sdks/python/test-suites/dataflow/py35/build/srcs/sdks/python/apache_beam/portability/api/beam_artifact_api_pb2_grpc.py>
RefactoringTool: Refactored <https://builds.apache.org/job/beam_PerformanceTests_WordCountIT_Py35/ws/src/sdks/python/test-suites/dataflow/py35/build/srcs/sdks/python/apache_beam/portability/api/beam_artifact_api_pb2_grpc.py>
RefactoringTool: Wrote changes to <https://builds.apache.org/job/beam_PerformanceTests_WordCountIT_Py35/ws/src/sdks/python/test-suites/dataflow/py35/build/srcs/sdks/python/apache_beam/portability/api/beam_artifact_api_pb2_grpc.py>
RefactoringTool: Refactoring <https://builds.apache.org/job/beam_PerformanceTests_WordCountIT_Py35/ws/src/sdks/python/test-suites/dataflow/py35/build/srcs/sdks/python/apache_beam/portability/api/beam_expansion_api_pb2.py>
RefactoringTool: Refactored <https://builds.apache.org/job/beam_PerformanceTests_WordCountIT_Py35/ws/src/sdks/python/test-suites/dataflow/py35/build/srcs/sdks/python/apache_beam/portability/api/beam_expansion_api_pb2.py>
RefactoringTool: Wrote changes to <https://builds.apache.org/job/beam_PerformanceTests_WordCountIT_Py35/ws/src/sdks/python/test-suites/dataflow/py35/build/srcs/sdks/python/apache_beam/portability/api/beam_expansion_api_pb2.py>
RefactoringTool: Refactoring <https://builds.apache.org/job/beam_PerformanceTests_WordCountIT_Py35/ws/src/sdks/python/test-suites/dataflow/py35/build/srcs/sdks/python/apache_beam/portability/api/beam_expansion_api_pb2_grpc.py>
RefactoringTool: Refactored <https://builds.apache.org/job/beam_PerformanceTests_WordCountIT_Py35/ws/src/sdks/python/test-suites/dataflow/py35/build/srcs/sdks/python/apache_beam/portability/api/beam_expansion_api_pb2_grpc.py>
RefactoringTool: Wrote changes to <https://builds.apache.org/job/beam_PerformanceTests_WordCountIT_Py35/ws/src/sdks/python/test-suites/dataflow/py35/build/srcs/sdks/python/apache_beam/portability/api/beam_expansion_api_pb2_grpc.py>
RefactoringTool: Refactoring <https://builds.apache.org/job/beam_PerformanceTests_WordCountIT_Py35/ws/src/sdks/python/test-suites/dataflow/py35/build/srcs/sdks/python/apache_beam/portability/api/beam_fn_api_pb2.py>
RefactoringTool: Refactored <https://builds.apache.org/job/beam_PerformanceTests_WordCountIT_Py35/ws/src/sdks/python/test-suites/dataflow/py35/build/srcs/sdks/python/apache_beam/portability/api/beam_fn_api_pb2.py>
RefactoringTool: Wrote changes to <https://builds.apache.org/job/beam_PerformanceTests_WordCountIT_Py35/ws/src/sdks/python/test-suites/dataflow/py35/build/srcs/sdks/python/apache_beam/portability/api/beam_fn_api_pb2.py>
RefactoringTool: Refactoring <https://builds.apache.org/job/beam_PerformanceTests_WordCountIT_Py35/ws/src/sdks/python/test-suites/dataflow/py35/build/srcs/sdks/python/apache_beam/portability/api/beam_fn_api_pb2_grpc.py>
RefactoringTool: Refactored <https://builds.apache.org/job/beam_PerformanceTests_WordCountIT_Py35/ws/src/sdks/python/test-suites/dataflow/py35/build/srcs/sdks/python/apache_beam/portability/api/beam_fn_api_pb2_grpc.py>
RefactoringTool: Wrote changes to <https://builds.apache.org/job/beam_PerformanceTests_WordCountIT_Py35/ws/src/sdks/python/test-suites/dataflow/py35/build/srcs/sdks/python/apache_beam/portability/api/beam_fn_api_pb2_grpc.py>
RefactoringTool: Refactoring <https://builds.apache.org/job/beam_PerformanceTests_WordCountIT_Py35/ws/src/sdks/python/test-suites/dataflow/py35/build/srcs/sdks/python/apache_beam/portability/api/beam_job_api_pb2.py>
RefactoringTool: Refactored <https://builds.apache.org/job/beam_PerformanceTests_WordCountIT_Py35/ws/src/sdks/python/test-suites/dataflow/py35/build/srcs/sdks/python/apache_beam/portability/api/beam_job_api_pb2.py>
RefactoringTool: Wrote changes to <https://builds.apache.org/job/beam_PerformanceTests_WordCountIT_Py35/ws/src/sdks/python/test-suites/dataflow/py35/build/srcs/sdks/python/apache_beam/portability/api/beam_job_api_pb2.py>
RefactoringTool: Refactoring <https://builds.apache.org/job/beam_PerformanceTests_WordCountIT_Py35/ws/src/sdks/python/test-suites/dataflow/py35/build/srcs/sdks/python/apache_beam/portability/api/beam_job_api_pb2_grpc.py>
RefactoringTool: Refactored <https://builds.apache.org/job/beam_PerformanceTests_WordCountIT_Py35/ws/src/sdks/python/test-suites/dataflow/py35/build/srcs/sdks/python/apache_beam/portability/api/beam_job_api_pb2_grpc.py>
RefactoringTool: Wrote changes to <https://builds.apache.org/job/beam_PerformanceTests_WordCountIT_Py35/ws/src/sdks/python/test-suites/dataflow/py35/build/srcs/sdks/python/apache_beam/portability/api/beam_job_api_pb2_grpc.py>
RefactoringTool: Refactoring <https://builds.apache.org/job/beam_PerformanceTests_WordCountIT_Py35/ws/src/sdks/python/test-suites/dataflow/py35/build/srcs/sdks/python/apache_beam/portability/api/beam_provision_api_pb2.py>
RefactoringTool: No changes to <https://builds.apache.org/job/beam_PerformanceTests_WordCountIT_Py35/ws/src/sdks/python/test-suites/dataflow/py35/build/srcs/sdks/python/apache_beam/portability/api/beam_provision_api_pb2.py>
RefactoringTool: No changes to <https://builds.apache.org/job/beam_PerformanceTests_WordCountIT_Py35/ws/src/sdks/python/test-suites/dataflow/py35/build/srcs/sdks/python/apache_beam/portability/api/beam_provision_api_pb2.py>
RefactoringTool: Refactoring <https://builds.apache.org/job/beam_PerformanceTests_WordCountIT_Py35/ws/src/sdks/python/test-suites/dataflow/py35/build/srcs/sdks/python/apache_beam/portability/api/beam_provision_api_pb2_grpc.py>
RefactoringTool: Refactored <https://builds.apache.org/job/beam_PerformanceTests_WordCountIT_Py35/ws/src/sdks/python/test-suites/dataflow/py35/build/srcs/sdks/python/apache_beam/portability/api/beam_provision_api_pb2_grpc.py>
RefactoringTool: Wrote changes to <https://builds.apache.org/job/beam_PerformanceTests_WordCountIT_Py35/ws/src/sdks/python/test-suites/dataflow/py35/build/srcs/sdks/python/apache_beam/portability/api/beam_provision_api_pb2_grpc.py>
RefactoringTool: Refactoring <https://builds.apache.org/job/beam_PerformanceTests_WordCountIT_Py35/ws/src/sdks/python/test-suites/dataflow/py35/build/srcs/sdks/python/apache_beam/portability/api/beam_runner_api_pb2.py>
RefactoringTool: Refactored <https://builds.apache.org/job/beam_PerformanceTests_WordCountIT_Py35/ws/src/sdks/python/test-suites/dataflow/py35/build/srcs/sdks/python/apache_beam/portability/api/beam_runner_api_pb2.py>
RefactoringTool: Wrote changes to <https://builds.apache.org/job/beam_PerformanceTests_WordCountIT_Py35/ws/src/sdks/python/test-suites/dataflow/py35/build/srcs/sdks/python/apache_beam/portability/api/beam_runner_api_pb2.py>
RefactoringTool: Refactoring <https://builds.apache.org/job/beam_PerformanceTests_WordCountIT_Py35/ws/src/sdks/python/test-suites/dataflow/py35/build/srcs/sdks/python/apache_beam/portability/api/beam_runner_api_pb2_grpc.py>
RefactoringTool: No changes in <https://builds.apache.org/job/beam_PerformanceTests_WordCountIT_Py35/ws/src/sdks/python/test-suites/dataflow/py35/build/srcs/sdks/python/apache_beam/portability/api/beam_runner_api_pb2_grpc.py>
RefactoringTool: Refactoring <https://builds.apache.org/job/beam_PerformanceTests_WordCountIT_Py35/ws/src/sdks/python/test-suites/dataflow/py35/build/srcs/sdks/python/apache_beam/portability/api/endpoints_pb2.py>
RefactoringTool: No changes to <https://builds.apache.org/job/beam_PerformanceTests_WordCountIT_Py35/ws/src/sdks/python/test-suites/dataflow/py35/build/srcs/sdks/python/apache_beam/portability/api/endpoints_pb2.py>
RefactoringTool: No changes to <https://builds.apache.org/job/beam_PerformanceTests_WordCountIT_Py35/ws/src/sdks/python/test-suites/dataflow/py35/build/srcs/sdks/python/apache_beam/portability/api/endpoints_pb2.py>
RefactoringTool: Refactoring <https://builds.apache.org/job/beam_PerformanceTests_WordCountIT_Py35/ws/src/sdks/python/test-suites/dataflow/py35/build/srcs/sdks/python/apache_beam/portability/api/endpoints_pb2_grpc.py>
RefactoringTool: No changes in <https://builds.apache.org/job/beam_PerformanceTests_WordCountIT_Py35/ws/src/sdks/python/test-suites/dataflow/py35/build/srcs/sdks/python/apache_beam/portability/api/endpoints_pb2_grpc.py>
RefactoringTool: Refactoring <https://builds.apache.org/job/beam_PerformanceTests_WordCountIT_Py35/ws/src/sdks/python/test-suites/dataflow/py35/build/srcs/sdks/python/apache_beam/portability/api/external_transforms_pb2.py>
RefactoringTool: Refactored <https://builds.apache.org/job/beam_PerformanceTests_WordCountIT_Py35/ws/src/sdks/python/test-suites/dataflow/py35/build/srcs/sdks/python/apache_beam/portability/api/external_transforms_pb2.py>
RefactoringTool: Wrote changes to <https://builds.apache.org/job/beam_PerformanceTests_WordCountIT_Py35/ws/src/sdks/python/test-suites/dataflow/py35/build/srcs/sdks/python/apache_beam/portability/api/external_transforms_pb2.py>
RefactoringTool: Refactoring <https://builds.apache.org/job/beam_PerformanceTests_WordCountIT_Py35/ws/src/sdks/python/test-suites/dataflow/py35/build/srcs/sdks/python/apache_beam/portability/api/external_transforms_pb2_grpc.py>
RefactoringTool: No changes in <https://builds.apache.org/job/beam_PerformanceTests_WordCountIT_Py35/ws/src/sdks/python/test-suites/dataflow/py35/build/srcs/sdks/python/apache_beam/portability/api/external_transforms_pb2_grpc.py>
RefactoringTool: Refactoring <https://builds.apache.org/job/beam_PerformanceTests_WordCountIT_Py35/ws/src/sdks/python/test-suites/dataflow/py35/build/srcs/sdks/python/apache_beam/portability/api/metrics_pb2.py>
RefactoringTool: Refactored <https://builds.apache.org/job/beam_PerformanceTests_WordCountIT_Py35/ws/src/sdks/python/test-suites/dataflow/py35/build/srcs/sdks/python/apache_beam/portability/api/metrics_pb2.py>
RefactoringTool: Wrote changes to <https://builds.apache.org/job/beam_PerformanceTests_WordCountIT_Py35/ws/src/sdks/python/test-suites/dataflow/py35/build/srcs/sdks/python/apache_beam/portability/api/metrics_pb2.py>
RefactoringTool: Refactoring <https://builds.apache.org/job/beam_PerformanceTests_WordCountIT_Py35/ws/src/sdks/python/test-suites/dataflow/py35/build/srcs/sdks/python/apache_beam/portability/api/metrics_pb2_grpc.py>
RefactoringTool: No changes in <https://builds.apache.org/job/beam_PerformanceTests_WordCountIT_Py35/ws/src/sdks/python/test-suites/dataflow/py35/build/srcs/sdks/python/apache_beam/portability/api/metrics_pb2_grpc.py>
RefactoringTool: Refactoring <https://builds.apache.org/job/beam_PerformanceTests_WordCountIT_Py35/ws/src/sdks/python/test-suites/dataflow/py35/build/srcs/sdks/python/apache_beam/portability/api/standard_window_fns_pb2.py>
RefactoringTool: Refactored <https://builds.apache.org/job/beam_PerformanceTests_WordCountIT_Py35/ws/src/sdks/python/test-suites/dataflow/py35/build/srcs/sdks/python/apache_beam/portability/api/standard_window_fns_pb2.py>
RefactoringTool: Wrote changes to <https://builds.apache.org/job/beam_PerformanceTests_WordCountIT_Py35/ws/src/sdks/python/test-suites/dataflow/py35/build/srcs/sdks/python/apache_beam/portability/api/standard_window_fns_pb2.py>
RefactoringTool: Refactoring <https://builds.apache.org/job/beam_PerformanceTests_WordCountIT_Py35/ws/src/sdks/python/test-suites/dataflow/py35/build/srcs/sdks/python/apache_beam/portability/api/standard_window_fns_pb2_grpc.py>
RefactoringTool: No changes in <https://builds.apache.org/job/beam_PerformanceTests_WordCountIT_Py35/ws/src/sdks/python/test-suites/dataflow/py35/build/srcs/sdks/python/apache_beam/portability/api/standard_window_fns_pb2_grpc.py>
RefactoringTool: Files that were modified:
RefactoringTool: <https://builds.apache.org/job/beam_PerformanceTests_WordCountIT_Py35/ws/src/sdks/python/test-suites/dataflow/py35/build/srcs/sdks/python/apache_beam/portability/api/beam_artifact_api_pb2.py>
RefactoringTool: <https://builds.apache.org/job/beam_PerformanceTests_WordCountIT_Py35/ws/src/sdks/python/test-suites/dataflow/py35/build/srcs/sdks/python/apache_beam/portability/api/beam_artifact_api_pb2_grpc.py>
RefactoringTool: <https://builds.apache.org/job/beam_PerformanceTests_WordCountIT_Py35/ws/src/sdks/python/test-suites/dataflow/py35/build/srcs/sdks/python/apache_beam/portability/api/beam_expansion_api_pb2.py>
RefactoringTool: <https://builds.apache.org/job/beam_PerformanceTests_WordCountIT_Py35/ws/src/sdks/python/test-suites/dataflow/py35/build/srcs/sdks/python/apache_beam/portability/api/beam_expansion_api_pb2_grpc.py>
RefactoringTool: <https://builds.apache.org/job/beam_PerformanceTests_WordCountIT_Py35/ws/src/sdks/python/test-suites/dataflow/py35/build/srcs/sdks/python/apache_beam/portability/api/beam_fn_api_pb2.py>
RefactoringTool: <https://builds.apache.org/job/beam_PerformanceTests_WordCountIT_Py35/ws/src/sdks/python/test-suites/dataflow/py35/build/srcs/sdks/python/apache_beam/portability/api/beam_fn_api_pb2_grpc.py>
RefactoringTool: <https://builds.apache.org/job/beam_PerformanceTests_WordCountIT_Py35/ws/src/sdks/python/test-suites/dataflow/py35/build/srcs/sdks/python/apache_beam/portability/api/beam_job_api_pb2.py>
RefactoringTool: <https://builds.apache.org/job/beam_PerformanceTests_WordCountIT_Py35/ws/src/sdks/python/test-suites/dataflow/py35/build/srcs/sdks/python/apache_beam/portability/api/beam_job_api_pb2_grpc.py>
RefactoringTool: <https://builds.apache.org/job/beam_PerformanceTests_WordCountIT_Py35/ws/src/sdks/python/test-suites/dataflow/py35/build/srcs/sdks/python/apache_beam/portability/api/beam_provision_api_pb2.py>
RefactoringTool: <https://builds.apache.org/job/beam_PerformanceTests_WordCountIT_Py35/ws/src/sdks/python/test-suites/dataflow/py35/build/srcs/sdks/python/apache_beam/portability/api/beam_provision_api_pb2_grpc.py>
RefactoringTool: <https://builds.apache.org/job/beam_PerformanceTests_WordCountIT_Py35/ws/src/sdks/python/test-suites/dataflow/py35/build/srcs/sdks/python/apache_beam/portability/api/beam_runner_api_pb2.py>
RefactoringTool: <https://builds.apache.org/job/beam_PerformanceTests_WordCountIT_Py35/ws/src/sdks/python/test-suites/dataflow/py35/build/srcs/sdks/python/apache_beam/portability/api/endpoints_pb2.py>
RefactoringTool: <https://builds.apache.org/job/beam_PerformanceTests_WordCountIT_Py35/ws/src/sdks/python/test-suites/dataflow/py35/build/srcs/sdks/python/apache_beam/portability/api/external_transforms_pb2.py>
RefactoringTool: <https://builds.apache.org/job/beam_PerformanceTests_WordCountIT_Py35/ws/src/sdks/python/test-suites/dataflow/py35/build/srcs/sdks/python/apache_beam/portability/api/metrics_pb2.py>
RefactoringTool: <https://builds.apache.org/job/beam_PerformanceTests_WordCountIT_Py35/ws/src/sdks/python/test-suites/dataflow/py35/build/srcs/sdks/python/apache_beam/portability/api/standard_window_fns_pb2.py>
setup.py:176: UserWarning: Python 3 support for the Apache Beam SDK is not yet fully supported. You may encounter buggy behavior or missing features.
'Python 3 support for the Apache Beam SDK is not yet fully supported. '
<https://builds.apache.org/job/beam_PerformanceTests_WordCountIT_Py35/ws/src/build/gradleenv/-1734967054/lib/python3.5/site-packages/setuptools/dist.py>:472: UserWarning: Normalizing '2.14.0.dev' to '2.14.0.dev0'
normalized_version,
warning: no files found matching 'README.md'
warning: no files found matching 'NOTICE'
warning: no files found matching 'LICENSE'
warning: cmd: standard file not found: should have one of README, README.rst, README.txt, README.md
ERROR: google-cloud-datastore 1.8.0 has requirement google-cloud-core<2.0dev,>=1.0.0, but you'll have google-cloud-core 0.29.1 which is incompatible.
setup.py:176: UserWarning: Python 3 support for the Apache Beam SDK is not yet fully supported. You may encounter buggy behavior or missing features.
'Python 3 support for the Apache Beam SDK is not yet fully supported. '
<https://builds.apache.org/job/beam_PerformanceTests_WordCountIT_Py35/ws/src/build/gradleenv/-1734967054/lib/python3.5/site-packages/setuptools/dist.py>:472: UserWarning: Normalizing '2.14.0.dev' to '2.14.0.dev0'
normalized_version,
warning: no files found matching 'README.md'
warning: no files found matching 'NOTICE'
warning: no files found matching 'LICENSE'
<https://builds.apache.org/job/beam_PerformanceTests_WordCountIT_Py35/ws/src/sdks/python/apache_beam/__init__.py>:84: UserWarning: Running the Apache Beam SDK on Python 3 is not yet fully supported. You may encounter buggy behavior or missing features.
'Running the Apache Beam SDK on Python 3 is not yet fully supported. '
test_wordcount_it (apache_beam.examples.wordcount_it_test.WordCountIT) ...
2019-05-17 20:34:38,610 3047c617 MainThread beam_integration_benchmark(1/1) ERROR Error during benchmark beam_integration_benchmark
Traceback (most recent call last):
File "<https://builds.apache.org/job/beam_PerformanceTests_WordCountIT_Py35/ws/PerfKitBenchmarker/perfkitbenchmarker/pkb.py",> line 760, in RunBenchmark
DoRunPhase(spec, collector, detailed_timer)
File "<https://builds.apache.org/job/beam_PerformanceTests_WordCountIT_Py35/ws/PerfKitBenchmarker/perfkitbenchmarker/pkb.py",> line 609, in DoRunPhase
samples = spec.BenchmarkRun(spec)
File "<https://builds.apache.org/job/beam_PerformanceTests_WordCountIT_Py35/ws/PerfKitBenchmarker/perfkitbenchmarker/linux_benchmarks/beam_integration_benchmark.py",> line 160, in Run
job_type=job_type)
File "<https://builds.apache.org/job/beam_PerformanceTests_WordCountIT_Py35/ws/PerfKitBenchmarker/perfkitbenchmarker/providers/gcp/gcp_dpb_dataflow.py",> line 90, in SubmitJob
assert retcode == 0, "Integration Test Failed."
AssertionError: Integration Test Failed.
2019-05-17 20:34:38,612 3047c617 MainThread beam_integration_benchmark(1/1) INFO Cleaning up benchmark beam_integration_benchmark
2019-05-17 20:34:38,614 3047c617 MainThread beam_integration_benchmark(1/1) ERROR Exception running benchmark
Traceback (most recent call last):
File "<https://builds.apache.org/job/beam_PerformanceTests_WordCountIT_Py35/ws/PerfKitBenchmarker/perfkitbenchmarker/pkb.py",> line 903, in RunBenchmarkTask
RunBenchmark(spec, collector)
File "<https://builds.apache.org/job/beam_PerformanceTests_WordCountIT_Py35/ws/PerfKitBenchmarker/perfkitbenchmarker/pkb.py",> line 760, in RunBenchmark
DoRunPhase(spec, collector, detailed_timer)
File "<https://builds.apache.org/job/beam_PerformanceTests_WordCountIT_Py35/ws/PerfKitBenchmarker/perfkitbenchmarker/pkb.py",> line 609, in DoRunPhase
samples = spec.BenchmarkRun(spec)
File "<https://builds.apache.org/job/beam_PerformanceTests_WordCountIT_Py35/ws/PerfKitBenchmarker/perfkitbenchmarker/linux_benchmarks/beam_integration_benchmark.py",> line 160, in Run
job_type=job_type)
File "<https://builds.apache.org/job/beam_PerformanceTests_WordCountIT_Py35/ws/PerfKitBenchmarker/perfkitbenchmarker/providers/gcp/gcp_dpb_dataflow.py",> line 90, in SubmitJob
assert retcode == 0, "Integration Test Failed."
AssertionError: Integration Test Failed.
2019-05-17 20:34:38,614 3047c617 MainThread beam_integration_benchmark(1/1) ERROR Benchmark 1/1 beam_integration_benchmark (UID: beam_integration_benchmark0) failed. Execution will continue.
2019-05-17 20:34:38,615 3047c617 MainThread beam_integration_benchmark(1/1) INFO Benchmark run statuses:
---------------------------------------------------------------------------------
Name UID Status Failed Substatus
---------------------------------------------------------------------------------
beam_integration_benchmark beam_integration_benchmark0 FAILED
---------------------------------------------------------------------------------
Success rate: 0.00% (0/1)
2019-05-17 20:34:38,615 3047c617 MainThread beam_integration_benchmark(1/1) INFO Complete logs can be found at: <https://builds.apache.org/job/beam_PerformanceTests_WordCountIT_Py35/ws/runs/3047c617/pkb.log>
2019-05-17 20:34:38,615 3047c617 MainThread beam_integration_benchmark(1/1) INFO Completion statuses can be found at: <https://builds.apache.org/job/beam_PerformanceTests_WordCountIT_Py35/ws/runs/3047c617/completion_statuses.json>
Build step 'Execute shell' marked build as failure
---------------------------------------------------------------------
To unsubscribe, e-mail: builds-unsubscribe@beam.apache.org
For additional commands, e-mail: builds-help@beam.apache.org
Jenkins build is back to normal :
beam_PerformanceTests_WordCountIT_Py35 #8
Posted by Apache Jenkins Server <je...@builds.apache.org>.
See <https://builds.apache.org/job/beam_PerformanceTests_WordCountIT_Py35/8/display/redirect?page=changes>
---------------------------------------------------------------------
To unsubscribe, e-mail: builds-unsubscribe@beam.apache.org
For additional commands, e-mail: builds-help@beam.apache.org
Build failed in Jenkins: beam_PerformanceTests_WordCountIT_Py35 #7
Posted by Apache Jenkins Server <je...@builds.apache.org>.
See <https://builds.apache.org/job/beam_PerformanceTests_WordCountIT_Py35/7/display/redirect>
------------------------------------------
[...truncated 262.96 KB...]
gs://temp-storage-for-end-to-end-tests/py-it-cloud/output/1558125906194/results-00024-of-00030
gs://temp-storage-for-end-to-end-tests/py-it-cloud/output/1558125906194/results-00028-of-00030
gs://temp-storage-for-end-to-end-tests/py-it-cloud/output/1558125906194/results-00013-of-00030
gs://temp-storage-for-end-to-end-tests/py-it-cloud/output/1558125906194/results-00022-of-00030
gs://temp-storage-for-end-to-end-tests/py-it-cloud/output/1558125906194/results-00010-of-00030
gs://temp-storage-for-end-to-end-tests/py-it-cloud/output/1558125906194/results-00023-of-00030
gs://temp-storage-for-end-to-end-tests/py-it-cloud/output/1558125906194/results-00005-of-00030
gs://temp-storage-for-end-to-end-tests/py-it-cloud/output/1558125906194/results-00002-of-00030
gs://temp-storage-for-end-to-end-tests/py-it-cloud/output/1558125906194/results-00009-of-00030
gs://temp-storage-for-end-to-end-tests/py-it-cloud/output/1558125906194/results-00011-of-00030
gs://temp-storage-for-end-to-end-tests/py-it-cloud/output/1558125906194/results-00003-of-00030
gs://temp-storage-for-end-to-end-tests/py-it-cloud/output/1558125906194/results-00026-of-00030
gs://temp-storage-for-end-to-end-tests/py-it-cloud/output/1558125906194/results-00025-of-00030
gs://temp-storage-for-end-to-end-tests/py-it-cloud/output/1558125906194/results-00019-of-00030
gs://temp-storage-for-end-to-end-tests/py-it-cloud/output/1558125906194/results-00001-of-00030
gs://temp-storage-for-end-to-end-tests/py-it-cloud/output/1558125906194/results-00016-of-00030
gs://temp-storage-for-end-to-end-tests/py-it-cloud/output/1558125906194/results-00007-of-00030
gs://temp-storage-for-end-to-end-tests/py-it-cloud/output/1558125906194/results-00000-of-00030
gs://temp-storage-for-end-to-end-tests/py-it-cloud/output/1558125906194/results-00004-of-00030
gs://temp-storage-for-end-to-end-tests/py-it-cloud/output/1558125906194/results-00012-of-00030
gs://temp-storage-for-end-to-end-tests/py-it-cloud/output/1558125906194/results-00029-of-00030
gs://temp-storage-for-end-to-end-tests/py-it-cloud/output/1558125906194/results-00015-of-00030
gs://temp-storage-for-end-to-end-tests/py-it-cloud/output/1558125906194/results-00008-of-00030
gs://temp-storage-for-end-to-end-tests/py-it-cloud/output/1558125906194/results-00018-of-00030
root: DEBUG: Connecting using Google Application Default Credentials.
oauth2client.transport: INFO: Attempting refresh to obtain initial access_token
root: DEBUG: Connecting using Google Application Default Credentials.
oauth2client.transport: INFO: Attempting refresh to obtain initial access_token
root: DEBUG: Connecting using Google Application Default Credentials.
oauth2client.transport: INFO: Attempting refresh to obtain initial access_token
root: DEBUG: Connecting using Google Application Default Credentials.
oauth2client.transport: INFO: Attempting refresh to obtain initial access_token
root: DEBUG: Connecting using Google Application Default Credentials.
oauth2client.transport: INFO: Attempting refresh to obtain initial access_token
root: DEBUG: Connecting using Google Application Default Credentials.
oauth2client.transport: INFO: Attempting refresh to obtain initial access_token
root: DEBUG: Connecting using Google Application Default Credentials.
oauth2client.transport: INFO: Attempting refresh to obtain initial access_token
root: DEBUG: Connecting using Google Application Default Credentials.
oauth2client.transport: INFO: Attempting refresh to obtain initial access_token
root: DEBUG: Connecting using Google Application Default Credentials.
oauth2client.transport: INFO: Attempting refresh to obtain initial access_token
root: DEBUG: Connecting using Google Application Default Credentials.
oauth2client.transport: INFO: Attempting refresh to obtain initial access_token
root: DEBUG: Connecting using Google Application Default Credentials.
oauth2client.transport: INFO: Attempting refresh to obtain initial access_token
root: DEBUG: Connecting using Google Application Default Credentials.
oauth2client.transport: INFO: Attempting refresh to obtain initial access_token
root: DEBUG: Connecting using Google Application Default Credentials.
oauth2client.transport: INFO: Attempting refresh to obtain initial access_token
root: DEBUG: Connecting using Google Application Default Credentials.
oauth2client.transport: INFO: Attempting refresh to obtain initial access_token
root: DEBUG: Connecting using Google Application Default Credentials.
oauth2client.transport: INFO: Attempting refresh to obtain initial access_token
root: DEBUG: Connecting using Google Application Default Credentials.
oauth2client.transport: INFO: Attempting refresh to obtain initial access_token
root: DEBUG: Connecting using Google Application Default Credentials.
oauth2client.transport: INFO: Attempting refresh to obtain initial access_token
root: DEBUG: Connecting using Google Application Default Credentials.
oauth2client.transport: INFO: Attempting refresh to obtain initial access_token
root: DEBUG: Connecting using Google Application Default Credentials.
oauth2client.transport: INFO: Attempting refresh to obtain initial access_token
root: DEBUG: Connecting using Google Application Default Credentials.
oauth2client.transport: INFO: Attempting refresh to obtain initial access_token
root: DEBUG: Connecting using Google Application Default Credentials.
oauth2client.transport: INFO: Attempting refresh to obtain initial access_token
root: DEBUG: Connecting using Google Application Default Credentials.
oauth2client.transport: INFO: Attempting refresh to obtain initial access_token
root: DEBUG: Connecting using Google Application Default Credentials.
oauth2client.transport: INFO: Attempting refresh to obtain initial access_token
root: DEBUG: Connecting using Google Application Default Credentials.
oauth2client.transport: INFO: Attempting refresh to obtain initial access_token
root: DEBUG: Connecting using Google Application Default Credentials.
oauth2client.transport: INFO: Attempting refresh to obtain initial access_token
root: DEBUG: Connecting using Google Application Default Credentials.
oauth2client.transport: INFO: Attempting refresh to obtain initial access_token
root: DEBUG: Connecting using Google Application Default Credentials.
oauth2client.transport: INFO: Attempting refresh to obtain initial access_token
root: DEBUG: Connecting using Google Application Default Credentials.
oauth2client.transport: INFO: Attempting refresh to obtain initial access_token
root: DEBUG: Connecting using Google Application Default Credentials.
oauth2client.transport: INFO: Attempting refresh to obtain initial access_token
root: DEBUG: Connecting using Google Application Default Credentials.
oauth2client.transport: INFO: Attempting refresh to obtain initial access_token
root: INFO: Read from given path gs://temp-storage-for-end-to-end-tests/py-it-cloud/output/1558125906194/results*-of-*, 26186927 lines, checksum: ea0ca2e5ee4ea5f218790f28d0b9fe7d09d8d710.
apache_beam.io.filesystem: DEBUG: Listing files in 'gs://temp-storage-for-end-to-end-tests/py-it-cloud/output/1558125906194/results'
apache_beam.io.filesystem: DEBUG: translate_pattern: 'gs://temp-storage-for-end-to-end-tests/py-it-cloud/output/1558125906194/results*-of-*' -> 'gs\\:\\/\\/temp\\-storage\\-for\\-end\\-to\\-end\\-tests\\/py\\-it\\-cloud\\/output\\/1558125906194\\/results[^/\\\\]*\\-of\\-[^/\\\\]*'
root: DEBUG: Connecting using Google Application Default Credentials.
root: INFO: Starting the size estimation of the input
oauth2client.transport: INFO: Attempting refresh to obtain initial access_token
root: INFO: Finished listing 30 files in 0.1171572208404541 seconds.
root: INFO: Find 30 files in gs://temp-storage-for-end-to-end-tests/py-it-cloud/output/1558125906194/results*-of-*:
gs://temp-storage-for-end-to-end-tests/py-it-cloud/output/1558125906194/results-00006-of-00030
gs://temp-storage-for-end-to-end-tests/py-it-cloud/output/1558125906194/results-00021-of-00030
gs://temp-storage-for-end-to-end-tests/py-it-cloud/output/1558125906194/results-00014-of-00030
gs://temp-storage-for-end-to-end-tests/py-it-cloud/output/1558125906194/results-00017-of-00030
gs://temp-storage-for-end-to-end-tests/py-it-cloud/output/1558125906194/results-00020-of-00030
gs://temp-storage-for-end-to-end-tests/py-it-cloud/output/1558125906194/results-00027-of-00030
gs://temp-storage-for-end-to-end-tests/py-it-cloud/output/1558125906194/results-00024-of-00030
gs://temp-storage-for-end-to-end-tests/py-it-cloud/output/1558125906194/results-00028-of-00030
gs://temp-storage-for-end-to-end-tests/py-it-cloud/output/1558125906194/results-00013-of-00030
gs://temp-storage-for-end-to-end-tests/py-it-cloud/output/1558125906194/results-00022-of-00030
gs://temp-storage-for-end-to-end-tests/py-it-cloud/output/1558125906194/results-00010-of-00030
gs://temp-storage-for-end-to-end-tests/py-it-cloud/output/1558125906194/results-00023-of-00030
gs://temp-storage-for-end-to-end-tests/py-it-cloud/output/1558125906194/results-00005-of-00030
gs://temp-storage-for-end-to-end-tests/py-it-cloud/output/1558125906194/results-00002-of-00030
gs://temp-storage-for-end-to-end-tests/py-it-cloud/output/1558125906194/results-00009-of-00030
gs://temp-storage-for-end-to-end-tests/py-it-cloud/output/1558125906194/results-00011-of-00030
gs://temp-storage-for-end-to-end-tests/py-it-cloud/output/1558125906194/results-00003-of-00030
gs://temp-storage-for-end-to-end-tests/py-it-cloud/output/1558125906194/results-00026-of-00030
gs://temp-storage-for-end-to-end-tests/py-it-cloud/output/1558125906194/results-00025-of-00030
gs://temp-storage-for-end-to-end-tests/py-it-cloud/output/1558125906194/results-00019-of-00030
gs://temp-storage-for-end-to-end-tests/py-it-cloud/output/1558125906194/results-00001-of-00030
gs://temp-storage-for-end-to-end-tests/py-it-cloud/output/1558125906194/results-00016-of-00030
gs://temp-storage-for-end-to-end-tests/py-it-cloud/output/1558125906194/results-00007-of-00030
gs://temp-storage-for-end-to-end-tests/py-it-cloud/output/1558125906194/results-00000-of-00030
gs://temp-storage-for-end-to-end-tests/py-it-cloud/output/1558125906194/results-00004-of-00030
gs://temp-storage-for-end-to-end-tests/py-it-cloud/output/1558125906194/results-00012-of-00030
gs://temp-storage-for-end-to-end-tests/py-it-cloud/output/1558125906194/results-00029-of-00030
gs://temp-storage-for-end-to-end-tests/py-it-cloud/output/1558125906194/results-00015-of-00030
gs://temp-storage-for-end-to-end-tests/py-it-cloud/output/1558125906194/results-00008-of-00030
gs://temp-storage-for-end-to-end-tests/py-it-cloud/output/1558125906194/results-00018-of-00030
root: DEBUG: Connecting using Google Application Default Credentials.
oauth2client.transport: INFO: Attempting refresh to obtain initial access_token
root: DEBUG: Connecting using Google Application Default Credentials.
oauth2client.transport: INFO: Attempting refresh to obtain initial access_token
root: DEBUG: Connecting using Google Application Default Credentials.
oauth2client.transport: INFO: Attempting refresh to obtain initial access_token
root: DEBUG: Connecting using Google Application Default Credentials.
oauth2client.transport: INFO: Attempting refresh to obtain initial access_token
root: DEBUG: Connecting using Google Application Default Credentials.
oauth2client.transport: INFO: Attempting refresh to obtain initial access_token
root: DEBUG: Connecting using Google Application Default Credentials.
oauth2client.transport: INFO: Attempting refresh to obtain initial access_token
root: DEBUG: Connecting using Google Application Default Credentials.
oauth2client.transport: INFO: Attempting refresh to obtain initial access_token
root: DEBUG: Connecting using Google Application Default Credentials.
oauth2client.transport: INFO: Attempting refresh to obtain initial access_token
root: DEBUG: Connecting using Google Application Default Credentials.
oauth2client.transport: INFO: Attempting refresh to obtain initial access_token
root: DEBUG: Connecting using Google Application Default Credentials.
oauth2client.transport: INFO: Attempting refresh to obtain initial access_token
root: DEBUG: Connecting using Google Application Default Credentials.
oauth2client.transport: INFO: Attempting refresh to obtain initial access_token
root: DEBUG: Connecting using Google Application Default Credentials.
oauth2client.transport: INFO: Attempting refresh to obtain initial access_token
root: DEBUG: Connecting using Google Application Default Credentials.
oauth2client.transport: INFO: Attempting refresh to obtain initial access_token
root: DEBUG: Connecting using Google Application Default Credentials.
oauth2client.transport: INFO: Attempting refresh to obtain initial access_token
root: DEBUG: Connecting using Google Application Default Credentials.
oauth2client.transport: INFO: Attempting refresh to obtain initial access_token
root: DEBUG: Connecting using Google Application Default Credentials.
oauth2client.transport: INFO: Attempting refresh to obtain initial access_token
root: DEBUG: Connecting using Google Application Default Credentials.
oauth2client.transport: INFO: Attempting refresh to obtain initial access_token
root: DEBUG: Connecting using Google Application Default Credentials.
oauth2client.transport: INFO: Attempting refresh to obtain initial access_token
root: DEBUG: Connecting using Google Application Default Credentials.
oauth2client.transport: INFO: Attempting refresh to obtain initial access_token
root: DEBUG: Connecting using Google Application Default Credentials.
oauth2client.transport: INFO: Attempting refresh to obtain initial access_token
root: DEBUG: Connecting using Google Application Default Credentials.
oauth2client.transport: INFO: Attempting refresh to obtain initial access_token
root: DEBUG: Connecting using Google Application Default Credentials.
oauth2client.transport: INFO: Attempting refresh to obtain initial access_token
root: DEBUG: Connecting using Google Application Default Credentials.
oauth2client.transport: INFO: Attempting refresh to obtain initial access_token
root: DEBUG: Connecting using Google Application Default Credentials.
oauth2client.transport: INFO: Attempting refresh to obtain initial access_token
root: DEBUG: Connecting using Google Application Default Credentials.
oauth2client.transport: INFO: Attempting refresh to obtain initial access_token
root: DEBUG: Connecting using Google Application Default Credentials.
oauth2client.transport: INFO: Attempting refresh to obtain initial access_token
root: DEBUG: Connecting using Google Application Default Credentials.
oauth2client.transport: INFO: Attempting refresh to obtain initial access_token
root: DEBUG: Connecting using Google Application Default Credentials.
oauth2client.transport: INFO: Attempting refresh to obtain initial access_token
root: DEBUG: Connecting using Google Application Default Credentials.
oauth2client.transport: INFO: Attempting refresh to obtain initial access_token
root: DEBUG: Connecting using Google Application Default Credentials.
oauth2client.transport: INFO: Attempting refresh to obtain initial access_token
root: INFO: Read from given path gs://temp-storage-for-end-to-end-tests/py-it-cloud/output/1558125906194/results*-of-*, 26186927 lines, checksum: ea0ca2e5ee4ea5f218790f28d0b9fe7d09d8d710.
apache_beam.io.filesystem: DEBUG: Listing files in 'gs://temp-storage-for-end-to-end-tests/py-it-cloud/output/1558125906194/results'
apache_beam.io.filesystem: DEBUG: translate_pattern: 'gs://temp-storage-for-end-to-end-tests/py-it-cloud/output/1558125906194/results*' -> 'gs\\:\\/\\/temp\\-storage\\-for\\-end\\-to\\-end\\-tests\\/py\\-it\\-cloud\\/output\\/1558125906194\\/results[^/\\\\]*'
root: DEBUG: Connecting using Google Application Default Credentials.
root: INFO: Starting the size estimation of the input
oauth2client.transport: INFO: Attempting refresh to obtain initial access_token
root: INFO: Finished listing 30 files in 0.0853724479675293 seconds.
root: DEBUG: Connecting using Google Application Default Credentials.
oauth2client.transport: INFO: Attempting refresh to obtain initial access_token
--------------------- >> end captured logging << ---------------------
----------------------------------------------------------------------
XML: <https://builds.apache.org/job/beam_PerformanceTests_WordCountIT_Py35/ws/src/sdks/python/nosetests.xml>
----------------------------------------------------------------------
Ran 1 test in 997.545s
FAILED (failures=1)
FAILURE: Build failed with an exception.
* What went wrong:
Execution failed for task ':sdks:python:test-suites:dataflow:py35:integrationTest'.
> Process 'command 'sh'' finished with non-zero exit value 1
* Try:
Run with --stacktrace option to get the stack trace. Run with --debug option to get more log output. Run with --scan to get full insights.
* Get more help at https://help.gradle.org
BUILD FAILED in 17m 27s
2019-05-17 21:01:45,394 5994d3e8 MainThread beam_integration_benchmark(1/1) ERROR Error during benchmark beam_integration_benchmark
Traceback (most recent call last):
File "<https://builds.apache.org/job/beam_PerformanceTests_WordCountIT_Py35/ws/PerfKitBenchmarker/perfkitbenchmarker/pkb.py",> line 760, in RunBenchmark
DoRunPhase(spec, collector, detailed_timer)
File "<https://builds.apache.org/job/beam_PerformanceTests_WordCountIT_Py35/ws/PerfKitBenchmarker/perfkitbenchmarker/pkb.py",> line 609, in DoRunPhase
samples = spec.BenchmarkRun(spec)
File "<https://builds.apache.org/job/beam_PerformanceTests_WordCountIT_Py35/ws/PerfKitBenchmarker/perfkitbenchmarker/linux_benchmarks/beam_integration_benchmark.py",> line 160, in Run
job_type=job_type)
File "<https://builds.apache.org/job/beam_PerformanceTests_WordCountIT_Py35/ws/PerfKitBenchmarker/perfkitbenchmarker/providers/gcp/gcp_dpb_dataflow.py",> line 90, in SubmitJob
assert retcode == 0, "Integration Test Failed."
AssertionError: Integration Test Failed.
2019-05-17 21:01:45,396 5994d3e8 MainThread beam_integration_benchmark(1/1) INFO Cleaning up benchmark beam_integration_benchmark
2019-05-17 21:01:45,398 5994d3e8 MainThread beam_integration_benchmark(1/1) ERROR Exception running benchmark
Traceback (most recent call last):
File "<https://builds.apache.org/job/beam_PerformanceTests_WordCountIT_Py35/ws/PerfKitBenchmarker/perfkitbenchmarker/pkb.py",> line 903, in RunBenchmarkTask
RunBenchmark(spec, collector)
File "<https://builds.apache.org/job/beam_PerformanceTests_WordCountIT_Py35/ws/PerfKitBenchmarker/perfkitbenchmarker/pkb.py",> line 760, in RunBenchmark
DoRunPhase(spec, collector, detailed_timer)
File "<https://builds.apache.org/job/beam_PerformanceTests_WordCountIT_Py35/ws/PerfKitBenchmarker/perfkitbenchmarker/pkb.py",> line 609, in DoRunPhase
samples = spec.BenchmarkRun(spec)
File "<https://builds.apache.org/job/beam_PerformanceTests_WordCountIT_Py35/ws/PerfKitBenchmarker/perfkitbenchmarker/linux_benchmarks/beam_integration_benchmark.py",> line 160, in Run
job_type=job_type)
File "<https://builds.apache.org/job/beam_PerformanceTests_WordCountIT_Py35/ws/PerfKitBenchmarker/perfkitbenchmarker/providers/gcp/gcp_dpb_dataflow.py",> line 90, in SubmitJob
assert retcode == 0, "Integration Test Failed."
AssertionError: Integration Test Failed.
2019-05-17 21:01:45,399 5994d3e8 MainThread beam_integration_benchmark(1/1) ERROR Benchmark 1/1 beam_integration_benchmark (UID: beam_integration_benchmark0) failed. Execution will continue.
2019-05-17 21:01:45,399 5994d3e8 MainThread beam_integration_benchmark(1/1) INFO Benchmark run statuses:
---------------------------------------------------------------------------------
Name UID Status Failed Substatus
---------------------------------------------------------------------------------
beam_integration_benchmark beam_integration_benchmark0 FAILED
---------------------------------------------------------------------------------
Success rate: 0.00% (0/1)
2019-05-17 21:01:45,399 5994d3e8 MainThread beam_integration_benchmark(1/1) INFO Complete logs can be found at: <https://builds.apache.org/job/beam_PerformanceTests_WordCountIT_Py35/ws/runs/5994d3e8/pkb.log>
2019-05-17 21:01:45,399 5994d3e8 MainThread beam_integration_benchmark(1/1) INFO Completion statuses can be found at: <https://builds.apache.org/job/beam_PerformanceTests_WordCountIT_Py35/ws/runs/5994d3e8/completion_statuses.json>
Build step 'Execute shell' marked build as failure
---------------------------------------------------------------------
To unsubscribe, e-mail: builds-unsubscribe@beam.apache.org
For additional commands, e-mail: builds-help@beam.apache.org