You are viewing a plain text version of this content. The canonical link for it is here.
Posted to commits@myfaces.apache.org by Apache Jenkins Server <je...@builds.apache.org> on 2015/03/22 00:47:58 UTC
Build failed in Jenkins: myfaces-current21_949 #2575
See <https://builds.apache.org/job/myfaces-current21_949/2575/>
------------------------------------------
[...truncated 3557 lines...]
[INFO] ------------------------------------------------------------------------
[INFO] [remote-resources:process {execution: default}]
[debug] execute contextualize
[INFO] [resources:resources {execution: default-resources}]
[INFO] Using 'UTF-8' encoding to copy filtered resources.
[INFO] skip non existing resourceDirectory <https://builds.apache.org/job/myfaces-current21_949/ws/2.1.x-client-window/bundle/src/main/resources>
[INFO] Copying 3 resources
[INFO] [compiler:compile {execution: default-compile}]
[INFO] No sources to compile
[debug] execute contextualize
[INFO] [resources:testResources {execution: default-testResources}]
[INFO] Using 'UTF-8' encoding to copy filtered resources.
[INFO] skip non existing resourceDirectory <https://builds.apache.org/job/myfaces-current21_949/ws/2.1.x-client-window/bundle/src/test/resources>
[INFO] Copying 3 resources
[INFO] [compiler:testCompile {execution: default-testCompile}]
[INFO] No sources to compile
[INFO] [surefire:test {execution: default-test}]
[INFO] Surefire report directory: <https://builds.apache.org/job/myfaces-current21_949/ws/2.1.x-client-window/bundle/target/surefire-reports>
-------------------------------------------------------
T E S T S
-------------------------------------------------------
Results :
Tests run: 0, Failures: 0, Errors: 0, Skipped: 0
[JENKINS] Recording test results
[INFO] [bundle:bundle {execution: default-bundle}]
[WARNING] Warning building bundle org.apache.myfaces.core:myfaces-bundle:bundle:2.1.9-CLIENT-WINDOW-SNAPSHOT : Instructions in Export-Package that are never used: org\.apache\.myfaces\.ee6
Classpath: Jar:.,Jar:myfaces-api,Jar:myfaces-impl,Jar:commons-collections,Jar:commons-codec,Jar:commons-beanutils,Jar:commons-logging,Jar:commons-digester
[WARNING] Warning building bundle org.apache.myfaces.core:myfaces-bundle:bundle:2.1.9-CLIENT-WINDOW-SNAPSHOT : Superfluous export-package instructions: [org.apache.myfaces.ee6]
[INFO] Preparing source:jar
[WARNING] Removing: jar from forked lifecycle, to prevent recursive invocation.
[INFO] No goals needed for project - skipping
[INFO] [source:jar {execution: attach-source}]
[INFO] Building jar: <https://builds.apache.org/job/myfaces-current21_949/ws/2.1.x-client-window/bundle/target/myfaces-bundle-2.1.9-CLIENT-WINDOW-SNAPSHOT-sources.jar>
[INFO] [checkstyle:check {execution: verify-style}]
[INFO]
[INFO] [install:install {execution: default-install}]
[INFO] Installing <https://builds.apache.org/job/myfaces-current21_949/ws/2.1.x-client-window/bundle/target/myfaces-bundle-2.1.9-CLIENT-WINDOW-SNAPSHOT.jar> to /home/jenkins/jenkins-slave/maven-repositories/0/org/apache/myfaces/core/myfaces-bundle/2.1.9-CLIENT-WINDOW-SNAPSHOT/myfaces-bundle-2.1.9-CLIENT-WINDOW-SNAPSHOT.jar
[INFO] Installing <https://builds.apache.org/job/myfaces-current21_949/ws/2.1.x-client-window/bundle/target/myfaces-bundle-2.1.9-CLIENT-WINDOW-SNAPSHOT-sources.jar> to /home/jenkins/jenkins-slave/maven-repositories/0/org/apache/myfaces/core/myfaces-bundle/2.1.9-CLIENT-WINDOW-SNAPSHOT/myfaces-bundle-2.1.9-CLIENT-WINDOW-SNAPSHOT-sources.jar
[INFO] [bundle:install {execution: default-install}]
[INFO] Installing org/apache/myfaces/core/myfaces-bundle/2.1.9-CLIENT-WINDOW-SNAPSHOT/myfaces-bundle-2.1.9-CLIENT-WINDOW-SNAPSHOT.jar
[INFO] Writing OBR metadata
[INFO] ------------------------------------------------------------------------
[INFO] Building Apache MyFaces JSF-2.1 Core Module
[INFO] task-segment: [install]
[INFO] ------------------------------------------------------------------------
[INFO] [remote-resources:process {execution: default}]
[INFO] [site:attach-descriptor {execution: default-attach-descriptor}]
[INFO] [checkstyle:check {execution: verify-style}]
[INFO]
[INFO] [install:install {execution: default-install}]
[INFO] Installing <https://builds.apache.org/job/myfaces-current21_949/ws/2.1.x-client-window/pom.xml> to /home/jenkins/jenkins-slave/maven-repositories/0/org/apache/myfaces/core/myfaces-core-module/2.1.9-CLIENT-WINDOW-SNAPSHOT/myfaces-core-module-2.1.9-CLIENT-WINDOW-SNAPSHOT.pom
[INFO] ------------------------------------------------------------------------
[INFO] Building client-window-example
[INFO] task-segment: [install]
[INFO] ------------------------------------------------------------------------
[INFO] [remote-resources:process {execution: default}]
[debug] execute contextualize
[INFO] [resources:resources {execution: default-resources}]
[INFO] Using 'UTF-8' encoding to copy filtered resources.
[INFO] Copying 0 resource
[INFO] Copying 3 resources
[INFO] [compiler:compile {execution: default-compile}]
[INFO] Compiling 9 source files to <https://builds.apache.org/job/myfaces-current21_949/ws/2.1.x-client-window/client-window-example/target/classes>
[INFO] [build-helper:add-test-resource {execution: add-webapp-folder-as-test}]
[debug] execute contextualize
[INFO] [resources:testResources {execution: default-testResources}]
[INFO] Using 'UTF-8' encoding to copy filtered resources.
[INFO] Copying 1 resource
[INFO] Copying 3 resources
[INFO] Copying 25 resources to webapp
[INFO] [compiler:testCompile {execution: default-testCompile}]
[INFO] Compiling 1 source file to <https://builds.apache.org/job/myfaces-current21_949/ws/2.1.x-client-window/client-window-example/target/test-classes>
[INFO] [surefire:test {execution: default-test}]
[INFO] Surefire report directory: <https://builds.apache.org/job/myfaces-current21_949/ws/2.1.x-client-window/client-window-example/target/surefire-reports>
-------------------------------------------------------
T E S T S
-------------------------------------------------------
Running org.apache.myfaces.example.clientWindow.CheckFaceletsFileTestCase
Mar 21, 2015 11:42:28 PM org.apache.myfaces.util.ExternalSpecifications isUnifiedELAvailable
INFO: MyFaces Unified EL support enabled
Tests run: 3, Failures: 0, Errors: 0, Skipped: 0, Time elapsed: 1.172 sec
Results :
Tests run: 3, Failures: 0, Errors: 0, Skipped: 0
[JENKINS] Recording test results
[INFO] [war:war {execution: default-war}]
[INFO] Packaging webapp
[INFO] Assembling webapp[client-window-example] in [<https://builds.apache.org/job/myfaces-current21_949/ws/2.1.x-client-window/client-window-example/target/client-window-example]>
[INFO] Processing war project
[INFO] Copying webapp resources[<https://builds.apache.org/job/myfaces-current21_949/ws/2.1.x-client-window/client-window-example/src/main/webapp]>
[INFO] Webapp assembled in[70 msecs]
[INFO] Building war: <https://builds.apache.org/job/myfaces-current21_949/ws/2.1.x-client-window/client-window-example/target/client-window-example.war>
[INFO] [checkstyle:check {execution: verify-style}]
[INFO]
[INFO] [install:install {execution: default-install}]
[INFO] Installing <https://builds.apache.org/job/myfaces-current21_949/ws/2.1.x-client-window/client-window-example/target/client-window-example.war> to /home/jenkins/jenkins-slave/maven-repositories/0/org/apache/myfaces/example/clientWindow/client-window-example/2.1.9-CLIENT-WINDOW-SNAPSHOT/client-window-example-2.1.9-CLIENT-WINDOW-SNAPSHOT.war
[INFO]
[INFO]
[INFO] ------------------------------------------------------------------------
[INFO] Reactor Summary:
[INFO] ------------------------------------------------------------------------
[INFO] Apache MyFaces JSF-2.1 Core Project ................... SUCCESS [5.828s]
[INFO] Apache MyFaces JSF-2.1 Core API ....................... SUCCESS [36.867s]
[INFO] Apache MyFaces Shared Public API For JSF 2.1 - Core ... SUCCESS [4.867s]
[INFO] Apache MyFaces Core For JSF 2.1 - Shared .............. SUCCESS [10.726s]
[INFO] Apache MyFaces JSF-2.1 Core Impl ...................... SUCCESS [1:01.383s]
[INFO] Apache MyFaces JSF-2.1 Core OSGi Bundle ............... SUCCESS [6.058s]
[INFO] Apache MyFaces JSF-2.1 Core Module .................... SUCCESS [0.387s]
[INFO] client-window-example ................................. SUCCESS [3.771s]
[INFO] ------------------------------------------------------------------------
[INFO] ------------------------------------------------------------------------
[INFO] BUILD SUCCESSFUL
[INFO] ------------------------------------------------------------------------
[INFO] Total time: 2 minutes 17 seconds
[INFO] Finished at: Sat Mar 21 23:42:29 UTC 2015
[INFO] Final Memory: 160M/926M
[INFO] ------------------------------------------------------------------------
[JENKINS] Archiving <https://builds.apache.org/job/myfaces-current21_949/ws/2.1.x-client-window/client-window-example/pom.xml> to org.apache.myfaces.example.clientWindow/client-window-example/2.1.9-CLIENT-WINDOW-SNAPSHOT/client-window-example-2.1.9-CLIENT-WINDOW-SNAPSHOT.pom
[JENKINS] Archiving <https://builds.apache.org/job/myfaces-current21_949/ws/2.1.x-client-window/client-window-example/target/client-window-example.war> to org.apache.myfaces.example.clientWindow/client-window-example/2.1.9-CLIENT-WINDOW-SNAPSHOT/client-window-example-2.1.9-CLIENT-WINDOW-SNAPSHOT.war
Sending artifact delta relative to myfaces-current21_949 » client-window-example #2574
Archived 2 artifacts
Archive block size is 32768
Received 11 blocks and 76140 bytes
Compression is 82.6%
Took 0.41 sec
[JENKINS] Archiving <https://builds.apache.org/job/myfaces-current21_949/ws/2.1.x-client-window/shared-public/pom.xml> to org.apache.myfaces.core.internal/myfaces-impl-shared-public/2.1.9-CLIENT-WINDOW-SNAPSHOT/myfaces-impl-shared-public-2.1.9-CLIENT-WINDOW-SNAPSHOT.pom
[JENKINS] Archiving <https://builds.apache.org/job/myfaces-current21_949/ws/2.1.x-client-window/shared-public/target/myfaces-impl-shared-public-2.1.9-CLIENT-WINDOW-SNAPSHOT.jar> to org.apache.myfaces.core.internal/myfaces-impl-shared-public/2.1.9-CLIENT-WINDOW-SNAPSHOT/myfaces-impl-shared-public-2.1.9-CLIENT-WINDOW-SNAPSHOT.jar
[JENKINS] Archiving <https://builds.apache.org/job/myfaces-current21_949/ws/2.1.x-client-window/shared-public/target/myfaces-impl-shared-public-2.1.9-CLIENT-WINDOW-SNAPSHOT-sources.jar> to org.apache.myfaces.core.internal/myfaces-impl-shared-public/2.1.9-CLIENT-WINDOW-SNAPSHOT/myfaces-impl-shared-public-2.1.9-CLIENT-WINDOW-SNAPSHOT-sources.jar
Sending artifact delta relative to myfaces-current21_949 » Apache MyFaces Shared Public API For JSF 2.1 - Core #2574
Archived 3 artifacts
Archive block size is 32768
Received 0 blocks and 186236 bytes
Compression is 0.0%
Took 0.24 sec
[JENKINS] Archiving <https://builds.apache.org/job/myfaces-current21_949/ws/2.1.x-client-window/impl/pom.xml> to org.apache.myfaces.core/myfaces-impl/2.1.9-CLIENT-WINDOW-SNAPSHOT/myfaces-impl-2.1.9-CLIENT-WINDOW-SNAPSHOT.pom
[JENKINS] Archiving <https://builds.apache.org/job/myfaces-current21_949/ws/2.1.x-client-window/impl/target/myfaces-impl-2.1.9-CLIENT-WINDOW-SNAPSHOT.jar> to org.apache.myfaces.core/myfaces-impl/2.1.9-CLIENT-WINDOW-SNAPSHOT/myfaces-impl-2.1.9-CLIENT-WINDOW-SNAPSHOT.jar
[JENKINS] Archiving <https://builds.apache.org/job/myfaces-current21_949/ws/2.1.x-client-window/impl/target/myfaces-impl-2.1.9-CLIENT-WINDOW-SNAPSHOT-sources.jar> to org.apache.myfaces.core/myfaces-impl/2.1.9-CLIENT-WINDOW-SNAPSHOT/myfaces-impl-2.1.9-CLIENT-WINDOW-SNAPSHOT-sources.jar
[JENKINS] Archiving <https://builds.apache.org/job/myfaces-current21_949/ws/2.1.x-client-window/impl/target/myfaces-impl-2.1.9-CLIENT-WINDOW-SNAPSHOT-tests.jar> to org.apache.myfaces.core/myfaces-impl/2.1.9-CLIENT-WINDOW-SNAPSHOT/myfaces-impl-2.1.9-CLIENT-WINDOW-SNAPSHOT-tests.jar
Sending artifact delta relative to myfaces-current21_949 » Apache MyFaces JSF-2.1 Core Impl #2574
Archived 4 artifacts
Archive block size is 32768
Received 3 blocks and 4860404 bytes
Compression is 2.0%
Took 1.7 sec
[JENKINS] Archiving <https://builds.apache.org/job/myfaces-current21_949/ws/2.1.x-client-window/bundle/pom.xml> to org.apache.myfaces.core/myfaces-bundle/2.1.9-CLIENT-WINDOW-SNAPSHOT/myfaces-bundle-2.1.9-CLIENT-WINDOW-SNAPSHOT.pom
[JENKINS] Archiving <https://builds.apache.org/job/myfaces-current21_949/ws/2.1.x-client-window/bundle/target/myfaces-bundle-2.1.9-CLIENT-WINDOW-SNAPSHOT.jar> to org.apache.myfaces.core/myfaces-bundle/2.1.9-CLIENT-WINDOW-SNAPSHOT/myfaces-bundle-2.1.9-CLIENT-WINDOW-SNAPSHOT.jar
[JENKINS] Archiving <https://builds.apache.org/job/myfaces-current21_949/ws/2.1.x-client-window/bundle/target/myfaces-bundle-2.1.9-CLIENT-WINDOW-SNAPSHOT-sources.jar> to org.apache.myfaces.core/myfaces-bundle/2.1.9-CLIENT-WINDOW-SNAPSHOT/myfaces-bundle-2.1.9-CLIENT-WINDOW-SNAPSHOT-sources.jar
Sending artifact delta relative to myfaces-current21_949 » Apache MyFaces JSF-2.1 Core OSGi Bundle #2574
Archived 3 artifacts
Archive block size is 32768
Received 2 blocks and 3133560 bytes
Compression is 2.0%
Took 0.97 sec
[JENKINS] Archiving <https://builds.apache.org/job/myfaces-current21_949/ws/2.1.x-client-window/api/pom.xml> to org.apache.myfaces.core/myfaces-api/2.1.9-CLIENT-WINDOW-SNAPSHOT/myfaces-api-2.1.9-CLIENT-WINDOW-SNAPSHOT.pom
[JENKINS] Archiving <https://builds.apache.org/job/myfaces-current21_949/ws/2.1.x-client-window/api/target/myfaces-api-2.1.9-CLIENT-WINDOW-SNAPSHOT.jar> to org.apache.myfaces.core/myfaces-api/2.1.9-CLIENT-WINDOW-SNAPSHOT/myfaces-api-2.1.9-CLIENT-WINDOW-SNAPSHOT.jar
[JENKINS] Archiving <https://builds.apache.org/job/myfaces-current21_949/ws/2.1.x-client-window/api/target/myfaces-api-2.1.9-CLIENT-WINDOW-SNAPSHOT-sources.jar> to org.apache.myfaces.core/myfaces-api/2.1.9-CLIENT-WINDOW-SNAPSHOT/myfaces-api-2.1.9-CLIENT-WINDOW-SNAPSHOT-sources.jar
[JENKINS] Archiving <https://builds.apache.org/job/myfaces-current21_949/ws/2.1.x-client-window/api/target/myfaces-api-2.1.9-CLIENT-WINDOW-SNAPSHOT-tests.jar> to org.apache.myfaces.core/myfaces-api/2.1.9-CLIENT-WINDOW-SNAPSHOT/myfaces-api-2.1.9-CLIENT-WINDOW-SNAPSHOT-tests.jar
Sending artifact delta relative to myfaces-current21_949 » Apache MyFaces JSF-2.1 Core API #2574
Archived 4 artifacts
Archive block size is 32768
Received 20 blocks and 1689726 bytes
Compression is 27.9%
Took 0.65 sec
[JENKINS] Archiving /home/jenkins/jenkins-slave/maven-repositories/0/org/apache/myfaces/core/myfaces-core-project/2.1.9-CLIENT-WINDOW-SNAPSHOT/myfaces-core-project-2.1.9-CLIENT-WINDOW-SNAPSHOT.pom to org.apache.myfaces.core/myfaces-core-project/2.1.9-CLIENT-WINDOW-SNAPSHOT/myfaces-core-project-2.1.9-CLIENT-WINDOW-SNAPSHOT.pom
[JENKINS] Archiving <https://builds.apache.org/job/myfaces-current21_949/ws/2.1.x-client-window/parent/target/myfaces-core-project-2.1.9-CLIENT-WINDOW-SNAPSHOT-site.xml> to org.apache.myfaces.core/myfaces-core-project/2.1.9-CLIENT-WINDOW-SNAPSHOT/myfaces-core-project-2.1.9-CLIENT-WINDOW-SNAPSHOT-site.xml
/home/jenkins/jenkins-slave/maven-repositories/0/org/apache/myfaces/core/myfaces-core-project/2.1.9-CLIENT-WINDOW-SNAPSHOT/myfaces-core-project-2.1.9-CLIENT-WINDOW-SNAPSHOT.pom is not inside <https://builds.apache.org/job/myfaces-current21_949/ws/2.1.x-client-window/parent/;> will archive in a separate pass
Sending artifact delta relative to myfaces-current21_949 » Apache MyFaces JSF-2.1 Core Project #2574
Archived 1 artifacts
Archive block size is 32768
Received 0 blocks and 6140 bytes
Compression is 0.0%
Took 0.12 sec
Sending artifact delta relative to myfaces-current21_949 » Apache MyFaces JSF-2.1 Core Project #2574
Archived 1 artifacts
Archive block size is 32768
Received 0 blocks and 23567 bytes
Compression is 0.0%
Took 71 ms
[JENKINS] Archiving /home/jenkins/jenkins-slave/maven-repositories/0/org/apache/myfaces/core/myfaces-core-module/2.1.9-CLIENT-WINDOW-SNAPSHOT/myfaces-core-module-2.1.9-CLIENT-WINDOW-SNAPSHOT.pom to org.apache.myfaces.core/myfaces-core-module/2.1.9-CLIENT-WINDOW-SNAPSHOT/myfaces-core-module-2.1.9-CLIENT-WINDOW-SNAPSHOT.pom
/home/jenkins/jenkins-slave/maven-repositories/0/org/apache/myfaces/core/myfaces-core-module/2.1.9-CLIENT-WINDOW-SNAPSHOT/myfaces-core-module-2.1.9-CLIENT-WINDOW-SNAPSHOT.pom is not inside <https://builds.apache.org/job/myfaces-current21_949/ws/2.1.x-client-window/;> will archive in a separate pass
Sending artifact delta relative to myfaces-current21_949 » Apache MyFaces JSF-2.1 Core Module #2574
Archived 1 artifacts
Archive block size is 32768
Received 0 blocks and 7973 bytes
Compression is 0.0%
Took 80 ms
[JENKINS] Archiving <https://builds.apache.org/job/myfaces-current21_949/ws/2.1.x-client-window/shared/pom.xml> to org.apache.myfaces.core.internal/myfaces-impl-shared/2.1.9-CLIENT-WINDOW-SNAPSHOT/myfaces-impl-shared-2.1.9-CLIENT-WINDOW-SNAPSHOT.pom
[JENKINS] Archiving <https://builds.apache.org/job/myfaces-current21_949/ws/2.1.x-client-window/shared/target/myfaces-impl-shared-2.1.9-CLIENT-WINDOW-SNAPSHOT.jar> to org.apache.myfaces.core.internal/myfaces-impl-shared/2.1.9-CLIENT-WINDOW-SNAPSHOT/myfaces-impl-shared-2.1.9-CLIENT-WINDOW-SNAPSHOT.jar
[JENKINS] Archiving <https://builds.apache.org/job/myfaces-current21_949/ws/2.1.x-client-window/shared/target/myfaces-impl-shared-2.1.9-CLIENT-WINDOW-SNAPSHOT-sources.jar> to org.apache.myfaces.core.internal/myfaces-impl-shared/2.1.9-CLIENT-WINDOW-SNAPSHOT/myfaces-impl-shared-2.1.9-CLIENT-WINDOW-SNAPSHOT-sources.jar
Sending artifact delta relative to myfaces-current21_949 » Apache MyFaces Core For JSF 2.1 - Shared #2574
Archived 3 artifacts
Archive block size is 32768
Received 0 blocks and 904187 bytes
Compression is 0.0%
Took 0.39 sec
channel stopped
Maven RedeployPublisher use remote ubuntu-1 maven settings from : /home/jenkins/.m2/settings.xml
[INFO] Deployment in https://repository.apache.org/content/repositories/snapshots (id=apache.snapshots.https,uniqueVersion=false)
Deploying the main artifact myfaces-api-2.1.9-CLIENT-WINDOW-SNAPSHOT.jar
Deploying the main artifact myfaces-api-2.1.9-CLIENT-WINDOW-SNAPSHOT-sources.jar
Deploying the main artifact myfaces-api-2.1.9-CLIENT-WINDOW-SNAPSHOT-tests.jar
[INFO] Deployment in https://repository.apache.org/content/repositories/snapshots (id=apache.snapshots.https,uniqueVersion=false)
Deploying the main artifact myfaces-bundle-2.1.9-CLIENT-WINDOW-SNAPSHOT.jar
Deploying the main artifact myfaces-bundle-2.1.9-CLIENT-WINDOW-SNAPSHOT-sources.jar
[INFO] Deployment in https://repository.apache.org/content/repositories/snapshots (id=apache.snapshots.https,uniqueVersion=false)
Deploying the main artifact myfaces-core-module-2.1.9-CLIENT-WINDOW-SNAPSHOT.pom
[INFO] Deployment in https://repository.apache.org/content/repositories/snapshots (id=apache.snapshots.https,uniqueVersion=false)
Deploying the main artifact myfaces-core-project-2.1.9-CLIENT-WINDOW-SNAPSHOT.pom
Deploying the main artifact myfaces-core-project-2.1.9-CLIENT-WINDOW-SNAPSHOT-site.xml
[INFO] Deployment in https://repository.apache.org/content/repositories/snapshots (id=apache.snapshots.https,uniqueVersion=false)
Deploying the main artifact myfaces-impl-2.1.9-CLIENT-WINDOW-SNAPSHOT.jar
Deploying the main artifact myfaces-impl-2.1.9-CLIENT-WINDOW-SNAPSHOT-sources.jar
Deploying the main artifact myfaces-impl-2.1.9-CLIENT-WINDOW-SNAPSHOT-tests.jar
Deploying the main artifact myfaces-impl-2.1.9-CLIENT-WINDOW-SNAPSHOT-sources.jar
[INFO] Deployment in https://repository.apache.org/content/repositories/snapshots (id=apache.snapshots.https,uniqueVersion=false)
Deploying the main artifact myfaces-impl-shared-2.1.9-CLIENT-WINDOW-SNAPSHOT.jar
ERROR: Error deploying artifact: Failed to transfer file: https://repository.apache.org/content/repositories/snapshots/org/apache/myfaces/core/internal/myfaces-impl-shared/2.1.9-CLIENT-WINDOW-SNAPSHOT/myfaces-impl-shared-2.1.9-CLIENT-WINDOW-SNAPSHOT.jar.sha1. Return code is: 502, ReasonPhrase: Proxy Error.
org.apache.maven.artifact.deployer.ArtifactDeploymentException: Error deploying artifact: Failed to transfer file: https://repository.apache.org/content/repositories/snapshots/org/apache/myfaces/core/internal/myfaces-impl-shared/2.1.9-CLIENT-WINDOW-SNAPSHOT/myfaces-impl-shared-2.1.9-CLIENT-WINDOW-SNAPSHOT.jar.sha1. Return code is: 502, ReasonPhrase: Proxy Error.
at hudson.maven.artifact.deployer.DefaultArtifactDeployer.deploy(DefaultArtifactDeployer.java:175)
at hudson.maven.reporters.MavenArtifactRecord.deploy(MavenArtifactRecord.java:193)
at hudson.maven.RedeployPublisher.perform(RedeployPublisher.java:176)
at hudson.tasks.BuildStepMonitor$1.perform(BuildStepMonitor.java:20)
at hudson.model.AbstractBuild$AbstractBuildExecution.perform(AbstractBuild.java:756)
at hudson.model.AbstractBuild$AbstractBuildExecution.performAllBuildSteps(AbstractBuild.java:720)
at hudson.maven.MavenModuleSetBuild$MavenModuleSetBuildExecution.post2(MavenModuleSetBuild.java:1037)
at hudson.model.AbstractBuild$AbstractBuildExecution.post(AbstractBuild.java:669)
at hudson.model.Run.execute(Run.java:1731)
at hudson.maven.MavenModuleSetBuild.run(MavenModuleSetBuild.java:529)
at hudson.model.ResourceController.execute(ResourceController.java:88)
at hudson.model.Executor.run(Executor.java:232)
Caused by: org.apache.maven.wagon.TransferFailedException: Failed to transfer file: https://repository.apache.org/content/repositories/snapshots/org/apache/myfaces/core/internal/myfaces-impl-shared/2.1.9-CLIENT-WINDOW-SNAPSHOT/myfaces-impl-shared-2.1.9-CLIENT-WINDOW-SNAPSHOT.jar.sha1. Return code is: 502, ReasonPhrase: Proxy Error.
at org.apache.maven.wagon.shared.http4.AbstractHttpClientWagon.put(AbstractHttpClientWagon.java:626)
at org.apache.maven.wagon.shared.http4.AbstractHttpClientWagon.put(AbstractHttpClientWagon.java:524)
at org.apache.maven.wagon.shared.http4.AbstractHttpClientWagon.put(AbstractHttpClientWagon.java:505)
at org.apache.maven.wagon.shared.http4.AbstractHttpClientWagon.put(AbstractHttpClientWagon.java:485)
at org.apache.maven.repository.legacy.DefaultWagonManager.putRemoteFile(DefaultWagonManager.java:569)
at org.apache.maven.repository.legacy.DefaultWagonManager.putArtifact(DefaultWagonManager.java:494)
at hudson.maven.artifact.deployer.DefaultArtifactDeployer.deploy(DefaultArtifactDeployer.java:160)
... 11 more
[INFO] Deployment failed after 5 min 21 sec
Build step 'Deploy artifacts to Maven repository' changed build result to FAILURE
Jenkins build is back to normal : myfaces-current21_949 #2576
Posted by Apache Jenkins Server <je...@builds.apache.org>.
See <https://builds.apache.org/job/myfaces-current21_949/2576/>