You are viewing a plain text version of this content. The canonical link for it is here.
Posted to dev@jmeter.apache.org by Apache Jenkins Server <je...@builds.apache.org> on 2019/07/22 18:51:39 UTC

Build failed in Jenkins: JMeter-trunk #7249

See <https://builds.apache.org/job/JMeter-trunk/7249/display/redirect>

------------------------------------------
Started by remote host 127.0.0.1
[EnvInject] - Loading node environment variables.
Building remotely on H44 (ubuntu bionic) in workspace <https://builds.apache.org/job/JMeter-trunk/ws/>
No credentials specified
 > git rev-parse --is-inside-work-tree # timeout=10
Fetching changes from the remote Git repository
 > git config remote.origin.url https://gitbox.apache.org/repos/asf/jmeter.git # timeout=10
Fetching upstream changes from https://gitbox.apache.org/repos/asf/jmeter.git
 > git --version # timeout=10
 > git fetch --tags --progress https://gitbox.apache.org/repos/asf/jmeter.git +refs/heads/*:refs/remotes/origin/*
 > git rev-parse refs/remotes/origin/master^{commit} # timeout=10
 > git rev-parse refs/remotes/origin/origin/master^{commit} # timeout=10
Checking out Revision 9869daa3ec2d558b7900d2c4e8b4f396e72c8750 (refs/remotes/origin/master)
 > git config core.sparsecheckout # timeout=10
 > git checkout -f 9869daa3ec2d558b7900d2c4e8b4f396e72c8750
Commit message: "Support all cURL command line options and allow import of multiple commands from a file (Fix bugs 63452 & 63419) (#475)"
 > git rev-list --no-walk 9869daa3ec2d558b7900d2c4e8b4f396e72c8750 # timeout=10
[locks-and-latches] Checking to see if we really have the locks
[locks-and-latches] Have all the locks, build can start
Injecting SonarQube environment variables using the configuration: ASF Sonar Analysis
WARN: Unable to locate 'report-task.txt' in the workspace. Did the SonarScanner succeeded?
[locks-and-latches] Releasing all the locks
[locks-and-latches] All the locks released
ERROR: Cannot find executable from the chosen Ant installation "Ant 1.10.1"
Archiving artifacts
Recording test results
ERROR: Step ?Publish JUnit test result report? failed: No test report files were found. Configuration error?

Jenkins build is back to normal : JMeter-trunk #7253

Posted by Apache Jenkins Server <je...@builds.apache.org>.
See <https://builds.apache.org/job/JMeter-trunk/7253/display/redirect?page=changes>


Build failed in Jenkins: JMeter-trunk #7252

Posted by Apache Jenkins Server <je...@builds.apache.org>.
See <https://builds.apache.org/job/JMeter-trunk/7252/display/redirect?page=changes>

Changes:

[pmouawad] Fix checkstyle warning

------------------------------------------
[...truncated 102.46 KB...]

_check_jarfile:
     [echo] Checking xalan-2.7.2.jar
     [echo] Deleting xalan-* (excluding xalan-2.7.2.jar)

setproxy:

_get_jarfile:

setproxy:

_get_zipfile:

_check_exists:

_check_jarfile:
     [echo] Checking Saxon-HE-9.9.1-1.jar
     [echo] Deleting Saxon-HE-* (excluding Saxon-HE-9.9.1-1.jar)

setproxy:

_get_jarfile:

setproxy:

_get_zipfile:

_check_exists:

_check_jarfile:
     [echo] Checking xercesImpl-2.12.0.jar
     [echo] Deleting xercesImpl-* (excluding xercesImpl-2.12.0.jar)

setproxy:

_get_jarfile:

setproxy:

_get_zipfile:

_check_exists:

_check_jarfile:
     [echo] Checking xml-apis-1.4.01.jar
     [echo] Deleting xml-apis-* (excluding xml-apis-1.4.01.jar)

setproxy:

_get_jarfile:

setproxy:

_get_zipfile:

_check_exists:

_check_jarfile:
     [echo] Checking xmlgraphics-commons-2.3.jar
     [echo] Deleting xmlgraphics-commons-2.3.jar (excluding xmlgraphics-commons-2.3.jar)

setproxy:

_get_jarfile:

setproxy:

_get_zipfile:

_check_exists:

_check_jarfile:
     [echo] Checking xmlpull-1.1.3.1.jar
     [echo] Deleting xmlpull-* (excluding xmlpull-1.1.3.1.jar)

setproxy:

_get_jarfile:

setproxy:

_get_zipfile:

_check_exists:

_check_jarfile:
     [echo] Checking xpp3_min-1.1.4c.jar
     [echo] Deleting xpp3_min-1.1.4c.jar (excluding xpp3_min-1.1.4c.jar)

setproxy:

_get_jarfile:

setproxy:

_get_zipfile:

_check_exists:

_check_jarfile:
     [echo] Checking xstream-1.4.11.jar
     [echo] Deleting xstream-* (excluding xstream-1.4.11.jar)

setproxy:

_get_jarfile:

setproxy:

_get_zipfile:

_check_exists:

_check_jarfile:
     [echo] Checking hsqldb-2.4.1.jar
     [echo] Deleting hsqldb-* (excluding hsqldb-2.4.1.jar)

setproxy:

_get_jarfile:

setproxy:

_get_zipfile:

_check_exists:

_check_jarfile:
     [echo] Checking activemq-all-5.15.8.jar
     [echo] Deleting activemq-all-* (excluding activemq-all-5.15.8.jar)

setproxy:

_get_jarfile:

setproxy:

_get_zipfile:

_check_exists:

_check_jarfile:
     [echo] Checking mina-core-2.0.19.jar
     [echo] Deleting mina-core-* (excluding mina-core-2.0.19.jar)

setproxy:

_get_jarfile:

setproxy:

_get_zipfile:

_check_exists:

_check_jarfile:
     [echo] Checking ftplet-api-1.1.1.jar
     [echo] Deleting ftplet-api-* (excluding ftplet-api-1.1.1.jar)

setproxy:

_get_jarfile:

setproxy:

_get_zipfile:

_check_exists:

_check_jarfile:
     [echo] Checking ftpserver-core-1.1.1.jar
     [echo] Deleting ftpserver-core-* (excluding ftpserver-core-1.1.1.jar)

setproxy:

_get_jarfile:

setproxy:

_get_zipfile:

_check_exists:

_check_jarfile:
     [echo] Checking org.jacoco.ant-0.8.3-nodeps.jar
     [echo] Deleting org.jacoco.ant-0.8.3-nodeps.jar (excluding org.jacoco.ant-0.8.3-nodeps.jar)

setproxy:

_get_jarfile:

setproxy:

_get_zipfile:

_check_exists:

_check_jarfile:
     [echo] Checking sonarqube-ant-task-2.5.jar
     [echo] Deleting sonarqube-ant-task-2.5.jar (excluding sonarqube-ant-task-2.5.jar)

setproxy:

_get_jarfile:

setproxy:

_get_zipfile:

download_checkstyle:

_process_checkstyle_jars:

_check_exists:

_check_jarfile:
     [echo] Checking checkstyle-8.22-all.jar
     [echo] Deleting checkstyle-8.22-all.jar (excluding checkstyle-8.22-all.jar)

setproxy:

_get_jarfile:

setproxy:

_get_zipfile:

checkstyle:

_process_checkstyle_jars:

_check_exists:

_check_jarfile:
[checkstyle] Running Checkstyle 8.22 on 1782 files
[checkstyle] [ERROR] <https://builds.apache.org/job/JMeter-trunk/ws/src/protocol/jdbc/org/apache/jmeter/protocol/jdbc/config/DataSourceElement.java>:297: Trailing whitespace [RegexpSingleline]

BUILD FAILED
<https://builds.apache.org/job/JMeter-trunk/ws/build.xml>:3718: Got 1 errors and 0 warnings.

Total time: 32 seconds
Build step 'Invoke Ant' marked build as failure
[locks-and-latches] Releasing all the locks
[locks-and-latches] All the locks released
Archiving artifacts
Recording test results
ERROR: Step ?Publish JUnit test result report? failed: Test reports were found but none of them are new. Did leafNodes run? 
For example, <https://builds.apache.org/job/JMeter-trunk/ws/reports/TEST-org.apache.commons.cli.avalon.ClutilTestCase.xml> is 10 days old


Build failed in Jenkins: JMeter-trunk #7251

Posted by Apache Jenkins Server <je...@builds.apache.org>.
See <https://builds.apache.org/job/JMeter-trunk/7251/display/redirect?page=changes>

Changes:

[pmouawad] Mention Franz Schwab

------------------------------------------
[...truncated 102.46 KB...]

_check_jarfile:
     [echo] Checking xalan-2.7.2.jar
     [echo] Deleting xalan-* (excluding xalan-2.7.2.jar)

setproxy:

_get_jarfile:

setproxy:

_get_zipfile:

_check_exists:

_check_jarfile:
     [echo] Checking Saxon-HE-9.9.1-1.jar
     [echo] Deleting Saxon-HE-* (excluding Saxon-HE-9.9.1-1.jar)

setproxy:

_get_jarfile:

setproxy:

_get_zipfile:

_check_exists:

_check_jarfile:
     [echo] Checking xercesImpl-2.12.0.jar
     [echo] Deleting xercesImpl-* (excluding xercesImpl-2.12.0.jar)

setproxy:

_get_jarfile:

setproxy:

_get_zipfile:

_check_exists:

_check_jarfile:
     [echo] Checking xml-apis-1.4.01.jar
     [echo] Deleting xml-apis-* (excluding xml-apis-1.4.01.jar)

setproxy:

_get_jarfile:

setproxy:

_get_zipfile:

_check_exists:

_check_jarfile:
     [echo] Checking xmlgraphics-commons-2.3.jar
     [echo] Deleting xmlgraphics-commons-2.3.jar (excluding xmlgraphics-commons-2.3.jar)

setproxy:

_get_jarfile:

setproxy:

_get_zipfile:

_check_exists:

_check_jarfile:
     [echo] Checking xmlpull-1.1.3.1.jar
     [echo] Deleting xmlpull-* (excluding xmlpull-1.1.3.1.jar)

setproxy:

_get_jarfile:

setproxy:

_get_zipfile:

_check_exists:

_check_jarfile:
     [echo] Checking xpp3_min-1.1.4c.jar
     [echo] Deleting xpp3_min-1.1.4c.jar (excluding xpp3_min-1.1.4c.jar)

setproxy:

_get_jarfile:

setproxy:

_get_zipfile:

_check_exists:

_check_jarfile:
     [echo] Checking xstream-1.4.11.jar
     [echo] Deleting xstream-* (excluding xstream-1.4.11.jar)

setproxy:

_get_jarfile:

setproxy:

_get_zipfile:

_check_exists:

_check_jarfile:
     [echo] Checking hsqldb-2.4.1.jar
     [echo] Deleting hsqldb-* (excluding hsqldb-2.4.1.jar)

setproxy:

_get_jarfile:

setproxy:

_get_zipfile:

_check_exists:

_check_jarfile:
     [echo] Checking activemq-all-5.15.8.jar
     [echo] Deleting activemq-all-* (excluding activemq-all-5.15.8.jar)

setproxy:

_get_jarfile:

setproxy:

_get_zipfile:

_check_exists:

_check_jarfile:
     [echo] Checking mina-core-2.0.19.jar
     [echo] Deleting mina-core-* (excluding mina-core-2.0.19.jar)

setproxy:

_get_jarfile:

setproxy:

_get_zipfile:

_check_exists:

_check_jarfile:
     [echo] Checking ftplet-api-1.1.1.jar
     [echo] Deleting ftplet-api-* (excluding ftplet-api-1.1.1.jar)

setproxy:

_get_jarfile:

setproxy:

_get_zipfile:

_check_exists:

_check_jarfile:
     [echo] Checking ftpserver-core-1.1.1.jar
     [echo] Deleting ftpserver-core-* (excluding ftpserver-core-1.1.1.jar)

setproxy:

_get_jarfile:

setproxy:

_get_zipfile:

_check_exists:

_check_jarfile:
     [echo] Checking org.jacoco.ant-0.8.3-nodeps.jar
     [echo] Deleting org.jacoco.ant-0.8.3-nodeps.jar (excluding org.jacoco.ant-0.8.3-nodeps.jar)

setproxy:

_get_jarfile:

setproxy:

_get_zipfile:

_check_exists:

_check_jarfile:
     [echo] Checking sonarqube-ant-task-2.5.jar
     [echo] Deleting sonarqube-ant-task-2.5.jar (excluding sonarqube-ant-task-2.5.jar)

setproxy:

_get_jarfile:

setproxy:

_get_zipfile:

download_checkstyle:

_process_checkstyle_jars:

_check_exists:

_check_jarfile:
     [echo] Checking checkstyle-8.22-all.jar
     [echo] Deleting checkstyle-8.22-all.jar (excluding checkstyle-8.22-all.jar)

setproxy:

_get_jarfile:

setproxy:

_get_zipfile:

checkstyle:

_process_checkstyle_jars:

_check_exists:

_check_jarfile:
[checkstyle] Running Checkstyle 8.22 on 1782 files
[checkstyle] [ERROR] <https://builds.apache.org/job/JMeter-trunk/ws/src/protocol/jdbc/org/apache/jmeter/protocol/jdbc/config/DataSourceElement.java>:297: Line is longer than 160 characters (found 182). [LineLength]

BUILD FAILED
<https://builds.apache.org/job/JMeter-trunk/ws/build.xml>:3718: Got 1 errors and 0 warnings.

Total time: 32 seconds
Build step 'Invoke Ant' marked build as failure
[locks-and-latches] Releasing all the locks
[locks-and-latches] All the locks released
Archiving artifacts
Recording test results
ERROR: Step ?Publish JUnit test result report? failed: Test reports were found but none of them are new. Did leafNodes run? 
For example, <https://builds.apache.org/job/JMeter-trunk/ws/reports/TEST-org.apache.commons.cli.avalon.ClutilTestCase.xml> is 10 days old


Build failed in Jenkins: JMeter-trunk #7250

Posted by Apache Jenkins Server <je...@builds.apache.org>.
See <https://builds.apache.org/job/JMeter-trunk/7250/display/redirect?page=changes>

Changes:

[pmouawad] implemented preinit of jdbc connection pool (#477)

------------------------------------------
[...truncated 103.40 KB...]
setproxy:

_get_zipfile:

_check_exists:

_check_jarfile:
     [echo] Checking Saxon-HE-9.9.1-1.jar
     [echo] Deleting Saxon-HE-* (excluding Saxon-HE-9.9.1-1.jar)

setproxy:

_get_jarfile:

setproxy:

_get_zipfile:

_check_exists:

_check_jarfile:
     [echo] Checking xercesImpl-2.12.0.jar
     [echo] Deleting xercesImpl-* (excluding xercesImpl-2.12.0.jar)

setproxy:

_get_jarfile:

setproxy:

_get_zipfile:

_check_exists:

_check_jarfile:
     [echo] Checking xml-apis-1.4.01.jar
     [echo] Deleting xml-apis-* (excluding xml-apis-1.4.01.jar)

setproxy:

_get_jarfile:

setproxy:

_get_zipfile:

_check_exists:

_check_jarfile:
     [echo] Checking xmlgraphics-commons-2.3.jar
     [echo] Deleting xmlgraphics-commons-2.3.jar (excluding xmlgraphics-commons-2.3.jar)

setproxy:

_get_jarfile:

setproxy:

_get_zipfile:

_check_exists:

_check_jarfile:
     [echo] Checking xmlpull-1.1.3.1.jar
     [echo] Deleting xmlpull-* (excluding xmlpull-1.1.3.1.jar)

setproxy:

_get_jarfile:

setproxy:

_get_zipfile:

_check_exists:

_check_jarfile:
     [echo] Checking xpp3_min-1.1.4c.jar
     [echo] Deleting xpp3_min-1.1.4c.jar (excluding xpp3_min-1.1.4c.jar)

setproxy:

_get_jarfile:

setproxy:

_get_zipfile:

_check_exists:

_check_jarfile:
     [echo] Checking xstream-1.4.11.jar
     [echo] Deleting xstream-* (excluding xstream-1.4.11.jar)

setproxy:

_get_jarfile:

setproxy:

_get_zipfile:

_check_exists:

_check_jarfile:
     [echo] Checking hsqldb-2.4.1.jar
     [echo] Deleting hsqldb-* (excluding hsqldb-2.4.1.jar)

setproxy:

_get_jarfile:

setproxy:

_get_zipfile:

_check_exists:

_check_jarfile:
     [echo] Checking activemq-all-5.15.8.jar
     [echo] Deleting activemq-all-* (excluding activemq-all-5.15.8.jar)

setproxy:

_get_jarfile:

setproxy:

_get_zipfile:

_check_exists:

_check_jarfile:
     [echo] Checking mina-core-2.0.19.jar
     [echo] Deleting mina-core-* (excluding mina-core-2.0.19.jar)

setproxy:

_get_jarfile:

setproxy:

_get_zipfile:

_check_exists:

_check_jarfile:
     [echo] Checking ftplet-api-1.1.1.jar
     [echo] Deleting ftplet-api-* (excluding ftplet-api-1.1.1.jar)

setproxy:

_get_jarfile:

setproxy:

_get_zipfile:

_check_exists:

_check_jarfile:
     [echo] Checking ftpserver-core-1.1.1.jar
     [echo] Deleting ftpserver-core-* (excluding ftpserver-core-1.1.1.jar)

setproxy:

_get_jarfile:

setproxy:

_get_zipfile:

_check_exists:

_check_jarfile:
     [echo] Checking org.jacoco.ant-0.8.3-nodeps.jar
     [echo] Deleting org.jacoco.ant-0.8.3-nodeps.jar (excluding org.jacoco.ant-0.8.3-nodeps.jar)

setproxy:

_get_jarfile:

setproxy:

_get_zipfile:

_check_exists:

_check_jarfile:
     [echo] Checking sonarqube-ant-task-2.5.jar
     [echo] Deleting sonarqube-ant-task-2.5.jar (excluding sonarqube-ant-task-2.5.jar)

setproxy:

_get_jarfile:

setproxy:

_get_zipfile:

download_checkstyle:

_process_checkstyle_jars:

_check_exists:

_check_jarfile:
     [echo] Checking checkstyle-8.22-all.jar
     [echo] Deleting checkstyle-8.22-all.jar (excluding checkstyle-8.22-all.jar)

setproxy:

_get_jarfile:
     [echo] Fetching: lib/opt/checkstyle-8.22-all.jar
      [get] Getting: https://github.com/checkstyle/checkstyle/releases/download/checkstyle-8.22/checkstyle-8.22-all.jar
      [get] To: <https://builds.apache.org/job/JMeter-trunk/ws/build/checkstyle-8.22-all.jar>
      [get] https://github.com/checkstyle/checkstyle/releases/download/checkstyle-8.22/checkstyle-8.22-all.jar moved to https://github-production-release-asset-2e65be.s3.amazonaws.com/12499251/a02f4f00-952e-11e9-85e5-eee140a2d533?X-Amz-Algorithm=AWS4-HMAC-SHA256&X-Amz-Credential=AKIAIWNJYAX4CSVEH53A%2F20190722%2Fus-east-1%2Fs3%2Faws4_request&X-Amz-Date=20190722T195029Z&X-Amz-Expires=300&X-Amz-Signature=ba85ccdf67045b0cee9c53b48049e4ce6d205ef0ebb3aa37f19ba6b0824b782b&X-Amz-SignedHeaders=host&actor_id=0&response-content-disposition=attachment%3B%20filename%3Dcheckstyle-8.22-all.jar&response-content-type=application%2Foctet-stream

_checkSHA512:
     [echo] Checksum OK: checkstyle-8.22-all.jar
     [move] Moving 1 file to <https://builds.apache.org/job/JMeter-trunk/ws/lib/opt>
     [move] Attempting to rename: <https://builds.apache.org/job/JMeter-trunk/ws/build/checkstyle-8.22-all.jar> to <https://builds.apache.org/job/JMeter-trunk/ws/lib/opt/checkstyle-8.22-all.jar>

setproxy:

_get_zipfile:

checkstyle:

_process_checkstyle_jars:

_check_exists:

_check_jarfile:
[checkstyle] Running Checkstyle 8.22 on 1782 files
[checkstyle] [ERROR] <https://builds.apache.org/job/JMeter-trunk/ws/src/protocol/jdbc/org/apache/jmeter/protocol/jdbc/config/DataSourceElement.java>:297: Line is longer than 160 characters (found 182). [LineLength]

BUILD FAILED
<https://builds.apache.org/job/JMeter-trunk/ws/build.xml>:3718: Got 1 errors and 0 warnings.

Total time: 37 seconds
Build step 'Invoke Ant' marked build as failure
[locks-and-latches] Releasing all the locks
[locks-and-latches] All the locks released
Archiving artifacts
Recording test results
ERROR: Step ?Publish JUnit test result report? failed: Test reports were found but none of them are new. Did leafNodes run? 
For example, <https://builds.apache.org/job/JMeter-trunk/ws/reports/TEST-org.apache.commons.cli.avalon.ClutilTestCase.xml> is 10 days old