You are viewing a plain text version of this content. The canonical link for it is here.
Posted to builds@beam.apache.org by Apache Jenkins Server <je...@builds.apache.org> on 2020/02/21 00:51:59 UTC

Build failed in Jenkins: beam_PreCommit_Java_Cron #2422

See <https://builds.apache.org/job/beam_PreCommit_Java_Cron/2422/display/redirect?page=changes>

Changes:

[huangry] Create validation runner test for metrics (limited to user counter in

[chlarsen] Added ThriftIO to list of supported I/O on website and to change log.

[huangry] Fixups.

[heejong] [BEAM-9341] postcommit xvr flink fix

[github] [BEAM-8280] no_annotations decorator (#10904)

[chamikara] Updates DataflowRunner to support multiple SDK environments.

[github] [BEAM-8280] Enable and improve IOTypeHints debug_str traceback (#10894)

[github] [BEAM-9343]Upgrade ZetaSQL to 2020.02.1 (#10918)


------------------------------------------
[...truncated 497.66 KB...]
Note: Recompile with -Xlint:deprecation for details.

> Task :runners:extensions-java:metrics:classes
> Task :runners:extensions-java:metrics:jar
> Task :runners:extensions-java:metrics:assemble
> Task :runners:extensions-java:metrics:analyzeClassesDependencies SKIPPED
> Task :sdks:java:io:elasticsearch-tests:elasticsearch-tests-2:check
> Task :sdks:java:io:elasticsearch-tests:elasticsearch-tests-2:build
> Task :sdks:java:io:elasticsearch-tests:elasticsearch-tests-2:buildDependents
> Task :sdks:java:extensions:protobuf:assemble
> Task :sdks:java:extensions:protobuf:analyzeClassesDependencies SKIPPED
> Task :sdks:java:extensions:protobuf:extractIncludeTestProto
> Task :sdks:java:extensions:protobuf:generateTestProto
> Task :sdks:java:extensions:google-cloud-platform-core:javadoc
> Task :sdks:java:core:checkstyleMain
[main] INFO org.gradle.internal.nativeintegration.services.NativeServices - Initialized native services in: /home/jenkins/.gradle/native

> Task :sdks:java:extensions:google-cloud-platform-core:spotbugsMain
SLF4J: Failed to load class "org.slf4j.impl.StaticLoggerBinder".
SLF4J: Defaulting to no-operation (NOP) logger implementation
SLF4J: See http://www.slf4j.org/codes.html#StaticLoggerBinder for further details.

> Task :sdks:java:harness:test

> Task :sdks:java:fn-execution:compileTestJava
Note: Some input files use or override a deprecated API.
Note: Recompile with -Xlint:deprecation for details.
Note: Some input files use unchecked or unsafe operations.
Note: Recompile with -Xlint:unchecked for details.

> Task :sdks:java:fn-execution:testClasses
> Task :sdks:java:fn-execution:analyzeTestClassesDependencies SKIPPED
> Task :sdks:java:fn-execution:analyzeDependencies SKIPPED
> Task :runners:samza:job-server:startShadowScripts
> Task :runners:extensions-java:metrics:compileTestJava
> Task :runners:extensions-java:metrics:testClasses
> Task :runners:extensions-java:metrics:analyzeTestClassesDependencies SKIPPED
> Task :runners:extensions-java:metrics:analyzeDependencies SKIPPED
> Task :runners:samza:job-server:shadowDistTar
> Task :sdks:java:fn-execution:checkstyleMain
> Task :runners:samza:check
> Task :runners:samza:build
> Task :sdks:java:io:common:analyzeTestClassesDependencies SKIPPED
> Task :sdks:java:io:common:analyzeDependencies SKIPPED
> Task :runners:extensions-java:metrics:checkstyleMain
> Task :sdks:java:fn-execution:checkstyleTest
> Task :sdks:java:io:common:checkstyleTest
> Task :runners:extensions-java:metrics:checkstyleTest
> Task :runners:extensions-java:metrics:javadoc
> Task :sdks:java:fn-execution:javadoc
> Task :sdks:java:harness:check
> Task :sdks:java:harness:build
> Task :sdks:java:io:elasticsearch:assemble
> Task :sdks:java:io:elasticsearch:analyzeClassesDependencies SKIPPED
> Task :sdks:java:io:elasticsearch:compileTestJava NO-SOURCE
> Task :sdks:java:io:elasticsearch:testClasses UP-TO-DATE
> Task :sdks:java:io:elasticsearch:analyzeTestClassesDependencies SKIPPED
> Task :sdks:java:io:elasticsearch:analyzeDependencies SKIPPED
> Task :sdks:java:core:checkstyleTest

> Task :sdks:java:fn-execution:spotbugsMain
SLF4J: Class path contains multiple SLF4J bindings.
SLF4J: Found binding in [jar:file:/home/jenkins/.gradle/caches/modules-2/files-2.1/org.slf4j/slf4j-simple/1.7.25/8dacf9514f0c707cbbcdd6fd699e8940d42fb54e/slf4j-simple-1.7.25.jar!/org/slf4j/impl/StaticLoggerBinder.class]
SLF4J: Found binding in [jar:file:/home/jenkins/.gradle/wrapper/dists/gradle-5.2.1-all/bviwmvmbexq6idcscbicws5me/gradle-5.2.1/lib/gradle-logging-5.2.1.jar!/org/slf4j/impl/StaticLoggerBinder.class]
SLF4J: See http://www.slf4j.org/codes.html#multiple_bindings for an explanation.
SLF4J: Actual binding is of type [org.slf4j.impl.SimpleLoggerFactory]

> Task :sdks:java:extensions:protobuf:compileTestJava

[main] INFO org.gradle.internal.nativeintegration.services.NativeServices - Initialized native services in: /home/jenkins/.gradle/native
[main] INFO org.gradle.internal.nativeintegration.services.NativeServices - Initialized native services in: /home/jenkins/.gradle/native

> Task :runners:extensions-java:metrics:spotbugsMain
SLF4J: Failed to load class "org.slf4j.impl.StaticLoggerBinder".
SLF4J: Defaulting to no-operation (NOP) logger implementation
SLF4J: See http://www.slf4j.org/codes.html#StaticLoggerBinder for further details.

> Task :sdks:java:io:elasticsearch-tests:elasticsearch-tests-6:check
> Task :sdks:java:io:elasticsearch-tests:elasticsearch-tests-6:build
> Task :sdks:java:io:elasticsearch-tests:elasticsearch-tests-6:buildDependents
> Task :sdks:java:io:hadoop-common:assemble
> Task :sdks:java:io:hadoop-common:analyzeClassesDependencies SKIPPED

> Task :sdks:java:fn-execution:spotbugsMain
SLF4J: Failed to load class "org.slf4j.impl.StaticLoggerBinder".
SLF4J: Defaulting to no-operation (NOP) logger implementation
SLF4J: See http://www.slf4j.org/codes.html#StaticLoggerBinder for further details.

> Task :sdks:java:io:elasticsearch:checkstyleMain
> Task :sdks:java:io:elasticsearch:checkstyleTest NO-SOURCE
> Task :runners:samza:job-server:shadowDistZip
> Task :runners:samza:job-server:assemble
> Task :runners:samza:job-server:analyzeClassesDependencies SKIPPED
> Task :runners:samza:job-server:analyzeTestClassesDependencies SKIPPED
> Task :runners:samza:job-server:analyzeDependencies SKIPPED
> Task :runners:samza:job-server:checkstyleMain NO-SOURCE
> Task :runners:samza:job-server:checkstyleTest NO-SOURCE
> Task :runners:samza:job-server:javadoc NO-SOURCE
> Task :runners:samza:job-server:spotbugsMain NO-SOURCE
> Task :runners:samza:job-server:test NO-SOURCE
> Task :runners:samza:job-server:check UP-TO-DATE
> Task :runners:samza:job-server:build
> Task :runners:samza:job-server:buildDependents
> Task :runners:samza:buildDependents
> Task :sdks:java:io:elasticsearch:javadoc
[main] INFO org.gradle.internal.nativeintegration.services.NativeServices - Initialized native services in: /home/jenkins/.gradle/native

> Task :sdks:java:io:elasticsearch:spotbugsMain
SLF4J: Failed to load class "org.slf4j.impl.StaticLoggerBinder".
SLF4J: Defaulting to no-operation (NOP) logger implementation
SLF4J: See http://www.slf4j.org/codes.html#StaticLoggerBinder for further details.

> Task :sdks:java:io:elasticsearch-tests:elasticsearch-tests-5:check
> Task :sdks:java:io:elasticsearch-tests:elasticsearch-tests-5:build
> Task :sdks:java:io:elasticsearch-tests:elasticsearch-tests-5:buildDependents
> Task :sdks:java:io:elasticsearch-tests:elasticsearch-tests-7:check
> Task :sdks:java:io:elasticsearch-tests:elasticsearch-tests-7:build
> Task :sdks:java:io:elasticsearch-tests:elasticsearch-tests-7:buildDependents
> Task :sdks:java:io:elasticsearch-tests:elasticsearch-tests-common:buildDependents
> Task :sdks:java:io:common:test
> Task :sdks:java:io:common:check
> Task :sdks:java:io:common:build
> Task :sdks:java:extensions:google-cloud-platform-core:test
> Task :sdks:java:extensions:google-cloud-platform-core:check
> Task :sdks:java:extensions:google-cloud-platform-core:build
> Task :sdks:java:core:javadoc

> Task :sdks:java:io:hadoop-common:compileTestJava
Note: Some input files use or override a deprecated API.
Note: Recompile with -Xlint:deprecation for details.

> Task :sdks:java:io:hadoop-common:testClasses
> Task :sdks:java:io:hadoop-common:analyzeTestClassesDependencies SKIPPED
> Task :sdks:java:io:hadoop-common:analyzeDependencies SKIPPED
> Task :runners:extensions-java:metrics:test
> Task :runners:extensions-java:metrics:check
> Task :runners:extensions-java:metrics:build
> Task :runners:extensions-java:metrics:buildDependents
> Task :sdks:java:io:hadoop-common:checkstyleMain
> Task :sdks:java:io:hadoop-common:checkstyleTest

> Task :sdks:java:io:elasticsearch:spotbugsMain
The following classes needed for analysis were missing:
  com.google.auto.value.AutoValue$Builder
  com.google.auto.value.AutoValue

> Task :sdks:java:io:elasticsearch:test NO-SOURCE
> Task :sdks:java:io:elasticsearch:check
> Task :sdks:java:io:elasticsearch:build
> Task :sdks:java:io:elasticsearch:buildDependents
> Task :sdks:java:extensions:sql:hcatalog:compileJava
> Task :sdks:java:extensions:sql:hcatalog:classes
> Task :sdks:java:extensions:protobuf:testClasses
> Task :sdks:java:extensions:protobuf:analyzeTestClassesDependencies SKIPPED
> Task :sdks:java:extensions:protobuf:analyzeDependencies SKIPPED
> Task :sdks:java:io:hadoop-common:javadoc
> Task :sdks:java:extensions:protobuf:checkstyleMain
> Task :sdks:java:extensions:protobuf:checkstyleTest
> Task :sdks:java:extensions:sql:hcatalog:javadoc

> Task :sdks:java:io:hadoop-common:spotbugsMain
SLF4J: Class path contains multiple SLF4J bindings.
SLF4J: Found binding in [jar:file:/home/jenkins/.gradle/caches/modules-2/files-2.1/org.slf4j/slf4j-simple/1.7.25/8dacf9514f0c707cbbcdd6fd699e8940d42fb54e/slf4j-simple-1.7.25.jar!/org/slf4j/impl/StaticLoggerBinder.class]
SLF4J: Found binding in [jar:file:/home/jenkins/.gradle/wrapper/dists/gradle-5.2.1-all/bviwmvmbexq6idcscbicws5me/gradle-5.2.1/lib/gradle-logging-5.2.1.jar!/org/slf4j/impl/StaticLoggerBinder.class]
SLF4J: See http://www.slf4j.org/codes.html#multiple_bindings for an explanation.
SLF4J: Actual binding is of type [org.slf4j.impl.SimpleLoggerFactory]

[main] INFO org.gradle.internal.nativeintegration.services.NativeServices - Initialized native services in: /home/jenkins/.gradle/native
[main] INFO org.gradle.internal.nativeintegration.services.NativeServices - Initialized native services in: /home/jenkins/.gradle/native

> Task :sdks:java:io:hadoop-common:spotbugsMain
SLF4J: Failed to load class "org.slf4j.impl.StaticLoggerBinder".
SLF4J: Defaulting to no-operation (NOP) logger implementation
SLF4J: See http://www.slf4j.org/codes.html#StaticLoggerBinder for further details.

> Task :sdks:java:extensions:protobuf:javadoc
> Task :sdks:java:javadoc:allJavadoc

> Task :sdks:java:core:spotbugsMain
SLF4J: Failed to load class "org.slf4j.impl.StaticLoggerBinder".
SLF4J: Defaulting to no-operation (NOP) logger implementation
SLF4J: See http://www.slf4j.org/codes.html#StaticLoggerBinder for further details.

> Task :sdks:java:extensions:sql:jdbc:shadowJarTest

[main] INFO org.gradle.internal.nativeintegration.services.NativeServices - Initialized native services in: /home/jenkins/.gradle/native

> Task :sdks:java:extensions:protobuf:spotbugsMain
SLF4J: Failed to load class "org.slf4j.impl.StaticLoggerBinder".
SLF4J: Defaulting to no-operation (NOP) logger implementation
SLF4J: See http://www.slf4j.org/codes.html#StaticLoggerBinder for further details.

> Task :sdks:java:fn-execution:test
> Task :sdks:java:fn-execution:check
> Task :sdks:java:fn-execution:build
> Task :sdks:java:io:hadoop-common:test
> Task :sdks:java:io:hadoop-common:check
> Task :sdks:java:io:hadoop-common:build
> Task :sdks:java:io:hadoop-common:buildDependents
> Task :sdks:java:extensions:sql:jdbc:preCommit
> Task :sdks:java:extensions:protobuf:test
> Task :sdks:java:extensions:protobuf:check
> Task :sdks:java:extensions:protobuf:build

> Task :sdks:java:core:spotbugsMain
The following classes needed for analysis were missing:
  com.google.auto.value.AutoValue$Builder
  com.google.auto.value.AutoValue

> Task :sdks:java:core:test
> Task :sdks:java:core:validateShadedJarDoesntLeakNonProjectClasses
> Task :sdks:java:core:check
> Task :sdks:java:core:build
> Task :sdks:java:core:buildNeeded
> Task :sdks:java:testing:nexmark:check
> Task :sdks:java:testing:nexmark:build
> Task :sdks:java:testing:nexmark:buildDependents
> Task :sdks:java:extensions:sql:buildDependents
> Task :sdks:java:extensions:join-library:buildDependents
> Task :sdks:java:io:google-cloud-platform:buildDependents
> Task :sdks:java:io:kafka:buildDependents
> Task :sdks:java:io:mongodb:buildDependents
> Task :sdks:java:extensions:protobuf:buildDependents
> Task :sdks:java:io:synthetic:buildDependents
> Task :sdks:java:testing:test-utils:buildDependents

FAILURE: Build failed with an exception.

* What went wrong:
Execution failed for task ':sdks:java:io:cassandra:test'.
> There were failing tests. See the report at: file://<https://builds.apache.org/job/beam_PreCommit_Java_Cron/ws/src/sdks/java/io/cassandra/build/reports/tests/test/index.html>

* Try:
Run with --stacktrace option to get the stack trace. Run with --info or --debug option to get more log output. Run with --scan to get full insights.

* Get more help at https://help.gradle.org

Deprecated Gradle features were used in this build, making it incompatible with Gradle 6.0.
Use '--warning-mode all' to show the individual deprecation warnings.
See https://docs.gradle.org/5.2.1/userguide/command_line_interface.html#sec:command_line_warnings

BUILD FAILED in 31m 21s
831 actionable tasks: 781 executed, 50 from cache

Publishing build scan...
https://gradle.com/s/xqrs6mo2zyod6

Build step 'Invoke Gradle script' changed build result to FAILURE
Build step 'Invoke Gradle script' marked build as failure

---------------------------------------------------------------------
To unsubscribe, e-mail: builds-unsubscribe@beam.apache.org
For additional commands, e-mail: builds-help@beam.apache.org


Jenkins build is back to normal : beam_PreCommit_Java_Cron #2425

Posted by Apache Jenkins Server <je...@builds.apache.org>.
See <https://builds.apache.org/job/beam_PreCommit_Java_Cron/2425/display/redirect?page=changes>


---------------------------------------------------------------------
To unsubscribe, e-mail: builds-unsubscribe@beam.apache.org
For additional commands, e-mail: builds-help@beam.apache.org


Build failed in Jenkins: beam_PreCommit_Java_Cron #2424

Posted by Apache Jenkins Server <je...@builds.apache.org>.
See <https://builds.apache.org/job/beam_PreCommit_Java_Cron/2424/display/redirect?page=changes>

Changes:

[lcwik] [BEAM-9349] Update joda-time version


------------------------------------------
[...truncated 521.88 KB...]
> Task :runners:extensions-java:metrics:compileTestJava
> Task :runners:extensions-java:metrics:testClasses
> Task :runners:extensions-java:metrics:analyzeTestClassesDependencies SKIPPED
> Task :runners:extensions-java:metrics:analyzeDependencies SKIPPED
> Task :runners:local-java:test
> Task :runners:local-java:check
> Task :runners:local-java:build
> Task :sdks:java:fn-execution:assemble
> Task :sdks:java:fn-execution:analyzeClassesDependencies SKIPPED
> Task :runners:extensions-java:metrics:checkstyleMain
> Task :runners:extensions-java:metrics:checkstyleTest
> Task :sdks:java:harness:check
> Task :sdks:java:harness:build
> Task :sdks:java:extensions:google-cloud-platform-core:assemble
> Task :sdks:java:extensions:google-cloud-platform-core:analyzeClassesDependencies SKIPPED
> Task :sdks:java:extensions:google-cloud-platform-core:analyzeTestClassesDependencies SKIPPED
> Task :sdks:java:extensions:google-cloud-platform-core:analyzeDependencies SKIPPED
> Task :sdks:java:extensions:google-cloud-platform-core:checkstyleMain
> Task :runners:java-fn-execution:test
testing123

> Task :sdks:java:extensions:google-cloud-platform-core:checkstyleTest
> Task :runners:extensions-java:metrics:javadoc
[main] INFO org.gradle.internal.nativeintegration.services.NativeServices - Initialized native services in: /home/jenkins/.gradle/native
> Task :sdks:java:core:checkstyleTest

> Task :runners:extensions-java:metrics:spotbugsMain
SLF4J: Failed to load class "org.slf4j.impl.StaticLoggerBinder".
SLF4J: Defaulting to no-operation (NOP) logger implementation
SLF4J: See http://www.slf4j.org/codes.html#StaticLoggerBinder for further details.

> Task :sdks:java:extensions:google-cloud-platform-core:javadoc
[main] INFO org.gradle.internal.nativeintegration.services.NativeServices - Initialized native services in: /home/jenkins/.gradle/native

> Task :sdks:java:extensions:google-cloud-platform-core:spotbugsMain
SLF4J: Failed to load class "org.slf4j.impl.StaticLoggerBinder".
SLF4J: Defaulting to no-operation (NOP) logger implementation
SLF4J: See http://www.slf4j.org/codes.html#StaticLoggerBinder for further details.

> Task :sdks:java:fn-execution:compileTestJava
> Task :sdks:java:fn-execution:testClasses
> Task :sdks:java:fn-execution:analyzeTestClassesDependencies SKIPPED
> Task :sdks:java:fn-execution:analyzeDependencies SKIPPED
> Task :sdks:java:fn-execution:checkstyleMain
> Task :sdks:java:fn-execution:checkstyleTest
> Task :runners:samza:test
> Task :sdks:java:fn-execution:javadoc
> Task :runners:java-fn-execution:check
> Task :runners:java-fn-execution:build
> Task :sdks:java:extensions:protobuf:assemble
> Task :sdks:java:extensions:protobuf:analyzeClassesDependencies SKIPPED
> Task :sdks:java:extensions:protobuf:extractIncludeTestProto
> Task :sdks:java:extensions:protobuf:generateTestProto
> Task :sdks:java:core:javadoc

[main] INFO org.gradle.internal.nativeintegration.services.NativeServices - Initialized native services in: /home/jenkins/.gradle/native

> Task :sdks:java:fn-execution:spotbugsMain
SLF4J: Failed to load class "org.slf4j.impl.StaticLoggerBinder".
SLF4J: Defaulting to no-operation (NOP) logger implementation
SLF4J: See http://www.slf4j.org/codes.html#StaticLoggerBinder for further details.

> Task :runners:extensions-java:metrics:test
> Task :runners:extensions-java:metrics:check
> Task :runners:extensions-java:metrics:build
> Task :runners:extensions-java:metrics:buildDependents
> Task :sdks:java:io:common:analyzeTestClassesDependencies SKIPPED
> Task :sdks:java:io:common:analyzeDependencies SKIPPED
> Task :sdks:java:io:common:checkstyleTest

> Task :sdks:java:core:javadoc
<https://builds.apache.org/job/beam_PreCommit_Java_Cron/ws/src/sdks/java/core/src/main/java/org/apache/beam/sdk/state/StateSpecs.java>:73: warning - Tag @see: can't find combining(Coder, CombineFn) in org.apache.beam.sdk.state.StateSpecs
<https://builds.apache.org/job/beam_PreCommit_Java_Cron/ws/src/sdks/java/core/src/main/java/org/apache/beam/sdk/state/StateSpecs.java>:91: warning - Tag @see: can't find combining(Coder, CombineFnWithContext) in org.apache.beam.sdk.state.StateSpecs
<https://builds.apache.org/job/beam_PreCommit_Java_Cron/ws/src/sdks/java/core/src/main/java/org/apache/beam/sdk/state/StateSpecs.java>:102: warning - Tag @link: can't find combining(CombineFn) in org.apache.beam.sdk.state.StateSpecs
<https://builds.apache.org/job/beam_PreCommit_Java_Cron/ws/src/sdks/java/core/src/main/java/org/apache/beam/sdk/state/StateSpecs.java>:121: warning - Tag @link: can't find combining(CombineFnWithContext) in org.apache.beam.sdk.state.StateSpecs
51 warnings
[main] INFO org.gradle.internal.nativeintegration.services.NativeServices - Initialized native services in: /home/jenkins/.gradle/native

> Task :sdks:java:core:spotbugsMain
SLF4J: Failed to load class "org.slf4j.impl.StaticLoggerBinder".
SLF4J: Defaulting to no-operation (NOP) logger implementation
SLF4J: See http://www.slf4j.org/codes.html#StaticLoggerBinder for further details.

> Task :sdks:java:extensions:protobuf:compileTestJava
> Task :sdks:java:extensions:protobuf:testClasses
> Task :sdks:java:extensions:protobuf:analyzeTestClassesDependencies SKIPPED
> Task :sdks:java:extensions:protobuf:analyzeDependencies SKIPPED
> Task :sdks:java:extensions:protobuf:checkstyleMain
> Task :sdks:java:extensions:protobuf:checkstyleTest
> Task :runners:samza:check
> Task :runners:samza:build
> Task :sdks:java:io:elasticsearch:assemble
> Task :sdks:java:io:elasticsearch:analyzeClassesDependencies SKIPPED
> Task :sdks:java:io:elasticsearch:compileTestJava NO-SOURCE
> Task :sdks:java:io:elasticsearch:testClasses UP-TO-DATE
> Task :sdks:java:io:elasticsearch:analyzeTestClassesDependencies SKIPPED
> Task :sdks:java:io:elasticsearch:analyzeDependencies SKIPPED
> Task :sdks:java:io:elasticsearch:checkstyleMain
> Task :sdks:java:io:elasticsearch:checkstyleTest NO-SOURCE
> Task :sdks:java:io:common:test
> Task :sdks:java:io:common:check
> Task :sdks:java:io:common:build
> Task :sdks:java:io:hadoop-common:assemble
> Task :sdks:java:io:hadoop-common:analyzeClassesDependencies SKIPPED
> Task :runners:samza:job-server:startShadowScripts
> Task :sdks:java:extensions:protobuf:javadoc
> Task :sdks:java:io:elasticsearch:javadoc
> Task :sdks:java:extensions:google-cloud-platform-core:test
> Task :runners:samza:job-server:shadowDistTar
> Task :sdks:java:extensions:google-cloud-platform-core:check
> Task :sdks:java:extensions:google-cloud-platform-core:build
[main] INFO org.gradle.internal.nativeintegration.services.NativeServices - Initialized native services in: /home/jenkins/.gradle/native
[main] INFO org.gradle.internal.nativeintegration.services.NativeServices - Initialized native services in: /home/jenkins/.gradle/native

> Task :sdks:java:io:elasticsearch:spotbugsMain
SLF4J: Failed to load class "org.slf4j.impl.StaticLoggerBinder".
SLF4J: Defaulting to no-operation (NOP) logger implementation
SLF4J: See http://www.slf4j.org/codes.html#StaticLoggerBinder for further details.

> Task :sdks:java:io:hadoop-common:compileTestJava
Note: Some input files use or override a deprecated API.
Note: Recompile with -Xlint:deprecation for details.

> Task :sdks:java:io:hadoop-common:testClasses
> Task :sdks:java:io:hadoop-common:analyzeTestClassesDependencies SKIPPED
> Task :sdks:java:io:hadoop-common:analyzeDependencies SKIPPED

> Task :sdks:java:extensions:protobuf:spotbugsMain
SLF4J: Failed to load class "org.slf4j.impl.StaticLoggerBinder".
SLF4J: Defaulting to no-operation (NOP) logger implementation
SLF4J: See http://www.slf4j.org/codes.html#StaticLoggerBinder for further details.

> Task :sdks:java:io:hadoop-common:checkstyleMain
> Task :sdks:java:io:hadoop-common:checkstyleTest
> Task :sdks:java:io:hadoop-common:javadoc
> Task :sdks:java:fn-execution:test
> Task :sdks:java:extensions:sql:hcatalog:compileJava
> Task :sdks:java:extensions:sql:hcatalog:classes

> Task :sdks:java:io:hadoop-common:spotbugsMain
SLF4J: Class path contains multiple SLF4J bindings.
SLF4J: Found binding in [jar:file:/home/jenkins/.gradle/caches/modules-2/files-2.1/org.slf4j/slf4j-simple/1.7.25/8dacf9514f0c707cbbcdd6fd699e8940d42fb54e/slf4j-simple-1.7.25.jar!/org/slf4j/impl/StaticLoggerBinder.class]
SLF4J: Found binding in [jar:file:/home/jenkins/.gradle/wrapper/dists/gradle-5.2.1-all/bviwmvmbexq6idcscbicws5me/gradle-5.2.1/lib/gradle-logging-5.2.1.jar!/org/slf4j/impl/StaticLoggerBinder.class]
SLF4J: See http://www.slf4j.org/codes.html#multiple_bindings for an explanation.
SLF4J: Actual binding is of type [org.slf4j.impl.SimpleLoggerFactory]

> Task :sdks:java:fn-execution:check
> Task :sdks:java:fn-execution:build
[main] INFO org.gradle.internal.nativeintegration.services.NativeServices - Initialized native services in: /home/jenkins/.gradle/native

> Task :sdks:java:io:hadoop-common:spotbugsMain
SLF4J: Failed to load class "org.slf4j.impl.StaticLoggerBinder".
SLF4J: Defaulting to no-operation (NOP) logger implementation
SLF4J: See http://www.slf4j.org/codes.html#StaticLoggerBinder for further details.

> Task :sdks:java:extensions:sql:hcatalog:javadoc
> Task :sdks:java:javadoc:allJavadoc

> Task :sdks:java:io:elasticsearch:spotbugsMain
The following classes needed for analysis were missing:
  com.google.auto.value.AutoValue$Builder
  com.google.auto.value.AutoValue

> Task :sdks:java:io:elasticsearch:test NO-SOURCE
> Task :sdks:java:io:elasticsearch:check
> Task :sdks:java:io:elasticsearch:build
> Task :runners:samza:job-server:shadowDistZip
> Task :runners:samza:job-server:assemble
> Task :runners:samza:job-server:analyzeClassesDependencies SKIPPED
> Task :runners:samza:job-server:analyzeTestClassesDependencies SKIPPED
> Task :runners:samza:job-server:analyzeDependencies SKIPPED
> Task :runners:samza:job-server:checkstyleMain NO-SOURCE
> Task :runners:samza:job-server:checkstyleTest NO-SOURCE
> Task :runners:samza:job-server:javadoc NO-SOURCE
> Task :runners:samza:job-server:spotbugsMain NO-SOURCE
> Task :runners:samza:job-server:test NO-SOURCE
> Task :runners:samza:job-server:check UP-TO-DATE
> Task :runners:samza:job-server:build
> Task :runners:samza:job-server:buildDependents
> Task :runners:samza:buildDependents
> Task :sdks:java:io:elasticsearch-tests:elasticsearch-tests-2:check
> Task :sdks:java:io:elasticsearch-tests:elasticsearch-tests-2:build
> Task :sdks:java:io:elasticsearch-tests:elasticsearch-tests-2:buildDependents
> Task :sdks:java:extensions:protobuf:test
> Task :sdks:java:extensions:protobuf:check
> Task :sdks:java:extensions:protobuf:build
> Task :sdks:java:io:hadoop-common:test
> Task :sdks:java:io:hadoop-common:check
> Task :sdks:java:io:hadoop-common:build
> Task :sdks:java:io:hadoop-common:buildDependents
> Task :sdks:java:extensions:sql:jdbc:shadowJarTest
> Task :sdks:java:io:elasticsearch-tests:elasticsearch-tests-5:check
> Task :sdks:java:io:elasticsearch-tests:elasticsearch-tests-5:build
> Task :sdks:java:io:elasticsearch-tests:elasticsearch-tests-5:buildDependents
> Task :sdks:java:extensions:sql:jdbc:preCommit

> Task :sdks:java:core:spotbugsMain
The following classes needed for analysis were missing:
  com.google.auto.value.AutoValue$Builder
  com.google.auto.value.AutoValue

> Task :sdks:java:io:elasticsearch-tests:elasticsearch-tests-6:check
> Task :sdks:java:io:elasticsearch-tests:elasticsearch-tests-6:build
> Task :sdks:java:io:elasticsearch-tests:elasticsearch-tests-6:buildDependents
> Task :sdks:java:io:elasticsearch-tests:elasticsearch-tests-7:check
> Task :sdks:java:io:elasticsearch-tests:elasticsearch-tests-7:build
> Task :sdks:java:io:elasticsearch-tests:elasticsearch-tests-7:buildDependents
> Task :sdks:java:io:elasticsearch-tests:elasticsearch-tests-common:buildDependents
> Task :sdks:java:io:elasticsearch:buildDependents
> Task :sdks:java:core:test
> Task :sdks:java:core:validateShadedJarDoesntLeakNonProjectClasses
> Task :sdks:java:core:check
> Task :sdks:java:core:build
> Task :sdks:java:core:buildNeeded
> Task :sdks:java:testing:nexmark:check
> Task :sdks:java:testing:nexmark:build
> Task :sdks:java:testing:nexmark:buildDependents
> Task :sdks:java:extensions:sql:buildDependents
> Task :sdks:java:io:google-cloud-platform:buildDependents
> Task :sdks:java:io:kafka:buildDependents
> Task :sdks:java:extensions:join-library:buildDependents
> Task :sdks:java:io:mongodb:buildDependents
> Task :sdks:java:extensions:protobuf:buildDependents
> Task :sdks:java:io:synthetic:buildDependents
> Task :sdks:java:testing:test-utils:buildDependents

FAILURE: Build failed with an exception.

* What went wrong:
Execution failed for task ':sdks:java:io:solr:test'.
> There were failing tests. See the report at: file://<https://builds.apache.org/job/beam_PreCommit_Java_Cron/ws/src/sdks/java/io/solr/build/reports/tests/test/index.html>

* Try:
Run with --stacktrace option to get the stack trace. Run with --info or --debug option to get more log output. Run with --scan to get full insights.

* Get more help at https://help.gradle.org

Deprecated Gradle features were used in this build, making it incompatible with Gradle 6.0.
Use '--warning-mode all' to show the individual deprecation warnings.
See https://docs.gradle.org/5.2.1/userguide/command_line_interface.html#sec:command_line_warnings

BUILD FAILED in 32m 12s
831 actionable tasks: 790 executed, 41 from cache

Publishing build scan...
https://gradle.com/s/ry4snhwfkb2py

Build step 'Invoke Gradle script' changed build result to FAILURE
Build step 'Invoke Gradle script' marked build as failure

---------------------------------------------------------------------
To unsubscribe, e-mail: builds-unsubscribe@beam.apache.org
For additional commands, e-mail: builds-help@beam.apache.org


Build failed in Jenkins: beam_PreCommit_Java_Cron #2423

Posted by Apache Jenkins Server <je...@builds.apache.org>.
See <https://builds.apache.org/job/beam_PreCommit_Java_Cron/2423/display/redirect?page=changes>

Changes:

[lcwik] [BEAM-5605] Honor the bounded source timestamps timestamp.

[github] [BEAM-9229] Adding dependency information to Environment proto (#10733)


------------------------------------------
[...truncated 549.09 KB...]
> Task :sdks:java:fn-execution:checkstyleTest
> Task :sdks:java:io:elasticsearch:javadoc
> Task :sdks:java:core:checkstyleTest
> Task :sdks:java:fn-execution:javadoc
[main] INFO org.gradle.internal.nativeintegration.services.NativeServices - Initialized native services in: /home/jenkins/.gradle/native

> Task :sdks:java:io:elasticsearch:spotbugsMain
SLF4J: Failed to load class "org.slf4j.impl.StaticLoggerBinder".
SLF4J: Defaulting to no-operation (NOP) logger implementation
SLF4J: See http://www.slf4j.org/codes.html#StaticLoggerBinder for further details.

[main] INFO org.gradle.internal.nativeintegration.services.NativeServices - Initialized native services in: /home/jenkins/.gradle/native

> Task :sdks:java:fn-execution:spotbugsMain
SLF4J: Failed to load class "org.slf4j.impl.StaticLoggerBinder".
SLF4J: Defaulting to no-operation (NOP) logger implementation
SLF4J: See http://www.slf4j.org/codes.html#StaticLoggerBinder for further details.

> Task :sdks:java:io:common:test
> Task :sdks:java:io:common:check
> Task :sdks:java:io:common:build
> Task :sdks:java:io:hadoop-common:assemble
> Task :sdks:java:io:hadoop-common:analyzeClassesDependencies SKIPPED

> Task :sdks:java:core:javadoc
<https://builds.apache.org/job/beam_PreCommit_Java_Cron/ws/src/sdks/java/core/src/main/java/org/apache/beam/sdk/transforms/Watch.java>:171: error: cannot find symbol
      extends PTransform<PCollection<InputT>, PCollection<KV<InputT, OutputT>>> {
                         ^
  symbol:   class PCollection
  location: class Watch
<https://builds.apache.org/job/beam_PreCommit_Java_Cron/ws/src/sdks/java/core/src/main/java/org/apache/beam/sdk/transforms/Watch.java>:171: error: cannot find symbol
      extends PTransform<PCollection<InputT>, PCollection<KV<InputT, OutputT>>> {
                                              ^
  symbol:   class PCollection
  location: class Watch
<https://builds.apache.org/job/beam_PreCommit_Java_Cron/ws/src/sdks/java/core/src/main/java/org/apache/beam/sdk/transforms/Watch.java>:171: error: cannot find symbol
      extends PTransform<PCollection<InputT>, PCollection<KV<InputT, OutputT>>> {
                                                          ^
  symbol:   class KV
  location: class Watch

> Task :sdks:java:extensions:protobuf:compileTestJava
> Task :sdks:java:io:elasticsearch-tests:elasticsearch-tests-5:check
> Task :sdks:java:io:elasticsearch-tests:elasticsearch-tests-5:build
> Task :sdks:java:io:elasticsearch-tests:elasticsearch-tests-5:buildDependents
> Task :runners:samza:job-server:shadowDistZip
> Task :runners:samza:job-server:assemble
> Task :runners:samza:job-server:analyzeClassesDependencies SKIPPED
> Task :runners:samza:job-server:analyzeTestClassesDependencies SKIPPED
> Task :runners:samza:job-server:analyzeDependencies SKIPPED
> Task :runners:samza:job-server:checkstyleMain NO-SOURCE
> Task :runners:samza:job-server:checkstyleTest NO-SOURCE
> Task :runners:samza:job-server:javadoc NO-SOURCE
> Task :runners:samza:job-server:spotbugsMain NO-SOURCE
> Task :runners:samza:job-server:test NO-SOURCE
> Task :runners:samza:job-server:check UP-TO-DATE
> Task :runners:samza:job-server:build
> Task :runners:samza:job-server:buildDependents
> Task :runners:samza:buildDependents

> Task :sdks:java:core:javadoc
<https://builds.apache.org/job/beam_PreCommit_Java_Cron/ws/src/sdks/java/core/src/main/java/org/apache/beam/sdk/transforms/CombineFns.java>:118: warning - Tag @link: can't find with(SimpleFunction, CombineFn, TupleTag) in org.apache.beam.sdk.transforms.CombineFns.ComposeCombineFnBuilder
<https://builds.apache.org/job/beam_PreCommit_Java_Cron/ws/src/sdks/java/core/src/main/java/org/apache/beam/sdk/transforms/CombineFns.java>:144: warning - Tag @link: can't find with(SimpleFunction, CombineFnWithContext, TupleTag) in org.apache.beam.sdk.transforms.CombineFns.ComposeCombineFnBuilder

> Task :sdks:java:io:elasticsearch-tests:elasticsearch-tests-6:check
> Task :sdks:java:io:elasticsearch-tests:elasticsearch-tests-6:build
> Task :sdks:java:io:elasticsearch-tests:elasticsearch-tests-6:buildDependents
> Task :runners:extensions-java:metrics:test
> Task :runners:extensions-java:metrics:check
> Task :runners:extensions-java:metrics:build
> Task :runners:extensions-java:metrics:buildDependents

> Task :sdks:java:extensions:protobuf:compileTestJava
Note: Some input files use or override a deprecated API.
Note: Recompile with -Xlint:deprecation for details.

> Task :sdks:java:extensions:protobuf:testClasses
> Task :sdks:java:extensions:protobuf:analyzeTestClassesDependencies SKIPPED
> Task :sdks:java:extensions:protobuf:analyzeDependencies SKIPPED
> Task :sdks:java:extensions:protobuf:checkstyleMain

> Task :sdks:java:core:javadoc
<https://builds.apache.org/job/beam_PreCommit_Java_Cron/ws/src/sdks/java/core/src/main/java/org/apache/beam/sdk/io/AvroIO.java>:329: warning - Tag @link: can't find continuously(Duration, TerminationCondition) in org.apache.beam.sdk.io.FileIO.Match
<https://builds.apache.org/job/beam_PreCommit_Java_Cron/ws/src/sdks/java/core/src/main/java/org/apache/beam/sdk/io/AvroIO.java>:997: warning - Tag @link: can't find watchForNewFiles in org.apache.beam.sdk.io.Read
<https://builds.apache.org/job/beam_PreCommit_Java_Cron/ws/src/sdks/java/core/src/main/java/org/apache/beam/sdk/io/AvroIO.java>:991: warning - Tag @link: can't find withEmptyMatchTreatment in org.apache.beam.sdk.io.Read
<https://builds.apache.org/job/beam_PreCommit_Java_Cron/ws/src/sdks/java/core/src/main/java/org/apache/beam/sdk/io/AvroIO.java>:1009: warning - Tag @link: can't find withHintMatchesManyFiles() in org.apache.beam.sdk.io.Read
<https://builds.apache.org/job/beam_PreCommit_Java_Cron/ws/src/sdks/java/core/src/main/java/org/apache/beam/sdk/io/AvroIO.java>:1179: warning - Tag @link: can't find watchForNewFiles in org.apache.beam.sdk.io.Read
<https://builds.apache.org/job/beam_PreCommit_Java_Cron/ws/src/sdks/java/core/src/main/java/org/apache/beam/sdk/io/AvroIO.java>:1173: warning - Tag @link: can't find withEmptyMatchTreatment in org.apache.beam.sdk.io.Read
<https://builds.apache.org/job/beam_PreCommit_Java_Cron/ws/src/sdks/java/core/src/main/java/org/apache/beam/sdk/io/AvroIO.java>:868: warning - Tag @link: can't find watchForNewFiles in org.apache.beam.sdk.io.Read
<https://builds.apache.org/job/beam_PreCommit_Java_Cron/ws/src/sdks/java/core/src/main/java/org/apache/beam/sdk/io/AvroIO.java>:862: warning - Tag @link: can't find withEmptyMatchTreatment in org.apache.beam.sdk.io.Read
<https://builds.apache.org/job/beam_PreCommit_Java_Cron/ws/src/sdks/java/core/src/main/java/org/apache/beam/sdk/io/AvroIO.java>:1341: warning - Tag @link: can't find to(FilenamePolicy) in org.apache.beam.sdk.io.AvroIO.TypedWrite
<https://builds.apache.org/job/beam_PreCommit_Java_Cron/ws/src/sdks/java/core/src/main/java/org/apache/beam/sdk/io/AvroIO.java>:1341: warning - Tag @link: can't find to(FilenamePolicy) in org.apache.beam.sdk.io.AvroIO.TypedWrite
<https://builds.apache.org/job/beam_PreCommit_Java_Cron/ws/src/sdks/java/core/src/main/java/org/apache/beam/sdk/io/AvroIO.java>:1318: warning - Tag @link: can't find to(FilenamePolicy) in org.apache.beam.sdk.io.AvroIO.TypedWrite
<https://builds.apache.org/job/beam_PreCommit_Java_Cron/ws/src/sdks/java/core/src/main/java/org/apache/beam/sdk/io/AvroIO.java>:1639: warning - Tag @link: can't find to(FilenamePolicy) in org.apache.beam.sdk.io.AvroIO.TypedWrite

> Task :sdks:java:extensions:protobuf:checkstyleTest

> Task :sdks:java:io:elasticsearch:spotbugsMain
The following classes needed for analysis were missing:
  com.google.auto.value.AutoValue$Builder
  com.google.auto.value.AutoValue

> Task :sdks:java:io:elasticsearch:test NO-SOURCE
> Task :sdks:java:io:elasticsearch:check
> Task :sdks:java:io:elasticsearch:build

> Task :sdks:java:core:javadoc
<https://builds.apache.org/job/beam_PreCommit_Java_Cron/ws/src/sdks/java/core/src/main/java/org/apache/beam/sdk/io/DynamicFileDestinations.java>:137: warning - Tag @link: can't find constant(FilenamePolicy, SerializableFunction) in org.apache.beam.sdk.io.DynamicFileDestinations
<https://builds.apache.org/job/beam_PreCommit_Java_Cron/ws/src/sdks/java/core/src/main/java/org/apache/beam/sdk/io/FileBasedSource.java>:204: warning - Tag @link: can't find FileBasedSource(Metadata, long, long, long) in org.apache.beam.sdk.io.FileBasedSource
<https://builds.apache.org/job/beam_PreCommit_Java_Cron/ws/src/sdks/java/core/src/main/java/org/apache/beam/sdk/io/FileIO.java>:311: warning - Tag @link: can't find withNaming(Write.FileNaming) in org.apache.beam.sdk.io.FileIO.Write
<https://builds.apache.org/job/beam_PreCommit_Java_Cron/ws/src/sdks/java/core/src/main/java/org/apache/beam/sdk/io/FileIO.java>:311: warning - Tag @link: can't find via(Contextful, Sink) in org.apache.beam.sdk.io.FileIO.Write
<https://builds.apache.org/job/beam_PreCommit_Java_Cron/ws/src/sdks/java/core/src/main/java/org/apache/beam/sdk/io/FileIO.java>:331: warning - Tag @link: can't find continuously(Duration,
 TerminationCondition) in org.apache.beam.sdk.io.FileIO.MatchAll
<https://builds.apache.org/job/beam_PreCommit_Java_Cron/ws/src/sdks/java/core/src/main/java/org/apache/beam/sdk/io/TextIO.java>:182: warning - Tag @link: can't find continuously(Duration, TerminationCondition) in org.apache.beam.sdk.io.FileIO.Match
<https://builds.apache.org/job/beam_PreCommit_Java_Cron/ws/src/sdks/java/core/src/main/java/org/apache/beam/sdk/io/TextIO.java>:182: warning - Tag @link: can't find to(FilenamePolicy) in org.apache.beam.sdk.io.TextIO.Write
<https://builds.apache.org/job/beam_PreCommit_Java_Cron/ws/src/sdks/java/core/src/main/java/org/apache/beam/sdk/io/TextIO.java>:182: warning - Tag @link: can't find to(DynamicDestinations) in org.apache.beam.sdk.io.TextIO.Write
<https://builds.apache.org/job/beam_PreCommit_Java_Cron/ws/src/sdks/java/core/src/main/java/org/apache/beam/sdk/io/TextIO.java>:257: warning - Tag @link: can't find to(DynamicDestinations) in org.apache.beam.sdk.io.TextIO.Write
<https://builds.apache.org/job/beam_PreCommit_Java_Cron/ws/src/sdks/java/core/src/main/java/org/apache/beam/sdk/io/TextIO.java>:500: warning - Tag @link: can't find watchForNewFiles(Duration, TerminationCondition) in org.apache.beam.sdk.io.Read
<https://builds.apache.org/job/beam_PreCommit_Java_Cron/ws/src/sdks/java/core/src/main/java/org/apache/beam/sdk/io/TextIO.java>:494: warning - Tag @link: can't find withEmptyMatchTreatment in org.apache.beam.sdk.io.Read
<https://builds.apache.org/job/beam_PreCommit_Java_Cron/ws/src/sdks/java/core/src/main/java/org/apache/beam/sdk/io/TextIO.java>:562: warning - Tag @link: can't find withDelimiter in org.apache.beam.sdk.io.Read
<https://builds.apache.org/job/beam_PreCommit_Java_Cron/ws/src/sdks/java/core/src/main/java/org/apache/beam/sdk/io/TextIO.java>:733: warning - Tag @link: can't find to(FilenamePolicy) in org.apache.beam.sdk.io.TextIO.TypedWrite
<https://builds.apache.org/job/beam_PreCommit_Java_Cron/ws/src/sdks/java/core/src/main/java/org/apache/beam/sdk/io/TextIO.java>:807: warning - Tag @link: can't find to(DynamicDestinations) in org.apache.beam.sdk.io.TextIO.TypedWrite
<https://builds.apache.org/job/beam_PreCommit_Java_Cron/ws/src/sdks/java/core/src/main/java/org/apache/beam/sdk/io/TextIO.java>:833: warning - Tag @link: can't find to(FilenamePolicy) in org.apache.beam.sdk.io.TextIO.TypedWrite
<https://builds.apache.org/job/beam_PreCommit_Java_Cron/ws/src/sdks/java/core/src/main/java/org/apache/beam/sdk/io/TextIO.java>:833: warning - Tag @link: can't find to(DynamicDestinations) in org.apache.beam.sdk.io.TextIO.TypedWrite
<https://builds.apache.org/job/beam_PreCommit_Java_Cron/ws/src/sdks/java/core/src/main/java/org/apache/beam/sdk/io/TextIO.java>:845: warning - Tag @link: can't find to(FilenamePolicy) in org.apache.beam.sdk.io.TextIO.TypedWrite
<https://builds.apache.org/job/beam_PreCommit_Java_Cron/ws/src/sdks/java/core/src/main/java/org/apache/beam/sdk/io/TextIO.java>:845: warning - Tag @link: can't find to(DynamicDestinations) in org.apache.beam.sdk.io.TextIO.TypedWrite

> Task :sdks:java:io:hadoop-common:compileTestJava
> Task :sdks:java:io:hadoop-common:testClasses
> Task :sdks:java:io:hadoop-common:analyzeTestClassesDependencies SKIPPED
> Task :sdks:java:io:hadoop-common:analyzeDependencies SKIPPED
> Task :sdks:java:io:hadoop-common:checkstyleMain
> Task :sdks:java:io:hadoop-common:checkstyleTest
> Task :sdks:java:extensions:protobuf:javadoc
> Task :sdks:java:io:hadoop-common:javadoc
> Task :sdks:java:extensions:sql:hcatalog:compileJava
> Task :sdks:java:extensions:sql:hcatalog:classes

> Task :sdks:java:extensions:protobuf:spotbugsMain
SLF4J: Class path contains multiple SLF4J bindings.
SLF4J: Found binding in [jar:file:/home/jenkins/.gradle/caches/modules-2/files-2.1/org.slf4j/slf4j-simple/1.7.25/8dacf9514f0c707cbbcdd6fd699e8940d42fb54e/slf4j-simple-1.7.25.jar!/org/slf4j/impl/StaticLoggerBinder.class]
SLF4J: Found binding in [jar:file:/home/jenkins/.gradle/wrapper/dists/gradle-5.2.1-all/bviwmvmbexq6idcscbicws5me/gradle-5.2.1/lib/gradle-logging-5.2.1.jar!/org/slf4j/impl/StaticLoggerBinder.class]
SLF4J: See http://www.slf4j.org/codes.html#multiple_bindings for an explanation.
SLF4J: Actual binding is of type [org.slf4j.impl.SimpleLoggerFactory]

[main] INFO org.gradle.internal.nativeintegration.services.NativeServices - Initialized native services in: /home/jenkins/.gradle/native

> Task :sdks:java:core:javadoc
<https://builds.apache.org/job/beam_PreCommit_Java_Cron/ws/src/sdks/java/core/src/main/java/org/apache/beam/sdk/options/SdkHarnessOptions.java>:113: warning - Tag @link: can't find addOverrideForName(String, LogLevel) in org.apache.beam.sdk.options.SdkHarnessOptions.SdkHarnessLogLevelOverrides
<https://builds.apache.org/job/beam_PreCommit_Java_Cron/ws/src/sdks/java/core/src/main/java/org/apache/beam/sdk/options/SdkHarnessOptions.java>:125: warning - Tag @link: can't find addOverrideForName(String, LogLevel) in org.apache.beam.sdk.options.SdkHarnessOptions.SdkHarnessLogLevelOverrides
<https://builds.apache.org/job/beam_PreCommit_Java_Cron/ws/src/sdks/java/core/src/main/java/org/apache/beam/sdk/state/StateSpecs.java>:73: warning - Tag @see: can't find combining(Coder, CombineFn) in org.apache.beam.sdk.state.StateSpecs
<https://builds.apache.org/job/beam_PreCommit_Java_Cron/ws/src/sdks/java/core/src/main/java/org/apache/beam/sdk/state/StateSpecs.java>:91: warning - Tag @see: can't find combining(Coder, CombineFnWithContext) in org.apache.beam.sdk.state.StateSpecs
<https://builds.apache.org/job/beam_PreCommit_Java_Cron/ws/src/sdks/java/core/src/main/java/org/apache/beam/sdk/state/StateSpecs.java>:102: warning - Tag @link: can't find combining(CombineFn) in org.apache.beam.sdk.state.StateSpecs
<https://builds.apache.org/job/beam_PreCommit_Java_Cron/ws/src/sdks/java/core/src/main/java/org/apache/beam/sdk/state/StateSpecs.java>:121: warning - Tag @link: can't find combining(CombineFnWithContext) in org.apache.beam.sdk.state.StateSpecs

[main] INFO org.gradle.internal.nativeintegration.services.NativeServices - Initialized native services in: /home/jenkins/.gradle/native

> Task :sdks:java:io:hadoop-common:spotbugsMain
SLF4J: Class path contains multiple SLF4J bindings.
SLF4J: Found binding in [jar:file:/home/jenkins/.gradle/caches/modules-2/files-2.1/org.slf4j/slf4j-simple/1.7.25/8dacf9514f0c707cbbcdd6fd699e8940d42fb54e/slf4j-simple-1.7.25.jar!/org/slf4j/impl/StaticLoggerBinder.class]
SLF4J: Found binding in [jar:file:/home/jenkins/.gradle/wrapper/dists/gradle-5.2.1-all/bviwmvmbexq6idcscbicws5me/gradle-5.2.1/lib/gradle-logging-5.2.1.jar!/org/slf4j/impl/StaticLoggerBinder.class]
SLF4J: See http://www.slf4j.org/codes.html#multiple_bindings for an explanation.
SLF4J: Actual binding is of type [org.slf4j.impl.SimpleLoggerFactory]
SLF4J: Failed to load class "org.slf4j.impl.StaticLoggerBinder".
SLF4J: Defaulting to no-operation (NOP) logger implementation
SLF4J: See http://www.slf4j.org/codes.html#StaticLoggerBinder for further details.

> Task :sdks:java:extensions:sql:hcatalog:javadoc

> Task :sdks:java:extensions:protobuf:spotbugsMain
SLF4J: Failed to load class "org.slf4j.impl.StaticLoggerBinder".
SLF4J: Defaulting to no-operation (NOP) logger implementation
SLF4J: See http://www.slf4j.org/codes.html#StaticLoggerBinder for further details.

> Task :sdks:java:core:javadoc
51 warnings

> Task :sdks:java:javadoc:allJavadoc
> Task :sdks:java:io:elasticsearch-tests:elasticsearch-tests-7:check
> Task :sdks:java:io:elasticsearch-tests:elasticsearch-tests-7:build
> Task :sdks:java:io:elasticsearch-tests:elasticsearch-tests-7:buildDependents
> Task :sdks:java:io:elasticsearch-tests:elasticsearch-tests-common:buildDependents
> Task :sdks:java:io:elasticsearch:buildDependents
> Task :sdks:java:extensions:google-cloud-platform-core:test

[main] INFO org.gradle.internal.nativeintegration.services.NativeServices - Initialized native services in: /home/jenkins/.gradle/native

> Task :sdks:java:core:spotbugsMain
SLF4J: Failed to load class "org.slf4j.impl.StaticLoggerBinder".
SLF4J: Defaulting to no-operation (NOP) logger implementation
SLF4J: See http://www.slf4j.org/codes.html#StaticLoggerBinder for further details.

> Task :sdks:java:extensions:sql:jdbc:shadowJarTest
> Task :sdks:java:extensions:google-cloud-platform-core:check
> Task :sdks:java:extensions:google-cloud-platform-core:build
> Task :sdks:java:io:hadoop-common:test
> Task :sdks:java:io:hadoop-common:check
> Task :sdks:java:io:hadoop-common:build
> Task :sdks:java:io:hadoop-common:buildDependents
> Task :sdks:java:fn-execution:test
> Task :sdks:java:fn-execution:check
> Task :sdks:java:fn-execution:build
> Task :sdks:java:extensions:protobuf:test
> Task :sdks:java:extensions:protobuf:check
> Task :sdks:java:extensions:protobuf:build
> Task :sdks:java:extensions:sql:jdbc:preCommit

> Task :sdks:java:core:spotbugsMain
The following classes needed for analysis were missing:
  com.google.auto.value.AutoValue$Builder
  com.google.auto.value.AutoValue

> Task :sdks:java:core:test
> Task :sdks:java:core:validateShadedJarDoesntLeakNonProjectClasses
> Task :sdks:java:core:check
> Task :sdks:java:core:build
> Task :sdks:java:core:buildNeeded
> Task :sdks:java:testing:nexmark:check
> Task :sdks:java:testing:nexmark:build
> Task :sdks:java:testing:nexmark:buildDependents
> Task :sdks:java:extensions:sql:buildDependents
> Task :sdks:java:io:kafka:buildDependents
> Task :sdks:java:extensions:join-library:buildDependents
> Task :sdks:java:io:mongodb:buildDependents
> Task :sdks:java:io:synthetic:buildDependents

FAILURE: Build failed with an exception.

* What went wrong:
Execution failed for task ':runners:google-cloud-dataflow-java:worker:test'.
> There were failing tests. See the report at: file://<https://builds.apache.org/job/beam_PreCommit_Java_Cron/ws/src/runners/google-cloud-dataflow-java/worker/build/reports/tests/test/index.html>

* Try:
Run with --stacktrace option to get the stack trace. Run with --info or --debug option to get more log output. Run with --scan to get full insights.

* Get more help at https://help.gradle.org

Deprecated Gradle features were used in this build, making it incompatible with Gradle 6.0.
Use '--warning-mode all' to show the individual deprecation warnings.
See https://docs.gradle.org/5.2.1/userguide/command_line_interface.html#sec:command_line_warnings

BUILD FAILED in 32m 35s
827 actionable tasks: 793 executed, 34 from cache

Publishing build scan...
https://gradle.com/s/zrggv2ejlx66o

Build step 'Invoke Gradle script' changed build result to FAILURE
Build step 'Invoke Gradle script' marked build as failure

---------------------------------------------------------------------
To unsubscribe, e-mail: builds-unsubscribe@beam.apache.org
For additional commands, e-mail: builds-help@beam.apache.org