You are viewing a plain text version of this content. The canonical link for it is here.
Posted to builds@solr.apache.org by Apache Jenkins Server <je...@builds.apache.org> on 2023/07/23 12:41:42 UTC
[JENKINS] Solr » Solr-Check-9.x - Build # 4955 - Still Failing!
Build: https://ci-builds.apache.org/job/Solr/job/Solr-Check-9.x/4955/
1 tests failed.
FAILED: org.apache.solr.metrics.DelegateRegistryTimerTest.testUpdate
Error Message:
java.lang.AssertionError: expected:<200.0> but was:<200.49874378911622>
Stack Trace:
java.lang.AssertionError: expected:<200.0> but was:<200.49874378911622>
at __randomizedtesting.SeedInfo.seed([DF4E04C68C3DAA88:695841CCEAF9425E]:0)
at org.junit.Assert.fail(Assert.java:89)
at org.junit.Assert.failNotEquals(Assert.java:835)
at org.junit.Assert.assertEquals(Assert.java:555)
at org.junit.Assert.assertEquals(Assert.java:685)
at org.apache.solr.metrics.DelegateRegistryTimerTest.testUpdate(DelegateRegistryTimerTest.java:88)
at java.base/jdk.internal.reflect.NativeMethodAccessorImpl.invoke0(Native Method)
at java.base/jdk.internal.reflect.NativeMethodAccessorImpl.invoke(NativeMethodAccessorImpl.java:62)
at java.base/jdk.internal.reflect.DelegatingMethodAccessorImpl.invoke(DelegatingMethodAccessorImpl.java:43)
at java.base/java.lang.reflect.Method.invoke(Method.java:566)
at com.carrotsearch.randomizedtesting.RandomizedRunner.invoke(RandomizedRunner.java:1758)
at com.carrotsearch.randomizedtesting.RandomizedRunner$8.evaluate(RandomizedRunner.java:946)
at com.carrotsearch.randomizedtesting.RandomizedRunner$9.evaluate(RandomizedRunner.java:982)
at com.carrotsearch.randomizedtesting.RandomizedRunner$10.evaluate(RandomizedRunner.java:996)
at org.apache.lucene.tests.util.TestRuleSetupTeardownChained$1.evaluate(TestRuleSetupTeardownChained.java:48)
at org.apache.lucene.tests.util.AbstractBeforeAfterRule$1.evaluate(AbstractBeforeAfterRule.java:43)
at org.apache.lucene.tests.util.TestRuleThreadAndTestName$1.evaluate(TestRuleThreadAndTestName.java:45)
at org.apache.lucene.tests.util.TestRuleIgnoreAfterMaxFailures$1.evaluate(TestRuleIgnoreAfterMaxFailures.java:60)
at org.apache.lucene.tests.util.TestRuleMarkFailure$1.evaluate(TestRuleMarkFailure.java:44)
at org.junit.rules.RunRules.evaluate(RunRules.java:20)
at com.carrotsearch.randomizedtesting.rules.StatementAdapter.evaluate(StatementAdapter.java:36)
at com.carrotsearch.randomizedtesting.ThreadLeakControl$StatementRunner.run(ThreadLeakControl.java:390)
at com.carrotsearch.randomizedtesting.ThreadLeakControl.forkTimeoutingTask(ThreadLeakControl.java:843)
at com.carrotsearch.randomizedtesting.ThreadLeakControl$3.evaluate(ThreadLeakControl.java:490)
at com.carrotsearch.randomizedtesting.RandomizedRunner.runSingleTest(RandomizedRunner.java:955)
at com.carrotsearch.randomizedtesting.RandomizedRunner$5.evaluate(RandomizedRunner.java:840)
at com.carrotsearch.randomizedtesting.RandomizedRunner$6.evaluate(RandomizedRunner.java:891)
at com.carrotsearch.randomizedtesting.RandomizedRunner$7.evaluate(RandomizedRunner.java:902)
at com.carrotsearch.randomizedtesting.rules.StatementAdapter.evaluate(StatementAdapter.java:36)
at com.carrotsearch.randomizedtesting.rules.StatementAdapter.evaluate(StatementAdapter.java:36)
at org.apache.lucene.tests.util.AbstractBeforeAfterRule$1.evaluate(AbstractBeforeAfterRule.java:43)
at org.apache.lucene.tests.util.AbstractBeforeAfterRule$1.evaluate(AbstractBeforeAfterRule.java:43)
at com.carrotsearch.randomizedtesting.rules.SystemPropertiesRestoreRule$1.evaluate(SystemPropertiesRestoreRule.java:80)
at org.junit.rules.RunRules.evaluate(RunRules.java:20)
at org.apache.lucene.tests.util.AbstractBeforeAfterRule$1.evaluate(AbstractBeforeAfterRule.java:43)
at com.carrotsearch.randomizedtesting.rules.StatementAdapter.evaluate(StatementAdapter.java:36)
at org.apache.lucene.tests.util.TestRuleStoreClassName$1.evaluate(TestRuleStoreClassName.java:38)
at com.carrotsearch.randomizedtesting.rules.NoShadowingOrOverridesOnMethodsRule$1.evaluate(NoShadowingOrOverridesOnMethodsRule.java:40)
at com.carrotsearch.randomizedtesting.rules.NoShadowingOrOverridesOnMethodsRule$1.evaluate(NoShadowingOrOverridesOnMethodsRule.java:40)
at com.carrotsearch.randomizedtesting.rules.StatementAdapter.evaluate(StatementAdapter.java:36)
at com.carrotsearch.randomizedtesting.rules.StatementAdapter.evaluate(StatementAdapter.java:36)
at org.apache.lucene.tests.util.TestRuleAssertionsRequired$1.evaluate(TestRuleAssertionsRequired.java:53)
at org.apache.lucene.tests.util.AbstractBeforeAfterRule$1.evaluate(AbstractBeforeAfterRule.java:43)
at org.apache.lucene.tests.util.TestRuleMarkFailure$1.evaluate(TestRuleMarkFailure.java:44)
at org.apache.lucene.tests.util.TestRuleIgnoreAfterMaxFailures$1.evaluate(TestRuleIgnoreAfterMaxFailures.java:60)
at org.apache.lucene.tests.util.TestRuleIgnoreTestSuites$1.evaluate(TestRuleIgnoreTestSuites.java:47)
at org.junit.rules.RunRules.evaluate(RunRules.java:20)
at com.carrotsearch.randomizedtesting.rules.StatementAdapter.evaluate(StatementAdapter.java:36)
at com.carrotsearch.randomizedtesting.ThreadLeakControl$StatementRunner.run(ThreadLeakControl.java:390)
at com.carrotsearch.randomizedtesting.ThreadLeakControl.lambda$forkTimeoutingTask$0(ThreadLeakControl.java:850)
at java.base/java.lang.Thread.run(Thread.java:829)
Build Log:
[...truncated 1344 lines...]
# ERROR: Error from server at http://localhost:8983/solr/admin/collections?action=CREATE&name=COLL_NAME&collection.configName=COLL_NAME&numShards=1&nrtReplicas=1&wt=javabin&version=2: org.apache.solr.cluster.placement.PlacementException: Not enough eligible nodes to place 1 replica(s) of type NRT for shard shard1 of collection COLL_NAME. Only able to place 0 replicas.
ok 42 Random placement plugin using ENV in 22851ms
ok 43 post solr log into solr in 9464ms
ok 44 start solr with ssl in 20352ms
ok 45 start solr with ssl and auth in 22964ms
ok 46 SOLR-11740 check 'solr stop' connection in 28149ms
ok 47 status detects locally running solr in 14399ms
ok 48 status does not expose cli parameters to end user in 211ms
ok 49 listing out files in 2189ms
ok 50 copying files around in 6627ms
ok 51 upconfig in 2654ms
> Task :solr:packaging:integrationTests FAILED
ERROR: The following test(s) have failed:
- org.apache.solr.metrics.DelegateRegistryTimerTest.testUpdate (:solr:core)
Test output: /tmp/src/solr/solr/core/build/test-results/test/outputs/OUTPUT-org.apache.solr.metrics.DelegateRegistryTimerTest.txt
Reproduce with: gradlew :solr:core:test --tests "org.apache.solr.metrics.DelegateRegistryTimerTest.testUpdate" -Ptests.jvms=96 "-Ptests.jvmargs=-XX:TieredStopAtLevel=1 -XX:+UseParallelGC -XX:ActiveProcessorCount=1 -XX:ReservedCodeCacheSize=120m" -Ptests.seed=DF4E04C68C3DAA88 -Ptests.file.encoding=US-ASCII
FAILURE: Build completed with 2 failures.
1: Task failed with an exception.
-----------
* What went wrong:
Execution failed for task ':solr:core:test'.
> There were failing tests. See the results at: file:///tmp/src/solr/solr/core/build/test-results/test/
* Try:
> Run with --stacktrace option to get the stack trace.
> Run with --info or --debug option to get more log output.
> Run with --scan to get full insights.
==============================================================================
2: Task failed with an exception.
-----------
* Where:
Build file '/tmp/src/solr/solr/packaging/build.gradle' line: 285
* What went wrong:
Execution failed for task ':solr:packaging:integrationTests'.
> Process 'command '/tmp/src/solr/.gradle/node/packaging/node_modules/bats/bin/bats'' finished with non-zero exit value 1
* Try:
> Run with --stacktrace option to get the stack trace.
> Run with --info or --debug option to get more log output.
> Run with --scan to get full insights.
==============================================================================
* Get more help at https://help.gradle.org
BUILD FAILED in 16m 4s
625 actionable tasks: 609 executed, 16 up-to-date
[0m[?12l[?25h
------------------------------------------------------------------------
Build Failed: returned 1
Total time: 16m28.5s
------------------------------------------------------------------------
+ status=1
+ ./crave pull '**/build/**/test/TEST-*.xml' '**/*.events' 'heapdumps/**' '**/hs_err_pid*'
Error: rsync: [sender] change_dir "/tmp/src/solr/heapdumps" failed: No such file or directory (2)
rsync error: some files/attrs were not transferred (see previous errors) (code 23) at main.c(1675) [Receiver=3.1.2]
rsync: [Receiver] write error: Broken pipe (32)
+ exit 1
Build step 'Execute shell' marked build as failure
Archiving artifacts
Recording test results
[Checks API] No suitable checks publisher found.
Email was triggered for: Failure - Any
Sending email for trigger: Failure - Any
[JENKINS] Solr » Solr-Check-9.x - Build # 4965 - Still Failing!
Posted by Apache Jenkins Server <je...@builds.apache.org>.
Build: https://ci-builds.apache.org/job/Solr/job/Solr-Check-9.x/4965/
5 tests failed.
FAILED: org.apache.solr.search.function.TestDenseVectorFunctionQuery.byteFieldVectors_shouldReturnFloatSimilarity
Error Message:
java.lang.RuntimeException: Exception during query
Stack Trace:
java.lang.RuntimeException: Exception during query
at __randomizedtesting.SeedInfo.seed([C4AC7AAB095B5664:3487AA7667081A6D]:0)
at org.apache.solr.SolrTestCaseJ4.assertQ(SolrTestCaseJ4.java:1024)
at org.apache.solr.SolrTestCaseJ4.assertQ(SolrTestCaseJ4.java:982)
at org.apache.solr.search.function.TestDenseVectorFunctionQuery.byteFieldVectors_shouldReturnFloatSimilarity(TestDenseVectorFunctionQuery.java:126)
at java.base/jdk.internal.reflect.NativeMethodAccessorImpl.invoke0(Native Method)
at java.base/jdk.internal.reflect.NativeMethodAccessorImpl.invoke(NativeMethodAccessorImpl.java:62)
at java.base/jdk.internal.reflect.DelegatingMethodAccessorImpl.invoke(DelegatingMethodAccessorImpl.java:43)
at java.base/java.lang.reflect.Method.invoke(Method.java:566)
at com.carrotsearch.randomizedtesting.RandomizedRunner.invoke(RandomizedRunner.java:1758)
at com.carrotsearch.randomizedtesting.RandomizedRunner$8.evaluate(RandomizedRunner.java:946)
at com.carrotsearch.randomizedtesting.RandomizedRunner$9.evaluate(RandomizedRunner.java:982)
at com.carrotsearch.randomizedtesting.RandomizedRunner$10.evaluate(RandomizedRunner.java:996)
at com.carrotsearch.randomizedtesting.rules.SystemPropertiesRestoreRule$1.evaluate(SystemPropertiesRestoreRule.java:80)
at org.junit.rules.RunRules.evaluate(RunRules.java:20)
at org.apache.lucene.tests.util.TestRuleSetupTeardownChained$1.evaluate(TestRuleSetupTeardownChained.java:48)
at org.apache.lucene.tests.util.AbstractBeforeAfterRule$1.evaluate(AbstractBeforeAfterRule.java:43)
at org.apache.lucene.tests.util.TestRuleThreadAndTestName$1.evaluate(TestRuleThreadAndTestName.java:45)
at org.apache.lucene.tests.util.TestRuleIgnoreAfterMaxFailures$1.evaluate(TestRuleIgnoreAfterMaxFailures.java:60)
at org.apache.lucene.tests.util.TestRuleMarkFailure$1.evaluate(TestRuleMarkFailure.java:44)
at org.junit.rules.RunRules.evaluate(RunRules.java:20)
at com.carrotsearch.randomizedtesting.rules.StatementAdapter.evaluate(StatementAdapter.java:36)
at com.carrotsearch.randomizedtesting.ThreadLeakControl$StatementRunner.run(ThreadLeakControl.java:390)
at com.carrotsearch.randomizedtesting.ThreadLeakControl.forkTimeoutingTask(ThreadLeakControl.java:843)
at com.carrotsearch.randomizedtesting.ThreadLeakControl$3.evaluate(ThreadLeakControl.java:490)
at com.carrotsearch.randomizedtesting.RandomizedRunner.runSingleTest(RandomizedRunner.java:955)
at com.carrotsearch.randomizedtesting.RandomizedRunner$5.evaluate(RandomizedRunner.java:840)
at com.carrotsearch.randomizedtesting.RandomizedRunner$6.evaluate(RandomizedRunner.java:891)
at com.carrotsearch.randomizedtesting.RandomizedRunner$7.evaluate(RandomizedRunner.java:902)
at com.carrotsearch.randomizedtesting.rules.StatementAdapter.evaluate(StatementAdapter.java:36)
at com.carrotsearch.randomizedtesting.rules.StatementAdapter.evaluate(StatementAdapter.java:36)
at org.apache.lucene.tests.util.AbstractBeforeAfterRule$1.evaluate(AbstractBeforeAfterRule.java:43)
at org.apache.lucene.tests.util.AbstractBeforeAfterRule$1.evaluate(AbstractBeforeAfterRule.java:43)
at com.carrotsearch.randomizedtesting.rules.SystemPropertiesRestoreRule$1.evaluate(SystemPropertiesRestoreRule.java:80)
at org.junit.rules.RunRules.evaluate(RunRules.java:20)
at org.apache.lucene.tests.util.AbstractBeforeAfterRule$1.evaluate(AbstractBeforeAfterRule.java:43)
at com.carrotsearch.randomizedtesting.rules.StatementAdapter.evaluate(StatementAdapter.java:36)
at org.apache.lucene.tests.util.TestRuleStoreClassName$1.evaluate(TestRuleStoreClassName.java:38)
at com.carrotsearch.randomizedtesting.rules.NoShadowingOrOverridesOnMethodsRule$1.evaluate(NoShadowingOrOverridesOnMethodsRule.java:40)
at com.carrotsearch.randomizedtesting.rules.NoShadowingOrOverridesOnMethodsRule$1.evaluate(NoShadowingOrOverridesOnMethodsRule.java:40)
at com.carrotsearch.randomizedtesting.rules.StatementAdapter.evaluate(StatementAdapter.java:36)
at com.carrotsearch.randomizedtesting.rules.StatementAdapter.evaluate(StatementAdapter.java:36)
at org.apache.lucene.tests.util.TestRuleAssertionsRequired$1.evaluate(TestRuleAssertionsRequired.java:53)
at org.apache.lucene.tests.util.AbstractBeforeAfterRule$1.evaluate(AbstractBeforeAfterRule.java:43)
at org.apache.lucene.tests.util.TestRuleMarkFailure$1.evaluate(TestRuleMarkFailure.java:44)
at org.apache.lucene.tests.util.TestRuleIgnoreAfterMaxFailures$1.evaluate(TestRuleIgnoreAfterMaxFailures.java:60)
at org.apache.lucene.tests.util.TestRuleIgnoreTestSuites$1.evaluate(TestRuleIgnoreTestSuites.java:47)
at org.junit.rules.RunRules.evaluate(RunRules.java:20)
at com.carrotsearch.randomizedtesting.rules.StatementAdapter.evaluate(StatementAdapter.java:36)
at com.carrotsearch.randomizedtesting.ThreadLeakControl$StatementRunner.run(ThreadLeakControl.java:390)
at com.carrotsearch.randomizedtesting.ThreadLeakControl.lambda$forkTimeoutingTask$0(ThreadLeakControl.java:850)
at java.base/java.lang.Thread.run(Thread.java:829)
Caused by: java.lang.IllegalArgumentException: no byte vector value is indexed for field 'vector_byte_encoding'
at org.apache.lucene.queries.function.valuesource.ByteKnnVectorFieldSource.getValues(ByteKnnVectorFieldSource.java:45)
at org.apache.lucene.queries.function.valuesource.VectorSimilarityFunction.getValues(VectorSimilarityFunction.java:47)
at org.apache.lucene.queries.function.FunctionQuery$AllScorer.<init>(FunctionQuery.java:115)
at org.apache.lucene.queries.function.FunctionQuery$FunctionWeight.scorer(FunctionQuery.java:76)
at org.apache.lucene.search.Weight.scorerSupplier(Weight.java:136)
at org.apache.lucene.search.BooleanWeight.scorerSupplier(BooleanWeight.java:542)
at org.apache.lucene.search.BooleanWeight.scorer(BooleanWeight.java:507)
at org.apache.lucene.search.Weight.bulkScorer(Weight.java:166)
at org.apache.lucene.search.BooleanWeight.bulkScorer(BooleanWeight.java:395)
at org.apache.lucene.search.IndexSearcher.search(IndexSearcher.java:770)
at org.apache.solr.search.SolrIndexSearcher.search(SolrIndexSearcher.java:720)
at org.apache.lucene.search.IndexSearcher.search(IndexSearcher.java:551)
at org.apache.solr.search.SolrIndexSearcher.buildAndRunCollectorChain(SolrIndexSearcher.java:275)
at org.apache.solr.search.SolrIndexSearcher.getDocListNC(SolrIndexSearcher.java:1890)
at org.apache.solr.search.SolrIndexSearcher.getDocListC(SolrIndexSearcher.java:1707)
at org.apache.solr.search.SolrIndexSearcher.search(SolrIndexSearcher.java:710)
at org.apache.solr.handler.component.QueryComponent.doProcessUngroupedSearch(QueryComponent.java:1660)
at org.apache.solr.handler.component.QueryComponent.process(QueryComponent.java:421)
at org.apache.solr.handler.component.SearchHandler.handleRequestBody(SearchHandler.java:425)
at org.apache.solr.handler.RequestHandlerBase.handleRequest(RequestHandlerBase.java:224)
at org.apache.solr.core.SolrCore.execute(SolrCore.java:2893)
at org.apache.solr.util.TestHarness.query(TestHarness.java:348)
at org.apache.solr.util.TestHarness.query(TestHarness.java:328)
at org.apache.solr.SolrTestCaseJ4.assertQ(SolrTestCaseJ4.java:996)
... 49 more
FAILED: org.apache.solr.search.function.TestDenseVectorFunctionQuery.resultOfVectorFunction_canBeUsedAsFloatFunctionInput
Error Message:
java.lang.RuntimeException: Exception during query
Stack Trace:
java.lang.RuntimeException: Exception during query
at __randomizedtesting.SeedInfo.seed([C4AC7AAB095B5664:1D2FF383EF6B0796]:0)
at org.apache.solr.SolrTestCaseJ4.assertQ(SolrTestCaseJ4.java:1024)
at org.apache.solr.SolrTestCaseJ4.assertQ(SolrTestCaseJ4.java:982)
at org.apache.solr.search.function.TestDenseVectorFunctionQuery.resultOfVectorFunction_canBeUsedAsFloatFunctionInput(TestDenseVectorFunctionQuery.java:142)
at java.base/jdk.internal.reflect.NativeMethodAccessorImpl.invoke0(Native Method)
at java.base/jdk.internal.reflect.NativeMethodAccessorImpl.invoke(NativeMethodAccessorImpl.java:62)
at java.base/jdk.internal.reflect.DelegatingMethodAccessorImpl.invoke(DelegatingMethodAccessorImpl.java:43)
at java.base/java.lang.reflect.Method.invoke(Method.java:566)
at com.carrotsearch.randomizedtesting.RandomizedRunner.invoke(RandomizedRunner.java:1758)
at com.carrotsearch.randomizedtesting.RandomizedRunner$8.evaluate(RandomizedRunner.java:946)
at com.carrotsearch.randomizedtesting.RandomizedRunner$9.evaluate(RandomizedRunner.java:982)
at com.carrotsearch.randomizedtesting.RandomizedRunner$10.evaluate(RandomizedRunner.java:996)
at com.carrotsearch.randomizedtesting.rules.SystemPropertiesRestoreRule$1.evaluate(SystemPropertiesRestoreRule.java:80)
at org.junit.rules.RunRules.evaluate(RunRules.java:20)
at org.apache.lucene.tests.util.TestRuleSetupTeardownChained$1.evaluate(TestRuleSetupTeardownChained.java:48)
at org.apache.lucene.tests.util.AbstractBeforeAfterRule$1.evaluate(AbstractBeforeAfterRule.java:43)
at org.apache.lucene.tests.util.TestRuleThreadAndTestName$1.evaluate(TestRuleThreadAndTestName.java:45)
at org.apache.lucene.tests.util.TestRuleIgnoreAfterMaxFailures$1.evaluate(TestRuleIgnoreAfterMaxFailures.java:60)
at org.apache.lucene.tests.util.TestRuleMarkFailure$1.evaluate(TestRuleMarkFailure.java:44)
at org.junit.rules.RunRules.evaluate(RunRules.java:20)
at com.carrotsearch.randomizedtesting.rules.StatementAdapter.evaluate(StatementAdapter.java:36)
at com.carrotsearch.randomizedtesting.ThreadLeakControl$StatementRunner.run(ThreadLeakControl.java:390)
at com.carrotsearch.randomizedtesting.ThreadLeakControl.forkTimeoutingTask(ThreadLeakControl.java:843)
at com.carrotsearch.randomizedtesting.ThreadLeakControl$3.evaluate(ThreadLeakControl.java:490)
at com.carrotsearch.randomizedtesting.RandomizedRunner.runSingleTest(RandomizedRunner.java:955)
at com.carrotsearch.randomizedtesting.RandomizedRunner$5.evaluate(RandomizedRunner.java:840)
at com.carrotsearch.randomizedtesting.RandomizedRunner$6.evaluate(RandomizedRunner.java:891)
at com.carrotsearch.randomizedtesting.RandomizedRunner$7.evaluate(RandomizedRunner.java:902)
at com.carrotsearch.randomizedtesting.rules.StatementAdapter.evaluate(StatementAdapter.java:36)
at com.carrotsearch.randomizedtesting.rules.StatementAdapter.evaluate(StatementAdapter.java:36)
at org.apache.lucene.tests.util.AbstractBeforeAfterRule$1.evaluate(AbstractBeforeAfterRule.java:43)
at org.apache.lucene.tests.util.AbstractBeforeAfterRule$1.evaluate(AbstractBeforeAfterRule.java:43)
at com.carrotsearch.randomizedtesting.rules.SystemPropertiesRestoreRule$1.evaluate(SystemPropertiesRestoreRule.java:80)
at org.junit.rules.RunRules.evaluate(RunRules.java:20)
at org.apache.lucene.tests.util.AbstractBeforeAfterRule$1.evaluate(AbstractBeforeAfterRule.java:43)
at com.carrotsearch.randomizedtesting.rules.StatementAdapter.evaluate(StatementAdapter.java:36)
at org.apache.lucene.tests.util.TestRuleStoreClassName$1.evaluate(TestRuleStoreClassName.java:38)
at com.carrotsearch.randomizedtesting.rules.NoShadowingOrOverridesOnMethodsRule$1.evaluate(NoShadowingOrOverridesOnMethodsRule.java:40)
at com.carrotsearch.randomizedtesting.rules.NoShadowingOrOverridesOnMethodsRule$1.evaluate(NoShadowingOrOverridesOnMethodsRule.java:40)
at com.carrotsearch.randomizedtesting.rules.StatementAdapter.evaluate(StatementAdapter.java:36)
at com.carrotsearch.randomizedtesting.rules.StatementAdapter.evaluate(StatementAdapter.java:36)
at org.apache.lucene.tests.util.TestRuleAssertionsRequired$1.evaluate(TestRuleAssertionsRequired.java:53)
at org.apache.lucene.tests.util.AbstractBeforeAfterRule$1.evaluate(AbstractBeforeAfterRule.java:43)
at org.apache.lucene.tests.util.TestRuleMarkFailure$1.evaluate(TestRuleMarkFailure.java:44)
at org.apache.lucene.tests.util.TestRuleIgnoreAfterMaxFailures$1.evaluate(TestRuleIgnoreAfterMaxFailures.java:60)
at org.apache.lucene.tests.util.TestRuleIgnoreTestSuites$1.evaluate(TestRuleIgnoreTestSuites.java:47)
at org.junit.rules.RunRules.evaluate(RunRules.java:20)
at com.carrotsearch.randomizedtesting.rules.StatementAdapter.evaluate(StatementAdapter.java:36)
at com.carrotsearch.randomizedtesting.ThreadLeakControl$StatementRunner.run(ThreadLeakControl.java:390)
at com.carrotsearch.randomizedtesting.ThreadLeakControl.lambda$forkTimeoutingTask$0(ThreadLeakControl.java:850)
at java.base/java.lang.Thread.run(Thread.java:829)
Caused by: java.lang.IllegalArgumentException: no float vector value is indexed for field 'vector'
at org.apache.lucene.queries.function.valuesource.FloatKnnVectorFieldSource.getValues(FloatKnnVectorFieldSource.java:45)
at org.apache.lucene.queries.function.valuesource.VectorSimilarityFunction.getValues(VectorSimilarityFunction.java:48)
at org.apache.lucene.queries.function.valuesource.DualFloatFunction.getValues(DualFloatFunction.java:58)
at org.apache.lucene.queries.function.FunctionQuery$AllScorer.<init>(FunctionQuery.java:115)
at org.apache.lucene.queries.function.FunctionQuery$FunctionWeight.scorer(FunctionQuery.java:76)
at org.apache.lucene.search.Weight.scorerSupplier(Weight.java:136)
at org.apache.lucene.search.BooleanWeight.scorerSupplier(BooleanWeight.java:542)
at org.apache.lucene.search.BooleanWeight.scorer(BooleanWeight.java:507)
at org.apache.lucene.search.Weight.bulkScorer(Weight.java:166)
at org.apache.lucene.search.BooleanWeight.bulkScorer(BooleanWeight.java:395)
at org.apache.lucene.search.IndexSearcher.search(IndexSearcher.java:770)
at org.apache.solr.search.SolrIndexSearcher.search(SolrIndexSearcher.java:720)
at org.apache.lucene.search.IndexSearcher.search(IndexSearcher.java:551)
at org.apache.solr.search.SolrIndexSearcher.buildAndRunCollectorChain(SolrIndexSearcher.java:275)
at org.apache.solr.search.SolrIndexSearcher.getDocListNC(SolrIndexSearcher.java:1890)
at org.apache.solr.search.SolrIndexSearcher.getDocListC(SolrIndexSearcher.java:1707)
at org.apache.solr.search.SolrIndexSearcher.search(SolrIndexSearcher.java:710)
at org.apache.solr.handler.component.QueryComponent.doProcessUngroupedSearch(QueryComponent.java:1660)
at org.apache.solr.handler.component.QueryComponent.process(QueryComponent.java:421)
at org.apache.solr.handler.component.SearchHandler.handleRequestBody(SearchHandler.java:425)
at org.apache.solr.handler.RequestHandlerBase.handleRequest(RequestHandlerBase.java:224)
at org.apache.solr.core.SolrCore.execute(SolrCore.java:2893)
at org.apache.solr.util.TestHarness.query(TestHarness.java:348)
at org.apache.solr.util.TestHarness.query(TestHarness.java:328)
at org.apache.solr.SolrTestCaseJ4.assertQ(SolrTestCaseJ4.java:996)
... 49 more
FAILED: org.apache.solr.search.function.TestDenseVectorFunctionQuery.floatFieldVectors_missingFieldValue_shouldReturnSimilarityZero
Error Message:
java.lang.RuntimeException: Exception during query
Stack Trace:
java.lang.RuntimeException: Exception during query
at __randomizedtesting.SeedInfo.seed([C4AC7AAB095B5664:5084310B53A6AF72]:0)
at org.apache.solr.SolrTestCaseJ4.assertQ(SolrTestCaseJ4.java:1024)
at org.apache.solr.SolrTestCaseJ4.assertQ(SolrTestCaseJ4.java:982)
at org.apache.solr.search.function.TestDenseVectorFunctionQuery.floatFieldVectors_missingFieldValue_shouldReturnSimilarityZero(TestDenseVectorFunctionQuery.java:173)
at java.base/jdk.internal.reflect.NativeMethodAccessorImpl.invoke0(Native Method)
at java.base/jdk.internal.reflect.NativeMethodAccessorImpl.invoke(NativeMethodAccessorImpl.java:62)
at java.base/jdk.internal.reflect.DelegatingMethodAccessorImpl.invoke(DelegatingMethodAccessorImpl.java:43)
at java.base/java.lang.reflect.Method.invoke(Method.java:566)
at com.carrotsearch.randomizedtesting.RandomizedRunner.invoke(RandomizedRunner.java:1758)
at com.carrotsearch.randomizedtesting.RandomizedRunner$8.evaluate(RandomizedRunner.java:946)
at com.carrotsearch.randomizedtesting.RandomizedRunner$9.evaluate(RandomizedRunner.java:982)
at com.carrotsearch.randomizedtesting.RandomizedRunner$10.evaluate(RandomizedRunner.java:996)
at com.carrotsearch.randomizedtesting.rules.SystemPropertiesRestoreRule$1.evaluate(SystemPropertiesRestoreRule.java:80)
at org.junit.rules.RunRules.evaluate(RunRules.java:20)
at org.apache.lucene.tests.util.TestRuleSetupTeardownChained$1.evaluate(TestRuleSetupTeardownChained.java:48)
at org.apache.lucene.tests.util.AbstractBeforeAfterRule$1.evaluate(AbstractBeforeAfterRule.java:43)
at org.apache.lucene.tests.util.TestRuleThreadAndTestName$1.evaluate(TestRuleThreadAndTestName.java:45)
at org.apache.lucene.tests.util.TestRuleIgnoreAfterMaxFailures$1.evaluate(TestRuleIgnoreAfterMaxFailures.java:60)
at org.apache.lucene.tests.util.TestRuleMarkFailure$1.evaluate(TestRuleMarkFailure.java:44)
at org.junit.rules.RunRules.evaluate(RunRules.java:20)
at com.carrotsearch.randomizedtesting.rules.StatementAdapter.evaluate(StatementAdapter.java:36)
at com.carrotsearch.randomizedtesting.ThreadLeakControl$StatementRunner.run(ThreadLeakControl.java:390)
at com.carrotsearch.randomizedtesting.ThreadLeakControl.forkTimeoutingTask(ThreadLeakControl.java:843)
at com.carrotsearch.randomizedtesting.ThreadLeakControl$3.evaluate(ThreadLeakControl.java:490)
at com.carrotsearch.randomizedtesting.RandomizedRunner.runSingleTest(RandomizedRunner.java:955)
at com.carrotsearch.randomizedtesting.RandomizedRunner$5.evaluate(RandomizedRunner.java:840)
at com.carrotsearch.randomizedtesting.RandomizedRunner$6.evaluate(RandomizedRunner.java:891)
at com.carrotsearch.randomizedtesting.RandomizedRunner$7.evaluate(RandomizedRunner.java:902)
at com.carrotsearch.randomizedtesting.rules.StatementAdapter.evaluate(StatementAdapter.java:36)
at com.carrotsearch.randomizedtesting.rules.StatementAdapter.evaluate(StatementAdapter.java:36)
at org.apache.lucene.tests.util.AbstractBeforeAfterRule$1.evaluate(AbstractBeforeAfterRule.java:43)
at org.apache.lucene.tests.util.AbstractBeforeAfterRule$1.evaluate(AbstractBeforeAfterRule.java:43)
at com.carrotsearch.randomizedtesting.rules.SystemPropertiesRestoreRule$1.evaluate(SystemPropertiesRestoreRule.java:80)
at org.junit.rules.RunRules.evaluate(RunRules.java:20)
at org.apache.lucene.tests.util.AbstractBeforeAfterRule$1.evaluate(AbstractBeforeAfterRule.java:43)
at com.carrotsearch.randomizedtesting.rules.StatementAdapter.evaluate(StatementAdapter.java:36)
at org.apache.lucene.tests.util.TestRuleStoreClassName$1.evaluate(TestRuleStoreClassName.java:38)
at com.carrotsearch.randomizedtesting.rules.NoShadowingOrOverridesOnMethodsRule$1.evaluate(NoShadowingOrOverridesOnMethodsRule.java:40)
at com.carrotsearch.randomizedtesting.rules.NoShadowingOrOverridesOnMethodsRule$1.evaluate(NoShadowingOrOverridesOnMethodsRule.java:40)
at com.carrotsearch.randomizedtesting.rules.StatementAdapter.evaluate(StatementAdapter.java:36)
at com.carrotsearch.randomizedtesting.rules.StatementAdapter.evaluate(StatementAdapter.java:36)
at org.apache.lucene.tests.util.TestRuleAssertionsRequired$1.evaluate(TestRuleAssertionsRequired.java:53)
at org.apache.lucene.tests.util.AbstractBeforeAfterRule$1.evaluate(AbstractBeforeAfterRule.java:43)
at org.apache.lucene.tests.util.TestRuleMarkFailure$1.evaluate(TestRuleMarkFailure.java:44)
at org.apache.lucene.tests.util.TestRuleIgnoreAfterMaxFailures$1.evaluate(TestRuleIgnoreAfterMaxFailures.java:60)
at org.apache.lucene.tests.util.TestRuleIgnoreTestSuites$1.evaluate(TestRuleIgnoreTestSuites.java:47)
at org.junit.rules.RunRules.evaluate(RunRules.java:20)
at com.carrotsearch.randomizedtesting.rules.StatementAdapter.evaluate(StatementAdapter.java:36)
at com.carrotsearch.randomizedtesting.ThreadLeakControl$StatementRunner.run(ThreadLeakControl.java:390)
at com.carrotsearch.randomizedtesting.ThreadLeakControl.lambda$forkTimeoutingTask$0(ThreadLeakControl.java:850)
at java.base/java.lang.Thread.run(Thread.java:829)
Caused by: java.lang.IllegalArgumentException: no float vector value is indexed for field 'vector2'
at org.apache.lucene.queries.function.valuesource.FloatKnnVectorFieldSource.getValues(FloatKnnVectorFieldSource.java:45)
at org.apache.lucene.queries.function.valuesource.VectorSimilarityFunction.getValues(VectorSimilarityFunction.java:48)
at org.apache.lucene.queries.function.FunctionQuery$AllScorer.<init>(FunctionQuery.java:115)
at org.apache.lucene.queries.function.FunctionQuery$FunctionWeight.scorer(FunctionQuery.java:76)
at org.apache.lucene.search.Weight.scorerSupplier(Weight.java:136)
at org.apache.lucene.search.BooleanWeight.scorerSupplier(BooleanWeight.java:542)
at org.apache.lucene.search.BooleanWeight.scorer(BooleanWeight.java:507)
at org.apache.lucene.search.Weight.bulkScorer(Weight.java:166)
at org.apache.lucene.search.BooleanWeight.bulkScorer(BooleanWeight.java:395)
at org.apache.lucene.search.IndexSearcher.search(IndexSearcher.java:770)
at org.apache.solr.search.SolrIndexSearcher.search(SolrIndexSearcher.java:720)
at org.apache.lucene.search.IndexSearcher.search(IndexSearcher.java:551)
at org.apache.solr.search.SolrIndexSearcher.buildAndRunCollectorChain(SolrIndexSearcher.java:275)
at org.apache.solr.search.SolrIndexSearcher.getDocListNC(SolrIndexSearcher.java:1890)
at org.apache.solr.search.SolrIndexSearcher.getDocListC(SolrIndexSearcher.java:1707)
at org.apache.solr.search.SolrIndexSearcher.search(SolrIndexSearcher.java:710)
at org.apache.solr.handler.component.QueryComponent.doProcessUngroupedSearch(QueryComponent.java:1660)
at org.apache.solr.handler.component.QueryComponent.process(QueryComponent.java:421)
at org.apache.solr.handler.component.SearchHandler.handleRequestBody(SearchHandler.java:425)
at org.apache.solr.handler.RequestHandlerBase.handleRequest(RequestHandlerBase.java:224)
at org.apache.solr.core.SolrCore.execute(SolrCore.java:2893)
at org.apache.solr.util.TestHarness.query(TestHarness.java:348)
at org.apache.solr.util.TestHarness.query(TestHarness.java:328)
at org.apache.solr.SolrTestCaseJ4.assertQ(SolrTestCaseJ4.java:996)
... 49 more
FAILED: org.apache.solr.search.function.TestDenseVectorFunctionQuery.byteFieldVectors_missingFieldValue_shouldReturnSimilarityZero
Error Message:
java.lang.RuntimeException: Exception during query
Stack Trace:
java.lang.RuntimeException: Exception during query
at __randomizedtesting.SeedInfo.seed([C4AC7AAB095B5664:1ACC3888998BB898]:0)
at org.apache.solr.SolrTestCaseJ4.assertQ(SolrTestCaseJ4.java:1024)
at org.apache.solr.SolrTestCaseJ4.assertQ(SolrTestCaseJ4.java:982)
at org.apache.solr.search.function.TestDenseVectorFunctionQuery.byteFieldVectors_missingFieldValue_shouldReturnSimilarityZero(TestDenseVectorFunctionQuery.java:157)
at java.base/jdk.internal.reflect.NativeMethodAccessorImpl.invoke0(Native Method)
at java.base/jdk.internal.reflect.NativeMethodAccessorImpl.invoke(NativeMethodAccessorImpl.java:62)
at java.base/jdk.internal.reflect.DelegatingMethodAccessorImpl.invoke(DelegatingMethodAccessorImpl.java:43)
at java.base/java.lang.reflect.Method.invoke(Method.java:566)
at com.carrotsearch.randomizedtesting.RandomizedRunner.invoke(RandomizedRunner.java:1758)
at com.carrotsearch.randomizedtesting.RandomizedRunner$8.evaluate(RandomizedRunner.java:946)
at com.carrotsearch.randomizedtesting.RandomizedRunner$9.evaluate(RandomizedRunner.java:982)
at com.carrotsearch.randomizedtesting.RandomizedRunner$10.evaluate(RandomizedRunner.java:996)
at com.carrotsearch.randomizedtesting.rules.SystemPropertiesRestoreRule$1.evaluate(SystemPropertiesRestoreRule.java:80)
at org.junit.rules.RunRules.evaluate(RunRules.java:20)
at org.apache.lucene.tests.util.TestRuleSetupTeardownChained$1.evaluate(TestRuleSetupTeardownChained.java:48)
at org.apache.lucene.tests.util.AbstractBeforeAfterRule$1.evaluate(AbstractBeforeAfterRule.java:43)
at org.apache.lucene.tests.util.TestRuleThreadAndTestName$1.evaluate(TestRuleThreadAndTestName.java:45)
at org.apache.lucene.tests.util.TestRuleIgnoreAfterMaxFailures$1.evaluate(TestRuleIgnoreAfterMaxFailures.java:60)
at org.apache.lucene.tests.util.TestRuleMarkFailure$1.evaluate(TestRuleMarkFailure.java:44)
at org.junit.rules.RunRules.evaluate(RunRules.java:20)
at com.carrotsearch.randomizedtesting.rules.StatementAdapter.evaluate(StatementAdapter.java:36)
at com.carrotsearch.randomizedtesting.ThreadLeakControl$StatementRunner.run(ThreadLeakControl.java:390)
at com.carrotsearch.randomizedtesting.ThreadLeakControl.forkTimeoutingTask(ThreadLeakControl.java:843)
at com.carrotsearch.randomizedtesting.ThreadLeakControl$3.evaluate(ThreadLeakControl.java:490)
at com.carrotsearch.randomizedtesting.RandomizedRunner.runSingleTest(RandomizedRunner.java:955)
at com.carrotsearch.randomizedtesting.RandomizedRunner$5.evaluate(RandomizedRunner.java:840)
at com.carrotsearch.randomizedtesting.RandomizedRunner$6.evaluate(RandomizedRunner.java:891)
at com.carrotsearch.randomizedtesting.RandomizedRunner$7.evaluate(RandomizedRunner.java:902)
at com.carrotsearch.randomizedtesting.rules.StatementAdapter.evaluate(StatementAdapter.java:36)
at com.carrotsearch.randomizedtesting.rules.StatementAdapter.evaluate(StatementAdapter.java:36)
at org.apache.lucene.tests.util.AbstractBeforeAfterRule$1.evaluate(AbstractBeforeAfterRule.java:43)
at org.apache.lucene.tests.util.AbstractBeforeAfterRule$1.evaluate(AbstractBeforeAfterRule.java:43)
at com.carrotsearch.randomizedtesting.rules.SystemPropertiesRestoreRule$1.evaluate(SystemPropertiesRestoreRule.java:80)
at org.junit.rules.RunRules.evaluate(RunRules.java:20)
at org.apache.lucene.tests.util.AbstractBeforeAfterRule$1.evaluate(AbstractBeforeAfterRule.java:43)
at com.carrotsearch.randomizedtesting.rules.StatementAdapter.evaluate(StatementAdapter.java:36)
at org.apache.lucene.tests.util.TestRuleStoreClassName$1.evaluate(TestRuleStoreClassName.java:38)
at com.carrotsearch.randomizedtesting.rules.NoShadowingOrOverridesOnMethodsRule$1.evaluate(NoShadowingOrOverridesOnMethodsRule.java:40)
at com.carrotsearch.randomizedtesting.rules.NoShadowingOrOverridesOnMethodsRule$1.evaluate(NoShadowingOrOverridesOnMethodsRule.java:40)
at com.carrotsearch.randomizedtesting.rules.StatementAdapter.evaluate(StatementAdapter.java:36)
at com.carrotsearch.randomizedtesting.rules.StatementAdapter.evaluate(StatementAdapter.java:36)
at org.apache.lucene.tests.util.TestRuleAssertionsRequired$1.evaluate(TestRuleAssertionsRequired.java:53)
at org.apache.lucene.tests.util.AbstractBeforeAfterRule$1.evaluate(AbstractBeforeAfterRule.java:43)
at org.apache.lucene.tests.util.TestRuleMarkFailure$1.evaluate(TestRuleMarkFailure.java:44)
at org.apache.lucene.tests.util.TestRuleIgnoreAfterMaxFailures$1.evaluate(TestRuleIgnoreAfterMaxFailures.java:60)
at org.apache.lucene.tests.util.TestRuleIgnoreTestSuites$1.evaluate(TestRuleIgnoreTestSuites.java:47)
at org.junit.rules.RunRules.evaluate(RunRules.java:20)
at com.carrotsearch.randomizedtesting.rules.StatementAdapter.evaluate(StatementAdapter.java:36)
at com.carrotsearch.randomizedtesting.ThreadLeakControl$StatementRunner.run(ThreadLeakControl.java:390)
at com.carrotsearch.randomizedtesting.ThreadLeakControl.lambda$forkTimeoutingTask$0(ThreadLeakControl.java:850)
at java.base/java.lang.Thread.run(Thread.java:829)
Caused by: java.lang.IllegalArgumentException: no byte vector value is indexed for field 'vector_byte_encoding'
at org.apache.lucene.queries.function.valuesource.ByteKnnVectorFieldSource.getValues(ByteKnnVectorFieldSource.java:45)
at org.apache.lucene.queries.function.valuesource.VectorSimilarityFunction.getValues(VectorSimilarityFunction.java:48)
at org.apache.lucene.queries.function.FunctionQuery$AllScorer.<init>(FunctionQuery.java:115)
at org.apache.lucene.queries.function.FunctionQuery$FunctionWeight.scorer(FunctionQuery.java:76)
at org.apache.lucene.search.Weight.scorerSupplier(Weight.java:136)
at org.apache.lucene.search.BooleanWeight.scorerSupplier(BooleanWeight.java:542)
at org.apache.lucene.search.BooleanWeight.scorer(BooleanWeight.java:507)
at org.apache.lucene.search.Weight.bulkScorer(Weight.java:166)
at org.apache.lucene.search.BooleanWeight.bulkScorer(BooleanWeight.java:395)
at org.apache.lucene.search.IndexSearcher.search(IndexSearcher.java:770)
at org.apache.solr.search.SolrIndexSearcher.search(SolrIndexSearcher.java:720)
at org.apache.lucene.search.IndexSearcher.search(IndexSearcher.java:551)
at org.apache.solr.search.SolrIndexSearcher.buildAndRunCollectorChain(SolrIndexSearcher.java:275)
at org.apache.solr.search.SolrIndexSearcher.getDocListNC(SolrIndexSearcher.java:1890)
at org.apache.solr.search.SolrIndexSearcher.getDocListC(SolrIndexSearcher.java:1707)
at org.apache.solr.search.SolrIndexSearcher.search(SolrIndexSearcher.java:710)
at org.apache.solr.handler.component.QueryComponent.doProcessUngroupedSearch(QueryComponent.java:1660)
at org.apache.solr.handler.component.QueryComponent.process(QueryComponent.java:421)
at org.apache.solr.handler.component.SearchHandler.handleRequestBody(SearchHandler.java:425)
at org.apache.solr.handler.RequestHandlerBase.handleRequest(RequestHandlerBase.java:224)
at org.apache.solr.core.SolrCore.execute(SolrCore.java:2893)
at org.apache.solr.util.TestHarness.query(TestHarness.java:348)
at org.apache.solr.util.TestHarness.query(TestHarness.java:328)
at org.apache.solr.SolrTestCaseJ4.assertQ(SolrTestCaseJ4.java:996)
... 49 more
FAILED: org.apache.solr.search.function.TestDenseVectorFunctionQuery.floatFieldVectors_shouldReturnFloatSimilarity
Error Message:
java.lang.RuntimeException: Exception during query
Stack Trace:
java.lang.RuntimeException: Exception during query
at __randomizedtesting.SeedInfo.seed([C4AC7AAB095B5664:8A1EE5C66B20F640]:0)
at org.apache.solr.SolrTestCaseJ4.assertQ(SolrTestCaseJ4.java:1024)
at org.apache.solr.SolrTestCaseJ4.assertQ(SolrTestCaseJ4.java:982)
at org.apache.solr.search.function.TestDenseVectorFunctionQuery.floatFieldVectors_shouldReturnFloatSimilarity(TestDenseVectorFunctionQuery.java:111)
at java.base/jdk.internal.reflect.NativeMethodAccessorImpl.invoke0(Native Method)
at java.base/jdk.internal.reflect.NativeMethodAccessorImpl.invoke(NativeMethodAccessorImpl.java:62)
at java.base/jdk.internal.reflect.DelegatingMethodAccessorImpl.invoke(DelegatingMethodAccessorImpl.java:43)
at java.base/java.lang.reflect.Method.invoke(Method.java:566)
at com.carrotsearch.randomizedtesting.RandomizedRunner.invoke(RandomizedRunner.java:1758)
at com.carrotsearch.randomizedtesting.RandomizedRunner$8.evaluate(RandomizedRunner.java:946)
at com.carrotsearch.randomizedtesting.RandomizedRunner$9.evaluate(RandomizedRunner.java:982)
at com.carrotsearch.randomizedtesting.RandomizedRunner$10.evaluate(RandomizedRunner.java:996)
at com.carrotsearch.randomizedtesting.rules.SystemPropertiesRestoreRule$1.evaluate(SystemPropertiesRestoreRule.java:80)
at org.junit.rules.RunRules.evaluate(RunRules.java:20)
at org.apache.lucene.tests.util.TestRuleSetupTeardownChained$1.evaluate(TestRuleSetupTeardownChained.java:48)
at org.apache.lucene.tests.util.AbstractBeforeAfterRule$1.evaluate(AbstractBeforeAfterRule.java:43)
at org.apache.lucene.tests.util.TestRuleThreadAndTestName$1.evaluate(TestRuleThreadAndTestName.java:45)
at org.apache.lucene.tests.util.TestRuleIgnoreAfterMaxFailures$1.evaluate(TestRuleIgnoreAfterMaxFailures.java:60)
at org.apache.lucene.tests.util.TestRuleMarkFailure$1.evaluate(TestRuleMarkFailure.java:44)
at org.junit.rules.RunRules.evaluate(RunRules.java:20)
at com.carrotsearch.randomizedtesting.rules.StatementAdapter.evaluate(StatementAdapter.java:36)
at com.carrotsearch.randomizedtesting.ThreadLeakControl$StatementRunner.run(ThreadLeakControl.java:390)
at com.carrotsearch.randomizedtesting.ThreadLeakControl.forkTimeoutingTask(ThreadLeakControl.java:843)
at com.carrotsearch.randomizedtesting.ThreadLeakControl$3.evaluate(ThreadLeakControl.java:490)
at com.carrotsearch.randomizedtesting.RandomizedRunner.runSingleTest(RandomizedRunner.java:955)
at com.carrotsearch.randomizedtesting.RandomizedRunner$5.evaluate(RandomizedRunner.java:840)
at com.carrotsearch.randomizedtesting.RandomizedRunner$6.evaluate(RandomizedRunner.java:891)
at com.carrotsearch.randomizedtesting.RandomizedRunner$7.evaluate(RandomizedRunner.java:902)
at com.carrotsearch.randomizedtesting.rules.StatementAdapter.evaluate(StatementAdapter.java:36)
at com.carrotsearch.randomizedtesting.rules.StatementAdapter.evaluate(StatementAdapter.java:36)
at org.apache.lucene.tests.util.AbstractBeforeAfterRule$1.evaluate(AbstractBeforeAfterRule.java:43)
at org.apache.lucene.tests.util.AbstractBeforeAfterRule$1.evaluate(AbstractBeforeAfterRule.java:43)
at com.carrotsearch.randomizedtesting.rules.SystemPropertiesRestoreRule$1.evaluate(SystemPropertiesRestoreRule.java:80)
at org.junit.rules.RunRules.evaluate(RunRules.java:20)
at org.apache.lucene.tests.util.AbstractBeforeAfterRule$1.evaluate(AbstractBeforeAfterRule.java:43)
at com.carrotsearch.randomizedtesting.rules.StatementAdapter.evaluate(StatementAdapter.java:36)
at org.apache.lucene.tests.util.TestRuleStoreClassName$1.evaluate(TestRuleStoreClassName.java:38)
at com.carrotsearch.randomizedtesting.rules.NoShadowingOrOverridesOnMethodsRule$1.evaluate(NoShadowingOrOverridesOnMethodsRule.java:40)
at com.carrotsearch.randomizedtesting.rules.NoShadowingOrOverridesOnMethodsRule$1.evaluate(NoShadowingOrOverridesOnMethodsRule.java:40)
at com.carrotsearch.randomizedtesting.rules.StatementAdapter.evaluate(StatementAdapter.java:36)
at com.carrotsearch.randomizedtesting.rules.StatementAdapter.evaluate(StatementAdapter.java:36)
at org.apache.lucene.tests.util.TestRuleAssertionsRequired$1.evaluate(TestRuleAssertionsRequired.java:53)
at org.apache.lucene.tests.util.AbstractBeforeAfterRule$1.evaluate(AbstractBeforeAfterRule.java:43)
at org.apache.lucene.tests.util.TestRuleMarkFailure$1.evaluate(TestRuleMarkFailure.java:44)
at org.apache.lucene.tests.util.TestRuleIgnoreAfterMaxFailures$1.evaluate(TestRuleIgnoreAfterMaxFailures.java:60)
at org.apache.lucene.tests.util.TestRuleIgnoreTestSuites$1.evaluate(TestRuleIgnoreTestSuites.java:47)
at org.junit.rules.RunRules.evaluate(RunRules.java:20)
at com.carrotsearch.randomizedtesting.rules.StatementAdapter.evaluate(StatementAdapter.java:36)
at com.carrotsearch.randomizedtesting.ThreadLeakControl$StatementRunner.run(ThreadLeakControl.java:390)
at com.carrotsearch.randomizedtesting.ThreadLeakControl.lambda$forkTimeoutingTask$0(ThreadLeakControl.java:850)
at java.base/java.lang.Thread.run(Thread.java:829)
Caused by: java.lang.IllegalArgumentException: no float vector value is indexed for field 'vector'
at org.apache.lucene.queries.function.valuesource.FloatKnnVectorFieldSource.getValues(FloatKnnVectorFieldSource.java:45)
at org.apache.lucene.queries.function.valuesource.VectorSimilarityFunction.getValues(VectorSimilarityFunction.java:47)
at org.apache.lucene.queries.function.FunctionQuery$AllScorer.<init>(FunctionQuery.java:115)
at org.apache.lucene.queries.function.FunctionQuery$FunctionWeight.scorer(FunctionQuery.java:76)
at org.apache.lucene.search.Weight.scorerSupplier(Weight.java:136)
at org.apache.lucene.search.BooleanWeight.scorerSupplier(BooleanWeight.java:542)
at org.apache.lucene.search.BooleanWeight.scorer(BooleanWeight.java:507)
at org.apache.lucene.search.Weight.bulkScorer(Weight.java:166)
at org.apache.lucene.search.BooleanWeight.bulkScorer(BooleanWeight.java:395)
at org.apache.lucene.search.IndexSearcher.search(IndexSearcher.java:770)
at org.apache.solr.search.SolrIndexSearcher.search(SolrIndexSearcher.java:720)
at org.apache.lucene.search.IndexSearcher.search(IndexSearcher.java:551)
at org.apache.solr.search.SolrIndexSearcher.buildAndRunCollectorChain(SolrIndexSearcher.java:275)
at org.apache.solr.search.SolrIndexSearcher.getDocListNC(SolrIndexSearcher.java:1890)
at org.apache.solr.search.SolrIndexSearcher.getDocListC(SolrIndexSearcher.java:1707)
at org.apache.solr.search.SolrIndexSearcher.search(SolrIndexSearcher.java:710)
at org.apache.solr.handler.component.QueryComponent.doProcessUngroupedSearch(QueryComponent.java:1660)
at org.apache.solr.handler.component.QueryComponent.process(QueryComponent.java:421)
at org.apache.solr.handler.component.SearchHandler.handleRequestBody(SearchHandler.java:425)
at org.apache.solr.handler.RequestHandlerBase.handleRequest(RequestHandlerBase.java:224)
at org.apache.solr.core.SolrCore.execute(SolrCore.java:2893)
at org.apache.solr.util.TestHarness.query(TestHarness.java:348)
at org.apache.solr.util.TestHarness.query(TestHarness.java:328)
at org.apache.solr.SolrTestCaseJ4.assertQ(SolrTestCaseJ4.java:996)
... 49 more
Build Log:
[...truncated 3212 lines...]
# ERROR: Error from server at http://localhost:8983/solr/admin/collections?action=CREATE&name=COLL_NAME&collection.configName=COLL_NAME&numShards=1&nrtReplicas=1&wt=javabin&version=2: org.apache.solr.cluster.placement.PlacementException: Not enough eligible nodes to place 1 replica(s) of type NRT for shard shard1 of collection COLL_NAME. Only able to place 0 replicas.
ok 42 Random placement plugin using ENV in 22934ms
ok 43 post solr log into solr in 9211ms
ok 44 start solr with ssl in 20104ms
ok 45 start solr with ssl and auth in 23295ms
ok 46 SOLR-11740 check 'solr stop' connection in 28180ms
ok 47 status detects locally running solr in 14454ms
ok 48 status does not expose cli parameters to end user in 214ms
ok 49 listing out files in 2194ms
ok 50 copying files around in 6640ms
ok 51 upconfig in 2691ms
> Task :solr:packaging:integrationTests FAILED
ERROR: The following test(s) have failed:
- org.apache.solr.search.function.TestDenseVectorFunctionQuery.byteFieldVectors_shouldReturnFloatSimilarity (:solr:core)
Test output: /tmp/src/solr/solr/core/build/test-results/test/outputs/OUTPUT-org.apache.solr.search.function.TestDenseVectorFunctionQuery.txt
Reproduce with: gradlew :solr:core:test --tests "org.apache.solr.search.function.TestDenseVectorFunctionQuery.byteFieldVectors_shouldReturnFloatSimilarity" -Ptests.jvms=96 "-Ptests.jvmargs=-XX:TieredStopAtLevel=1 -XX:+UseParallelGC -XX:ActiveProcessorCount=1 -XX:ReservedCodeCacheSize=120m" -Ptests.seed=C4AC7AAB095B5664 -Ptests.file.encoding=ISO-8859-1
- org.apache.solr.search.function.TestDenseVectorFunctionQuery.resultOfVectorFunction_canBeUsedAsFloatFunctionInput (:solr:core)
Test output: /tmp/src/solr/solr/core/build/test-results/test/outputs/OUTPUT-org.apache.solr.search.function.TestDenseVectorFunctionQuery.txt
Reproduce with: gradlew :solr:core:test --tests "org.apache.solr.search.function.TestDenseVectorFunctionQuery.resultOfVectorFunction_canBeUsedAsFloatFunctionInput" -Ptests.jvms=96 "-Ptests.jvmargs=-XX:TieredStopAtLevel=1 -XX:+UseParallelGC -XX:ActiveProcessorCount=1 -XX:ReservedCodeCacheSize=120m" -Ptests.seed=C4AC7AAB095B5664 -Ptests.file.encoding=ISO-8859-1
- org.apache.solr.search.function.TestDenseVectorFunctionQuery.floatFieldVectors_missingFieldValue_shouldReturnSimilarityZero (:solr:core)
Test output: /tmp/src/solr/solr/core/build/test-results/test/outputs/OUTPUT-org.apache.solr.search.function.TestDenseVectorFunctionQuery.txt
Reproduce with: gradlew :solr:core:test --tests "org.apache.solr.search.function.TestDenseVectorFunctionQuery.floatFieldVectors_missingFieldValue_shouldReturnSimilarityZero" -Ptests.jvms=96 "-Ptests.jvmargs=-XX:TieredStopAtLevel=1 -XX:+UseParallelGC -XX:ActiveProcessorCount=1 -XX:ReservedCodeCacheSize=120m" -Ptests.seed=C4AC7AAB095B5664 -Ptests.file.encoding=ISO-8859-1
- org.apache.solr.search.function.TestDenseVectorFunctionQuery.byteFieldVectors_missingFieldValue_shouldReturnSimilarityZero (:solr:core)
Test output: /tmp/src/solr/solr/core/build/test-results/test/outputs/OUTPUT-org.apache.solr.search.function.TestDenseVectorFunctionQuery.txt
Reproduce with: gradlew :solr:core:test --tests "org.apache.solr.search.function.TestDenseVectorFunctionQuery.byteFieldVectors_missingFieldValue_shouldReturnSimilarityZero" -Ptests.jvms=96 "-Ptests.jvmargs=-XX:TieredStopAtLevel=1 -XX:+UseParallelGC -XX:ActiveProcessorCount=1 -XX:ReservedCodeCacheSize=120m" -Ptests.seed=C4AC7AAB095B5664 -Ptests.file.encoding=ISO-8859-1
- org.apache.solr.search.function.TestDenseVectorFunctionQuery.floatFieldVectors_shouldReturnFloatSimilarity (:solr:core)
Test output: /tmp/src/solr/solr/core/build/test-results/test/outputs/OUTPUT-org.apache.solr.search.function.TestDenseVectorFunctionQuery.txt
Reproduce with: gradlew :solr:core:test --tests "org.apache.solr.search.function.TestDenseVectorFunctionQuery.floatFieldVectors_shouldReturnFloatSimilarity" -Ptests.jvms=96 "-Ptests.jvmargs=-XX:TieredStopAtLevel=1 -XX:+UseParallelGC -XX:ActiveProcessorCount=1 -XX:ReservedCodeCacheSize=120m" -Ptests.seed=C4AC7AAB095B5664 -Ptests.file.encoding=ISO-8859-1
FAILURE: Build completed with 2 failures.
1: Task failed with an exception.
-----------
* What went wrong:
Execution failed for task ':solr:core:test'.
> There were failing tests. See the results at: file:///tmp/src/solr/solr/core/build/test-results/test/
* Try:
> Run with --stacktrace option to get the stack trace.
> Run with --info or --debug option to get more log output.
> Run with --scan to get full insights.
==============================================================================
2: Task failed with an exception.
-----------
* Where:
Build file '/tmp/src/solr/solr/packaging/build.gradle' line: 285
* What went wrong:
Execution failed for task ':solr:packaging:integrationTests'.
> Process 'command '/tmp/src/solr/.gradle/node/packaging/node_modules/bats/bin/bats'' finished with non-zero exit value 1
* Try:
> Run with --stacktrace option to get the stack trace.
> Run with --info or --debug option to get more log output.
> Run with --scan to get full insights.
==============================================================================
* Get more help at https://help.gradle.org
BUILD FAILED in 13m 19s
625 actionable tasks: 609 executed, 16 up-to-date
[0m[?12l[?25h
------------------------------------------------------------------------
Build Failed: returned 1
Total time: 13m43.5s
------------------------------------------------------------------------
+ status=1
+ ./crave pull '**/build/**/test/TEST-*.xml' '**/*.events' 'heapdumps/**' '**/hs_err_pid*'
Error: rsync: [sender] change_dir "/tmp/src/solr/heapdumps" failed: No such file or directory (2)
rsync error: some files/attrs were not transferred (see previous errors) (code 23) at main.c(1675) [Receiver=3.1.2]
rsync: [Receiver] write error: Broken pipe (32)
+ exit 1
Build step 'Execute shell' marked build as failure
Archiving artifacts
Recording test results
[Checks API] No suitable checks publisher found.
Email was triggered for: Failure - Any
Sending email for trigger: Failure - Any
[JENKINS] Solr » Solr-Check-9.x - Build # 4964 - Still Failing!
Posted by Apache Jenkins Server <je...@builds.apache.org>.
Build: https://ci-builds.apache.org/job/Solr/job/Solr-Check-9.x/4964/
All tests passed
Build Log:
[...truncated 1252 lines...]
# ERROR: Error from server at http://localhost:8983/solr/admin/collections?action=CREATE&name=COLL_NAME&collection.configName=COLL_NAME&numShards=1&nrtReplicas=1&wt=javabin&version=2: org.apache.solr.cluster.placement.PlacementException: Not enough eligible nodes to place 1 replica(s) of type NRT for shard shard1 of collection COLL_NAME. Only able to place 0 replicas.
ok 42 Random placement plugin using ENV in 22815ms
ok 43 post solr log into solr in 9493ms
ok 44 start solr with ssl in 20344ms
ok 45 start solr with ssl and auth in 23232ms
ok 46 SOLR-11740 check 'solr stop' connection in 28451ms
ok 47 status detects locally running solr in 14434ms
ok 48 status does not expose cli parameters to end user in 220ms
ok 49 listing out files in 2199ms
ok 50 copying files around in 6619ms
ok 51 upconfig in 2633ms
> Task :solr:packaging:integrationTests FAILED
FAILURE: Build failed with an exception.
* Where:
Build file '/tmp/src/solr/solr/packaging/build.gradle' line: 285
* What went wrong:
Execution failed for task ':solr:packaging:integrationTests'.
> Process 'command '/tmp/src/solr/.gradle/node/packaging/node_modules/bats/bin/bats'' finished with non-zero exit value 1
* Try:
> Run with --stacktrace option to get the stack trace.
> Run with --info or --debug option to get more log output.
> Run with --scan to get full insights.
* Get more help at https://help.gradle.org
BUILD FAILED in 15m 58s
644 actionable tasks: 628 executed, 16 up-to-date
[0m[?12l[?25h
------------------------------------------------------------------------
Build Failed: returned 1
Total time: 16m23.5s
------------------------------------------------------------------------
+ status=1
+ ./crave pull '**/build/**/test/TEST-*.xml' '**/*.events' 'heapdumps/**' '**/hs_err_pid*'
Error: rsync: [sender] change_dir "/tmp/src/solr/heapdumps" failed: No such file or directory (2)
rsync error: some files/attrs were not transferred (see previous errors) (code 23) at main.c(1675) [Receiver=3.1.2]
rsync: [Receiver] write error: Broken pipe (32)
+ exit 1
Build step 'Execute shell' marked build as failure
Archiving artifacts
Recording test results
[Checks API] No suitable checks publisher found.
Email was triggered for: Failure - Any
Sending email for trigger: Failure - Any
[JENKINS] Solr » Solr-Check-9.x - Build # 4963 - Still Failing!
Posted by Apache Jenkins Server <je...@builds.apache.org>.
Build: https://ci-builds.apache.org/job/Solr/job/Solr-Check-9.x/4963/
All tests passed
Build Log:
[...truncated 1258 lines...]
# ERROR: Error from server at http://localhost:8983/solr/admin/collections?action=CREATE&name=COLL_NAME&collection.configName=COLL_NAME&numShards=1&nrtReplicas=1&wt=javabin&version=2: org.apache.solr.cluster.placement.PlacementException: Not enough eligible nodes to place 1 replica(s) of type NRT for shard shard1 of collection COLL_NAME. Only able to place 0 replicas.
ok 42 Random placement plugin using ENV in 22606ms
ok 43 post solr log into solr in 9045ms
ok 44 start solr with ssl in 19762ms
ok 45 start solr with ssl and auth in 22215ms
ok 46 SOLR-11740 check 'solr stop' connection in 28467ms
ok 47 status detects locally running solr in 14379ms
ok 48 status does not expose cli parameters to end user in 217ms
ok 49 listing out files in 2175ms
ok 50 copying files around in 6615ms
ok 51 upconfig in 2647ms
> Task :solr:packaging:integrationTests FAILED
FAILURE: Build failed with an exception.
* Where:
Build file '/tmp/src/solr/solr/packaging/build.gradle' line: 285
* What went wrong:
Execution failed for task ':solr:packaging:integrationTests'.
> Process 'command '/tmp/src/solr/.gradle/node/packaging/node_modules/bats/bin/bats'' finished with non-zero exit value 1
* Try:
> Run with --stacktrace option to get the stack trace.
> Run with --info or --debug option to get more log output.
> Run with --scan to get full insights.
* Get more help at https://help.gradle.org
BUILD FAILED in 15m 58s
644 actionable tasks: 628 executed, 16 up-to-date
[0m[?12l[?25h
------------------------------------------------------------------------
Build Failed: returned 1
Total time: 16m24.5s
------------------------------------------------------------------------
+ status=1
+ ./crave pull '**/build/**/test/TEST-*.xml' '**/*.events' 'heapdumps/**' '**/hs_err_pid*'
Error: rsync: [sender] change_dir "/tmp/src/solr/heapdumps" failed: No such file or directory (2)
rsync error: some files/attrs were not transferred (see previous errors) (code 23) at main.c(1675) [Receiver=3.1.2]
rsync: [Receiver] write error: Broken pipe (32)
+ exit 1
Build step 'Execute shell' marked build as failure
Archiving artifacts
Recording test results
[Checks API] No suitable checks publisher found.
Email was triggered for: Failure - Any
Sending email for trigger: Failure - Any
[JENKINS] Solr » Solr-Check-9.x - Build # 4962 - Still Failing!
Posted by Apache Jenkins Server <je...@builds.apache.org>.
Build: https://ci-builds.apache.org/job/Solr/job/Solr-Check-9.x/4962/
All tests passed
Build Log:
[...truncated 1251 lines...]
# ERROR: Error from server at http://localhost:8983/solr/admin/collections?action=CREATE&name=COLL_NAME&collection.configName=COLL_NAME&numShards=1&nrtReplicas=1&wt=javabin&version=2: org.apache.solr.cluster.placement.PlacementException: Not enough eligible nodes to place 1 replica(s) of type NRT for shard shard1 of collection COLL_NAME. Only able to place 0 replicas.
ok 42 Random placement plugin using ENV in 22160ms
ok 43 post solr log into solr in 9344ms
ok 44 start solr with ssl in 20097ms
ok 45 start solr with ssl and auth in 22378ms
ok 46 SOLR-11740 check 'solr stop' connection in 28093ms
ok 47 status detects locally running solr in 14645ms
ok 48 status does not expose cli parameters to end user in 214ms
ok 49 listing out files in 2199ms
ok 50 copying files around in 6625ms
ok 51 upconfig in 2635ms
> Task :solr:packaging:integrationTests FAILED
FAILURE: Build failed with an exception.
* Where:
Build file '/tmp/src/solr/solr/packaging/build.gradle' line: 285
* What went wrong:
Execution failed for task ':solr:packaging:integrationTests'.
> Process 'command '/tmp/src/solr/.gradle/node/packaging/node_modules/bats/bin/bats'' finished with non-zero exit value 1
* Try:
> Run with --stacktrace option to get the stack trace.
> Run with --info or --debug option to get more log output.
> Run with --scan to get full insights.
* Get more help at https://help.gradle.org
BUILD FAILED in 15m 54s
644 actionable tasks: 628 executed, 16 up-to-date
[0m[?12l[?25h
------------------------------------------------------------------------
Build Failed: returned 1
Total time: 16m21.5s
------------------------------------------------------------------------
+ status=1
+ ./crave pull '**/build/**/test/TEST-*.xml' '**/*.events' 'heapdumps/**' '**/hs_err_pid*'
Error: rsync: [sender] change_dir "/tmp/src/solr/heapdumps" failed: No such file or directory (2)
rsync error: some files/attrs were not transferred (see previous errors) (code 23) at main.c(1684) [Receiver=3.1.3]
rsync: [Receiver] write error: Broken pipe (32)
+ exit 1
Build step 'Execute shell' marked build as failure
Archiving artifacts
Recording test results
[Checks API] No suitable checks publisher found.
Email was triggered for: Failure - Any
Sending email for trigger: Failure - Any
[JENKINS] Solr » Solr-Check-9.x - Build # 4961 - Still Failing!
Posted by Apache Jenkins Server <je...@builds.apache.org>.
Build: https://ci-builds.apache.org/job/Solr/job/Solr-Check-9.x/4961/
1 tests failed.
FAILED: org.apache.solr.cloud.ReindexCollectionTest.testAbort
Error Message:
java.lang.AssertionError: {responseHeader={status=0, QTime=6}, status={state=running, msg=found [e2d24d76-a970-4ef1-bc01-b0cfd60b4760] in running tasks}}
Stack Trace:
java.lang.AssertionError: {responseHeader={status=0, QTime=6}, status={state=running, msg=found [e2d24d76-a970-4ef1-bc01-b0cfd60b4760] in running tasks}}
at __randomizedtesting.SeedInfo.seed([49407C1A44F3BDB2:2F23CB8D30292FCB]:0)
at org.junit.Assert.fail(Assert.java:89)
at org.junit.Assert.assertTrue(Assert.java:42)
at org.junit.Assert.assertNotNull(Assert.java:713)
at org.apache.solr.cloud.ReindexCollectionTest.testAbort(ReindexCollectionTest.java:425)
at java.base/jdk.internal.reflect.NativeMethodAccessorImpl.invoke0(Native Method)
at java.base/jdk.internal.reflect.NativeMethodAccessorImpl.invoke(NativeMethodAccessorImpl.java:62)
at java.base/jdk.internal.reflect.DelegatingMethodAccessorImpl.invoke(DelegatingMethodAccessorImpl.java:43)
at java.base/java.lang.reflect.Method.invoke(Method.java:566)
at com.carrotsearch.randomizedtesting.RandomizedRunner.invoke(RandomizedRunner.java:1758)
at com.carrotsearch.randomizedtesting.RandomizedRunner$8.evaluate(RandomizedRunner.java:946)
at com.carrotsearch.randomizedtesting.RandomizedRunner$9.evaluate(RandomizedRunner.java:982)
at com.carrotsearch.randomizedtesting.RandomizedRunner$10.evaluate(RandomizedRunner.java:996)
at com.carrotsearch.randomizedtesting.rules.SystemPropertiesRestoreRule$1.evaluate(SystemPropertiesRestoreRule.java:80)
at org.junit.rules.RunRules.evaluate(RunRules.java:20)
at org.apache.lucene.tests.util.TestRuleSetupTeardownChained$1.evaluate(TestRuleSetupTeardownChained.java:48)
at org.apache.lucene.tests.util.AbstractBeforeAfterRule$1.evaluate(AbstractBeforeAfterRule.java:43)
at org.apache.lucene.tests.util.TestRuleThreadAndTestName$1.evaluate(TestRuleThreadAndTestName.java:45)
at org.apache.lucene.tests.util.TestRuleIgnoreAfterMaxFailures$1.evaluate(TestRuleIgnoreAfterMaxFailures.java:60)
at org.apache.lucene.tests.util.TestRuleMarkFailure$1.evaluate(TestRuleMarkFailure.java:44)
at org.junit.rules.RunRules.evaluate(RunRules.java:20)
at com.carrotsearch.randomizedtesting.rules.StatementAdapter.evaluate(StatementAdapter.java:36)
at com.carrotsearch.randomizedtesting.ThreadLeakControl$StatementRunner.run(ThreadLeakControl.java:390)
at com.carrotsearch.randomizedtesting.ThreadLeakControl.forkTimeoutingTask(ThreadLeakControl.java:843)
at com.carrotsearch.randomizedtesting.ThreadLeakControl$3.evaluate(ThreadLeakControl.java:490)
at com.carrotsearch.randomizedtesting.RandomizedRunner.runSingleTest(RandomizedRunner.java:955)
at com.carrotsearch.randomizedtesting.RandomizedRunner$5.evaluate(RandomizedRunner.java:840)
at com.carrotsearch.randomizedtesting.RandomizedRunner$6.evaluate(RandomizedRunner.java:891)
at com.carrotsearch.randomizedtesting.RandomizedRunner$7.evaluate(RandomizedRunner.java:902)
at com.carrotsearch.randomizedtesting.rules.StatementAdapter.evaluate(StatementAdapter.java:36)
at com.carrotsearch.randomizedtesting.rules.StatementAdapter.evaluate(StatementAdapter.java:36)
at org.apache.lucene.tests.util.AbstractBeforeAfterRule$1.evaluate(AbstractBeforeAfterRule.java:43)
at org.apache.lucene.tests.util.AbstractBeforeAfterRule$1.evaluate(AbstractBeforeAfterRule.java:43)
at com.carrotsearch.randomizedtesting.rules.SystemPropertiesRestoreRule$1.evaluate(SystemPropertiesRestoreRule.java:80)
at org.junit.rules.RunRules.evaluate(RunRules.java:20)
at org.apache.lucene.tests.util.AbstractBeforeAfterRule$1.evaluate(AbstractBeforeAfterRule.java:43)
at com.carrotsearch.randomizedtesting.rules.StatementAdapter.evaluate(StatementAdapter.java:36)
at org.apache.lucene.tests.util.TestRuleStoreClassName$1.evaluate(TestRuleStoreClassName.java:38)
at com.carrotsearch.randomizedtesting.rules.NoShadowingOrOverridesOnMethodsRule$1.evaluate(NoShadowingOrOverridesOnMethodsRule.java:40)
at com.carrotsearch.randomizedtesting.rules.NoShadowingOrOverridesOnMethodsRule$1.evaluate(NoShadowingOrOverridesOnMethodsRule.java:40)
at com.carrotsearch.randomizedtesting.rules.StatementAdapter.evaluate(StatementAdapter.java:36)
at com.carrotsearch.randomizedtesting.rules.StatementAdapter.evaluate(StatementAdapter.java:36)
at org.apache.lucene.tests.util.TestRuleAssertionsRequired$1.evaluate(TestRuleAssertionsRequired.java:53)
at org.apache.lucene.tests.util.AbstractBeforeAfterRule$1.evaluate(AbstractBeforeAfterRule.java:43)
at org.apache.lucene.tests.util.TestRuleMarkFailure$1.evaluate(TestRuleMarkFailure.java:44)
at org.apache.lucene.tests.util.TestRuleIgnoreAfterMaxFailures$1.evaluate(TestRuleIgnoreAfterMaxFailures.java:60)
at org.apache.lucene.tests.util.TestRuleIgnoreTestSuites$1.evaluate(TestRuleIgnoreTestSuites.java:47)
at org.junit.rules.RunRules.evaluate(RunRules.java:20)
at com.carrotsearch.randomizedtesting.rules.StatementAdapter.evaluate(StatementAdapter.java:36)
at com.carrotsearch.randomizedtesting.ThreadLeakControl$StatementRunner.run(ThreadLeakControl.java:390)
at com.carrotsearch.randomizedtesting.ThreadLeakControl.lambda$forkTimeoutingTask$0(ThreadLeakControl.java:850)
at java.base/java.lang.Thread.run(Thread.java:829)
Build Log:
[...truncated 6575 lines...]
# ERROR: Error from server at http://localhost:8983/solr/admin/collections?action=CREATE&name=COLL_NAME&collection.configName=COLL_NAME&numShards=1&nrtReplicas=1&wt=javabin&version=2: org.apache.solr.cluster.placement.PlacementException: Not enough eligible nodes to place 1 replica(s) of type NRT for shard shard1 of collection COLL_NAME. Only able to place 0 replicas.
ok 42 Random placement plugin using ENV in 22683ms
ok 43 post solr log into solr in 9697ms
ok 44 start solr with ssl in 20156ms
ok 45 start solr with ssl and auth in 22392ms
ok 46 SOLR-11740 check 'solr stop' connection in 28436ms
ok 47 status detects locally running solr in 14685ms
ok 48 status does not expose cli parameters to end user in 213ms
ok 49 listing out files in 2184ms
ok 50 copying files around in 6554ms
ok 51 upconfig in 2650ms
> Task :solr:packaging:integrationTests FAILED
ERROR: The following test(s) have failed:
- org.apache.solr.cloud.ReindexCollectionTest.testAbort (:solr:core)
Test output: /tmp/src/solr/solr/core/build/test-results/test/outputs/OUTPUT-org.apache.solr.cloud.ReindexCollectionTest.txt
Reproduce with: gradlew :solr:core:test --tests "org.apache.solr.cloud.ReindexCollectionTest.testAbort" -Ptests.jvms=96 "-Ptests.jvmargs=-XX:TieredStopAtLevel=1 -XX:+UseParallelGC -XX:ActiveProcessorCount=1 -XX:ReservedCodeCacheSize=120m" -Ptests.seed=49407C1A44F3BDB2 -Ptests.file.encoding=US-ASCII
FAILURE: Build completed with 2 failures.
1: Task failed with an exception.
-----------
* What went wrong:
Execution failed for task ':solr:core:test'.
> There were failing tests. See the results at: file:///tmp/src/solr/solr/core/build/test-results/test/
* Try:
> Run with --stacktrace option to get the stack trace.
> Run with --info or --debug option to get more log output.
> Run with --scan to get full insights.
==============================================================================
2: Task failed with an exception.
-----------
* Where:
Build file '/tmp/src/solr/solr/packaging/build.gradle' line: 285
* What went wrong:
Execution failed for task ':solr:packaging:integrationTests'.
> Process 'command '/tmp/src/solr/.gradle/node/packaging/node_modules/bats/bin/bats'' finished with non-zero exit value 1
* Try:
> Run with --stacktrace option to get the stack trace.
> Run with --info or --debug option to get more log output.
> Run with --scan to get full insights.
==============================================================================
* Get more help at https://help.gradle.org
BUILD FAILED in 16m 4s
625 actionable tasks: 609 executed, 16 up-to-date
[0m[?12l[?25h
------------------------------------------------------------------------
Build Failed: returned 1
Total time: 16m30.5s
------------------------------------------------------------------------
+ status=1
+ ./crave pull '**/build/**/test/TEST-*.xml' '**/*.events' 'heapdumps/**' '**/hs_err_pid*'
Error: rsync: [sender] change_dir "/tmp/src/solr/heapdumps" failed: No such file or directory (2)
rsync error: some files/attrs were not transferred (see previous errors) (code 23) at main.c(1675) [Receiver=3.1.2]
rsync: [Receiver] write error: Broken pipe (32)
+ exit 1
Build step 'Execute shell' marked build as failure
Archiving artifacts
Recording test results
[Checks API] No suitable checks publisher found.
Email was triggered for: Failure - Any
Sending email for trigger: Failure - Any
[JENKINS] Solr » Solr-Check-9.x - Build # 4960 - Still Failing!
Posted by Apache Jenkins Server <je...@builds.apache.org>.
Build: https://ci-builds.apache.org/job/Solr/job/Solr-Check-9.x/4960/
All tests passed
Build Log:
[...truncated 1255 lines...]
# ERROR: Error from server at http://localhost:8983/solr/admin/collections?action=CREATE&name=COLL_NAME&collection.configName=COLL_NAME&numShards=1&nrtReplicas=1&wt=javabin&version=2: org.apache.solr.cluster.placement.PlacementException: Not enough eligible nodes to place 1 replica(s) of type NRT for shard shard1 of collection COLL_NAME. Only able to place 0 replicas.
ok 42 Random placement plugin using ENV in 22749ms
ok 43 post solr log into solr in 9077ms
ok 44 start solr with ssl in 19903ms
ok 45 start solr with ssl and auth in 22821ms
ok 46 SOLR-11740 check 'solr stop' connection in 28124ms
ok 47 status detects locally running solr in 14356ms
ok 48 status does not expose cli parameters to end user in 214ms
ok 49 listing out files in 2176ms
ok 50 copying files around in 6553ms
ok 51 upconfig in 2653ms
> Task :solr:packaging:integrationTests FAILED
FAILURE: Build failed with an exception.
* Where:
Build file '/tmp/src/solr/solr/packaging/build.gradle' line: 285
* What went wrong:
Execution failed for task ':solr:packaging:integrationTests'.
> Process 'command '/tmp/src/solr/.gradle/node/packaging/node_modules/bats/bin/bats'' finished with non-zero exit value 1
* Try:
> Run with --stacktrace option to get the stack trace.
> Run with --info or --debug option to get more log output.
> Run with --scan to get full insights.
* Get more help at https://help.gradle.org
BUILD FAILED in 13m 6s
644 actionable tasks: 628 executed, 16 up-to-date
[0m[?12l[?25h
------------------------------------------------------------------------
Build Failed: returned 1
Total time: 13m30s
------------------------------------------------------------------------
+ status=1
+ ./crave pull '**/build/**/test/TEST-*.xml' '**/*.events' 'heapdumps/**' '**/hs_err_pid*'
Error: rsync: [sender] change_dir "/tmp/src/solr/heapdumps" failed: No such file or directory (2)
rsync error: some files/attrs were not transferred (see previous errors) (code 23) at main.c(1684) [Receiver=3.1.3]
rsync: [Receiver] write error: Broken pipe (32)
+ exit 1
Build step 'Execute shell' marked build as failure
Archiving artifacts
Recording test results
[Checks API] No suitable checks publisher found.
Email was triggered for: Failure - Any
Sending email for trigger: Failure - Any
[JENKINS] Solr » Solr-Check-9.x - Build # 4959 - Still Failing!
Posted by Apache Jenkins Server <je...@builds.apache.org>.
Build: https://ci-builds.apache.org/job/Solr/job/Solr-Check-9.x/4959/
All tests passed
Build Log:
[...truncated 1264 lines...]
# ERROR: Error from server at http://localhost:8983/solr/admin/collections?action=CREATE&name=COLL_NAME&collection.configName=COLL_NAME&numShards=1&nrtReplicas=1&wt=javabin&version=2: org.apache.solr.cluster.placement.PlacementException: Not enough eligible nodes to place 1 replica(s) of type NRT for shard shard1 of collection COLL_NAME. Only able to place 0 replicas.
ok 42 Random placement plugin using ENV in 22852ms
ok 43 post solr log into solr in 9220ms
ok 44 start solr with ssl in 20177ms
ok 45 start solr with ssl and auth in 23189ms
ok 46 SOLR-11740 check 'solr stop' connection in 28198ms
ok 47 status detects locally running solr in 14450ms
ok 48 status does not expose cli parameters to end user in 215ms
ok 49 listing out files in 2181ms
ok 50 copying files around in 6638ms
ok 51 upconfig in 2662ms
> Task :solr:packaging:integrationTests FAILED
FAILURE: Build failed with an exception.
* Where:
Build file '/tmp/src/solr/solr/packaging/build.gradle' line: 285
* What went wrong:
Execution failed for task ':solr:packaging:integrationTests'.
> Process 'command '/tmp/src/solr/.gradle/node/packaging/node_modules/bats/bin/bats'' finished with non-zero exit value 1
* Try:
> Run with --stacktrace option to get the stack trace.
> Run with --info or --debug option to get more log output.
> Run with --scan to get full insights.
* Get more help at https://help.gradle.org
BUILD FAILED in 13m 9s
644 actionable tasks: 628 executed, 16 up-to-date
[0m[?12l[?25h
------------------------------------------------------------------------
Build Failed: returned 1
Total time: 13m34.5s
------------------------------------------------------------------------
+ status=1
+ ./crave pull '**/build/**/test/TEST-*.xml' '**/*.events' 'heapdumps/**' '**/hs_err_pid*'
Error: rsync: [sender] change_dir "/tmp/src/solr/heapdumps" failed: No such file or directory (2)
rsync error: some files/attrs were not transferred (see previous errors) (code 23) at main.c(1675) [Receiver=3.1.2]
rsync: [Receiver] write error: Broken pipe (32)
+ exit 1
Build step 'Execute shell' marked build as failure
Archiving artifacts
Recording test results
[Checks API] No suitable checks publisher found.
Email was triggered for: Failure - Any
Sending email for trigger: Failure - Any
[JENKINS] Solr » Solr-Check-9.x - Build # 4958 - Still Failing!
Posted by Apache Jenkins Server <je...@builds.apache.org>.
Build: https://ci-builds.apache.org/job/Solr/job/Solr-Check-9.x/4958/
All tests passed
Build Log:
[...truncated 1262 lines...]
# ERROR: Error from server at http://localhost:8983/solr/admin/collections?action=CREATE&name=COLL_NAME&collection.configName=COLL_NAME&numShards=1&nrtReplicas=1&wt=javabin&version=2: org.apache.solr.cluster.placement.PlacementException: Not enough eligible nodes to place 1 replica(s) of type NRT for shard shard1 of collection COLL_NAME. Only able to place 0 replicas.
ok 42 Random placement plugin using ENV in 22465ms
ok 43 post solr log into solr in 9076ms
ok 44 start solr with ssl in 20082ms
ok 45 start solr with ssl and auth in 22675ms
ok 46 SOLR-11740 check 'solr stop' connection in 28747ms
ok 47 status detects locally running solr in 14451ms
ok 48 status does not expose cli parameters to end user in 216ms
ok 49 listing out files in 2204ms
ok 50 copying files around in 6582ms
ok 51 upconfig in 2634ms
> Task :solr:packaging:integrationTests FAILED
FAILURE: Build failed with an exception.
* Where:
Build file '/tmp/src/solr/solr/packaging/build.gradle' line: 285
* What went wrong:
Execution failed for task ':solr:packaging:integrationTests'.
> Process 'command '/tmp/src/solr/.gradle/node/packaging/node_modules/bats/bin/bats'' finished with non-zero exit value 1
* Try:
> Run with --stacktrace option to get the stack trace.
> Run with --info or --debug option to get more log output.
> Run with --scan to get full insights.
* Get more help at https://help.gradle.org
BUILD FAILED in 13m 7s
644 actionable tasks: 628 executed, 16 up-to-date
[0m[?12l[?25h
------------------------------------------------------------------------
Build Failed: returned 1
Total time: 13m33.5s
------------------------------------------------------------------------
+ status=1
+ ./crave pull '**/build/**/test/TEST-*.xml' '**/*.events' 'heapdumps/**' '**/hs_err_pid*'
Error: rsync: [sender] change_dir "/tmp/src/solr/heapdumps" failed: No such file or directory (2)
rsync error: some files/attrs were not transferred (see previous errors) (code 23) at main.c(1684) [Receiver=3.1.3]
rsync: [Receiver] write error: Broken pipe (32)
+ exit 1
Build step 'Execute shell' marked build as failure
Archiving artifacts
Recording test results
[Checks API] No suitable checks publisher found.
Email was triggered for: Failure - Any
Sending email for trigger: Failure - Any
[JENKINS] Solr » Solr-Check-9.x - Build # 4957 - Still Failing!
Posted by Apache Jenkins Server <je...@builds.apache.org>.
Build: https://ci-builds.apache.org/job/Solr/job/Solr-Check-9.x/4957/
All tests passed
Build Log:
[...truncated 1251 lines...]
# ERROR: Error from server at http://localhost:8983/solr/admin/collections?action=CREATE&name=COLL_NAME&collection.configName=COLL_NAME&numShards=1&nrtReplicas=1&wt=javabin&version=2: org.apache.solr.cluster.placement.PlacementException: Not enough eligible nodes to place 1 replica(s) of type NRT for shard shard1 of collection COLL_NAME. Only able to place 0 replicas.
ok 42 Random placement plugin using ENV in 22311ms
ok 43 post solr log into solr in 8823ms
ok 44 start solr with ssl in 20175ms
ok 45 start solr with ssl and auth in 23118ms
ok 46 SOLR-11740 check 'solr stop' connection in 28125ms
ok 47 status detects locally running solr in 14374ms
ok 48 status does not expose cli parameters to end user in 212ms
ok 49 listing out files in 2176ms
ok 50 copying files around in 6561ms
ok 51 upconfig in 2648ms
> Task :solr:packaging:integrationTests FAILED
FAILURE: Build failed with an exception.
* Where:
Build file '/tmp/src/solr/solr/packaging/build.gradle' line: 285
* What went wrong:
Execution failed for task ':solr:packaging:integrationTests'.
> Process 'command '/tmp/src/solr/.gradle/node/packaging/node_modules/bats/bin/bats'' finished with non-zero exit value 1
* Try:
> Run with --stacktrace option to get the stack trace.
> Run with --info or --debug option to get more log output.
> Run with --scan to get full insights.
* Get more help at https://help.gradle.org
BUILD FAILED in 15m 52s
644 actionable tasks: 628 executed, 16 up-to-date
[0m[?12l[?25h
------------------------------------------------------------------------
Build Failed: returned 1
Total time: 16m16.5s
------------------------------------------------------------------------
+ status=1
+ ./crave pull '**/build/**/test/TEST-*.xml' '**/*.events' 'heapdumps/**' '**/hs_err_pid*'
Error: rsync: [sender] change_dir "/tmp/src/solr/heapdumps" failed: No such file or directory (2)
rsync error: some files/attrs were not transferred (see previous errors) (code 23) at main.c(1684) [Receiver=3.1.3]
rsync: [Receiver] write error: Broken pipe (32)
+ exit 1
Build step 'Execute shell' marked build as failure
Archiving artifacts
Recording test results
[Checks API] No suitable checks publisher found.
Email was triggered for: Failure - Any
Sending email for trigger: Failure - Any
[JENKINS] Solr » Solr-Check-9.x - Build # 4956 - Still Failing!
Posted by Apache Jenkins Server <je...@builds.apache.org>.
Build: https://ci-builds.apache.org/job/Solr/job/Solr-Check-9.x/4956/
All tests passed
Build Log:
[...truncated 1246 lines...]
# ERROR: Error from server at http://localhost:8983/solr/admin/collections?action=CREATE&name=COLL_NAME&collection.configName=COLL_NAME&numShards=1&nrtReplicas=1&wt=javabin&version=2: org.apache.solr.cluster.placement.PlacementException: Not enough eligible nodes to place 1 replica(s) of type NRT for shard shard1 of collection COLL_NAME. Only able to place 0 replicas.
ok 42 Random placement plugin using ENV in 23946ms
ok 43 post solr log into solr in 10287ms
ok 44 start solr with ssl in 21070ms
ok 45 start solr with ssl and auth in 22941ms
ok 46 SOLR-11740 check 'solr stop' connection in 28388ms
ok 47 status detects locally running solr in 14606ms
ok 48 status does not expose cli parameters to end user in 236ms
ok 49 listing out files in 2260ms
ok 50 copying files around in 7024ms
ok 51 upconfig in 2912ms
> Task :solr:packaging:integrationTests FAILED
FAILURE: Build failed with an exception.
* Where:
Build file '/tmp/src/solr/solr/packaging/build.gradle' line: 285
* What went wrong:
Execution failed for task ':solr:packaging:integrationTests'.
> Process 'command '/tmp/src/solr/.gradle/node/packaging/node_modules/bats/bin/bats'' finished with non-zero exit value 1
* Try:
> Run with --stacktrace option to get the stack trace.
> Run with --info or --debug option to get more log output.
> Run with --scan to get full insights.
* Get more help at https://help.gradle.org
BUILD FAILED in 16m 41s
644 actionable tasks: 628 executed, 16 up-to-date
[0m[?12l[?25h
------------------------------------------------------------------------
Build Failed: returned 1
Total time: 17m12s
------------------------------------------------------------------------
+ status=1
+ ./crave pull '**/build/**/test/TEST-*.xml' '**/*.events' 'heapdumps/**' '**/hs_err_pid*'
Error: rsync: [sender] change_dir "/tmp/src/solr/heapdumps" failed: No such file or directory (2)
rsync error: some files/attrs were not transferred (see previous errors) (code 23) at main.c(1684) [Receiver=3.1.3]
rsync: [Receiver] write error: Broken pipe (32)
+ exit 1
Build step 'Execute shell' marked build as failure
Archiving artifacts
Recording test results
[Checks API] No suitable checks publisher found.
Email was triggered for: Failure - Any
Sending email for trigger: Failure - Any