You are viewing a plain text version of this content. The canonical link for it is here.
Posted to notifications@directory.apache.org by gm...@apache.org on 2016/03/07 08:50:12 UTC

Build failed in Jenkins: directory-fortress-enmasse #829

See <https://analysis.apache.org/jenkins/job/directory-fortress-enmasse/829/>

------------------------------------------
Started by timer
Building in workspace <https://analysis.apache.org/jenkins/job/directory-fortress-enmasse/ws/>
 > git rev-parse --is-inside-work-tree # timeout=10
Fetching changes from the remote Git repository
 > git config remote.origin.url https://git-wip-us.apache.org/repos/asf/directory-fortress-enmasse.git # timeout=10
Fetching upstream changes from https://git-wip-us.apache.org/repos/asf/directory-fortress-enmasse.git
 > git --version # timeout=10
 > git -c core.askpass=true fetch --tags --progress https://git-wip-us.apache.org/repos/asf/directory-fortress-enmasse.git +refs/heads/*:refs/remotes/origin/*
Seen branch in repository origin/1.0-RC41
Seen branch in repository origin/master
Seen 2 remote branches
Checking out Revision 8118897c200a826516e6a02b77f473037dc37e2d (origin/master)
 > git config core.sparsecheckout # timeout=10
 > git checkout -f 8118897c200a826516e6a02b77f473037dc37e2d
 > git rev-list 8118897c200a826516e6a02b77f473037dc37e2d # timeout=10
 > git tag -a -f -m Jenkins Build #829 jenkins-directory-fortress-enmasse-829 # timeout=10
Parsing POMs
Established TCP socket on 49626
[workspace] $ /x1/jenkins/jenkins-master/jenkins-home/tools/hudson.model.JDK/jdk1.7.0_65/bin/java -Xms256m -Xmx512m -XX:+UseCompressedOops -XX:MaxPermSize=256m -cp /x1/jenkins/jenkins-master/jenkins-home/plugins/maven-plugin/WEB-INF/lib/maven3-agent-1.7.jar:/x1/jenkins/jenkins-master/jenkins-home/tools/hudson.tasks.Maven_MavenInstallation/maven-3.0.5/boot/plexus-classworlds-2.4.jar org.jvnet.hudson.maven3.agent.Maven3Main /x1/jenkins/jenkins-master/jenkins-home/tools/hudson.tasks.Maven_MavenInstallation/maven-3.0.5 /x1/jenkins/jenkins-master/catalina-base/work/Catalina/localhost/jenkins/WEB-INF/lib/remoting-2.53.3.jar /x1/jenkins/jenkins-master/jenkins-home/plugins/maven-plugin/WEB-INF/lib/maven3-interceptor-1.7.jar /x1/jenkins/jenkins-master/jenkins-home/plugins/maven-plugin/WEB-INF/lib/maven3-interceptor-commons-1.7.jar 49626
<===[JENKINS REMOTING CAPACITY]===>   channel started
Executing Maven:  -B -f <https://analysis.apache.org/jenkins/job/directory-fortress-enmasse/ws/pom.xml> clean install -U -DskipTests -fae
[INFO] Scanning for projects...
[WARNING] 
[WARNING] Some problems were encountered while building the effective model for org.apache.directory.fortress:fortress-rest:war:1.0-RC42-SNAPSHOT
[WARNING] 'build.plugins.plugin.version' for org.codehaus.mojo:tomcat-maven-plugin is missing. @ line 314, column 15
[WARNING] 'reporting.plugins.plugin.version' for org.apache.maven.plugins:maven-javadoc-plugin is missing. @ line 478, column 15
[WARNING] 
[WARNING] It is highly recommended to fix these problems because they threaten the stability of your build.
[WARNING] 
[WARNING] For this reason, future Maven versions might no longer support building such malformed projects.
[WARNING] 
[INFO]                                                                         
[INFO] ------------------------------------------------------------------------
[INFO] Building Apache Fortress Rest 1.0-RC42-SNAPSHOT
[INFO] ------------------------------------------------------------------------
Downloading: http://repo.maven.apache.org/maven2/org/codehaus/mojo/tomcat-maven-plugin/maven-metadata.xml
Downloaded: http://repo.maven.apache.org/maven2/org/codehaus/mojo/tomcat-maven-plugin/maven-metadata.xml (439 B at 1.4 KB/sec)
Downloading: http://repo1.maven.org/maven2/org/apache/directory/fortress/fortress-realm-impl/1.0-RC42/fortress-realm-impl-1.0-RC42.pom
Downloading: http://repo.maven.apache.org/maven2/org/apache/directory/fortress/fortress-realm-impl/1.0-RC42/fortress-realm-impl-1.0-RC42.pom
[WARNING] The POM for org.apache.directory.fortress:fortress-realm-impl:jar:1.0-RC42 is missing, no dependency information available
Downloading: http://repo1.maven.org/maven2/org/apache/directory/fortress/fortress-realm-impl/1.0-RC42/fortress-realm-impl-1.0-RC42.jar
Downloading: http://repo.maven.apache.org/maven2/org/apache/directory/fortress/fortress-realm-impl/1.0-RC42/fortress-realm-impl-1.0-RC42.jar
[INFO] ------------------------------------------------------------------------
[INFO] BUILD FAILURE
[INFO] ------------------------------------------------------------------------
[INFO] Total time: 18.363s
[INFO] Finished at: Mon Mar 07 07:49:46 UTC 2016
[INFO] Final Memory: 15M/246M
[INFO] ------------------------------------------------------------------------
Waiting for Jenkins to finish collecting data[ERROR] Failed to execute goal on project fortress-rest: Could not resolve dependencies for project org.apache.directory.fortress:fortress-rest:war:1.0-RC42-SNAPSHOT: Could not find artifact org.apache.directory.fortress:fortress-realm-impl:jar:1.0-RC42 in maven2 (http://repo1.maven.org/maven2) -> [Help 1]
[ERROR] 
[ERROR] To see the full stack trace of the errors, re-run Maven with the -e switch.
[ERROR] Re-run Maven using the -X switch to enable full debug logging.
[ERROR] 
[ERROR] For more information about the errors and possible solutions, please read the following articles:
[ERROR] [Help 1] http://cwiki.apache.org/confluence/display/MAVEN/DependencyResolutionException

[JENKINS] Archiving <https://analysis.apache.org/jenkins/job/directory-fortress-enmasse/ws/pom.xml> to org.apache.directory.fortress/fortress-rest/1.0-RC42-SNAPSHOT/fortress-rest-1.0-RC42-SNAPSHOT.pom
Sending e-mails to: notifications@directory.apache.org
Skipping sonar analysis due to bad build status FAILURE
channel stopped

Jenkins build is back to normal : directory-fortress-enmasse #840

Posted by gm...@apache.org.
See <https://analysis.apache.org/jenkins/job/directory-fortress-enmasse/840/changes>


Build failed in Jenkins: directory-fortress-enmasse #839

Posted by gm...@apache.org.
See <https://analysis.apache.org/jenkins/job/directory-fortress-enmasse/839/>

------------------------------------------
Started by timer
Building in workspace <https://analysis.apache.org/jenkins/job/directory-fortress-enmasse/ws/>
 > git rev-parse --is-inside-work-tree # timeout=10
Fetching changes from the remote Git repository
 > git config remote.origin.url https://git-wip-us.apache.org/repos/asf/directory-fortress-enmasse.git # timeout=10
Fetching upstream changes from https://git-wip-us.apache.org/repos/asf/directory-fortress-enmasse.git
 > git --version # timeout=10
 > git -c core.askpass=true fetch --tags --progress https://git-wip-us.apache.org/repos/asf/directory-fortress-enmasse.git +refs/heads/*:refs/remotes/origin/*
Seen branch in repository origin/1.0-RC41
Seen branch in repository origin/master
Seen 2 remote branches
Checking out Revision 51a2b3972ce0dccb031b3827a7a4b42a0873573e (origin/master)
 > git config core.sparsecheckout # timeout=10
 > git checkout -f 51a2b3972ce0dccb031b3827a7a4b42a0873573e
 > git rev-list 51a2b3972ce0dccb031b3827a7a4b42a0873573e # timeout=10
 > git tag -a -f -m Jenkins Build #839 jenkins-directory-fortress-enmasse-839 # timeout=10
Parsing POMs
Established TCP socket on 47855
[workspace] $ /x1/jenkins/jenkins-master/jenkins-home/tools/hudson.model.JDK/jdk1.7.0_65/bin/java -Xms256m -Xmx512m -XX:+UseCompressedOops -XX:MaxPermSize=256m -cp /x1/jenkins/jenkins-master/jenkins-home/plugins/maven-plugin/WEB-INF/lib/maven3-agent-1.7.jar:/x1/jenkins/jenkins-master/jenkins-home/tools/hudson.tasks.Maven_MavenInstallation/maven-3.0.5/boot/plexus-classworlds-2.4.jar org.jvnet.hudson.maven3.agent.Maven3Main /x1/jenkins/jenkins-master/jenkins-home/tools/hudson.tasks.Maven_MavenInstallation/maven-3.0.5 /x1/jenkins/jenkins-master/catalina-base/work/Catalina/localhost/jenkins/WEB-INF/lib/remoting-2.53.3.jar /x1/jenkins/jenkins-master/jenkins-home/plugins/maven-plugin/WEB-INF/lib/maven3-interceptor-1.7.jar /x1/jenkins/jenkins-master/jenkins-home/plugins/maven-plugin/WEB-INF/lib/maven3-interceptor-commons-1.7.jar 47855
<===[JENKINS REMOTING CAPACITY]===>   channel started
Executing Maven:  -B -f <https://analysis.apache.org/jenkins/job/directory-fortress-enmasse/ws/pom.xml> clean install -U -DskipTests -fae
[INFO] Scanning for projects...
[WARNING] 
[WARNING] Some problems were encountered while building the effective model for org.apache.directory.fortress:fortress-rest:war:1.0-RC43-SNAPSHOT
[WARNING] 'build.plugins.plugin.version' for org.codehaus.mojo:tomcat-maven-plugin is missing. @ line 330, column 15
[WARNING] 'reporting.plugins.plugin.version' for org.apache.maven.plugins:maven-javadoc-plugin is missing. @ line 455, column 15
[WARNING] 
[WARNING] It is highly recommended to fix these problems because they threaten the stability of your build.
[WARNING] 
[WARNING] For this reason, future Maven versions might no longer support building such malformed projects.
[WARNING] 
[INFO]                                                                         
[INFO] ------------------------------------------------------------------------
[INFO] Building Apache Fortress Rest 1.0-RC43-SNAPSHOT
[INFO] ------------------------------------------------------------------------
Downloading: http://repo.maven.apache.org/maven2/org/codehaus/mojo/tomcat-maven-plugin/maven-metadata.xml
Downloaded: http://repo.maven.apache.org/maven2/org/codehaus/mojo/tomcat-maven-plugin/maven-metadata.xml (439 B at 0.6 KB/sec)
Downloading: http://repo1.maven.org/maven2/org/apache/directory/fortress/fortress-realm-impl/1.0-RC42/fortress-realm-impl-1.0-RC42.pom
Downloading: http://repo.maven.apache.org/maven2/org/apache/directory/fortress/fortress-realm-impl/1.0-RC42/fortress-realm-impl-1.0-RC42.pom
[WARNING] The POM for org.apache.directory.fortress:fortress-realm-impl:jar:1.0-RC42 is missing, no dependency information available
Downloading: http://repo1.maven.org/maven2/org/apache/directory/fortress/fortress-realm-impl/1.0-RC42/fortress-realm-impl-1.0-RC42.jar
Downloading: http://repo.maven.apache.org/maven2/org/apache/directory/fortress/fortress-realm-impl/1.0-RC42/fortress-realm-impl-1.0-RC42.jar
[INFO] ------------------------------------------------------------------------
[INFO] BUILD FAILURE
[INFO] ------------------------------------------------------------------------
[INFO] Total time: 15.644s
[INFO] Finished at: Mon Mar 14 07:49:41 UTC 2016
[INFO] Final Memory: 13M/246M
[INFO] ------------------------------------------------------------------------
Waiting for Jenkins to finish collecting data[ERROR] Failed to execute goal on project fortress-rest: Could not resolve dependencies for project org.apache.directory.fortress:fortress-rest:war:1.0-RC43-SNAPSHOT: Could not find artifact org.apache.directory.fortress:fortress-realm-impl:jar:1.0-RC42 in maven2 (http://repo1.maven.org/maven2) -> [Help 1]
[ERROR] 
[ERROR] To see the full stack trace of the errors, re-run Maven with the -e switch.
[ERROR] Re-run Maven using the -X switch to enable full debug logging.
[ERROR] 
[ERROR] For more information about the errors and possible solutions, please read the following articles:
[ERROR] [Help 1] http://cwiki.apache.org/confluence/display/MAVEN/DependencyResolutionException

[JENKINS] Archiving <https://analysis.apache.org/jenkins/job/directory-fortress-enmasse/ws/pom.xml> to org.apache.directory.fortress/fortress-rest/1.0-RC43-SNAPSHOT/fortress-rest-1.0-RC43-SNAPSHOT.pom
Sending e-mails to: notifications@directory.apache.org
Skipping sonar analysis due to bad build status FAILURE
channel stopped

Build failed in Jenkins: directory-fortress-enmasse #838

Posted by gm...@apache.org.
See <https://analysis.apache.org/jenkins/job/directory-fortress-enmasse/838/>

------------------------------------------
Started by timer
Building in workspace <https://analysis.apache.org/jenkins/job/directory-fortress-enmasse/ws/>
 > git rev-parse --is-inside-work-tree # timeout=10
Fetching changes from the remote Git repository
 > git config remote.origin.url https://git-wip-us.apache.org/repos/asf/directory-fortress-enmasse.git # timeout=10
Fetching upstream changes from https://git-wip-us.apache.org/repos/asf/directory-fortress-enmasse.git
 > git --version # timeout=10
 > git -c core.askpass=true fetch --tags --progress https://git-wip-us.apache.org/repos/asf/directory-fortress-enmasse.git +refs/heads/*:refs/remotes/origin/*
Seen branch in repository origin/1.0-RC41
Seen branch in repository origin/master
Seen 2 remote branches
Checking out Revision 51a2b3972ce0dccb031b3827a7a4b42a0873573e (origin/master)
 > git config core.sparsecheckout # timeout=10
 > git checkout -f 51a2b3972ce0dccb031b3827a7a4b42a0873573e
 > git rev-list 51a2b3972ce0dccb031b3827a7a4b42a0873573e # timeout=10
 > git tag -a -f -m Jenkins Build #838 jenkins-directory-fortress-enmasse-838 # timeout=10
Parsing POMs
Established TCP socket on 53096
[workspace] $ /x1/jenkins/jenkins-master/jenkins-home/tools/hudson.model.JDK/jdk1.7.0_65/bin/java -Xms256m -Xmx512m -XX:+UseCompressedOops -XX:MaxPermSize=256m -cp /x1/jenkins/jenkins-master/jenkins-home/plugins/maven-plugin/WEB-INF/lib/maven3-agent-1.7.jar:/x1/jenkins/jenkins-master/jenkins-home/tools/hudson.tasks.Maven_MavenInstallation/maven-3.0.5/boot/plexus-classworlds-2.4.jar org.jvnet.hudson.maven3.agent.Maven3Main /x1/jenkins/jenkins-master/jenkins-home/tools/hudson.tasks.Maven_MavenInstallation/maven-3.0.5 /x1/jenkins/jenkins-master/catalina-base/work/Catalina/localhost/jenkins/WEB-INF/lib/remoting-2.53.3.jar /x1/jenkins/jenkins-master/jenkins-home/plugins/maven-plugin/WEB-INF/lib/maven3-interceptor-1.7.jar /x1/jenkins/jenkins-master/jenkins-home/plugins/maven-plugin/WEB-INF/lib/maven3-interceptor-commons-1.7.jar 53096
<===[JENKINS REMOTING CAPACITY]===>   channel started
Executing Maven:  -B -f <https://analysis.apache.org/jenkins/job/directory-fortress-enmasse/ws/pom.xml> clean install -U -DskipTests -fae
[INFO] Scanning for projects...
[WARNING] 
[WARNING] Some problems were encountered while building the effective model for org.apache.directory.fortress:fortress-rest:war:1.0-RC43-SNAPSHOT
[WARNING] 'build.plugins.plugin.version' for org.codehaus.mojo:tomcat-maven-plugin is missing. @ line 330, column 15
[WARNING] 'reporting.plugins.plugin.version' for org.apache.maven.plugins:maven-javadoc-plugin is missing. @ line 455, column 15
[WARNING] 
[WARNING] It is highly recommended to fix these problems because they threaten the stability of your build.
[WARNING] 
[WARNING] For this reason, future Maven versions might no longer support building such malformed projects.
[WARNING] 
[INFO]                                                                         
[INFO] ------------------------------------------------------------------------
[INFO] Building Apache Fortress Rest 1.0-RC43-SNAPSHOT
[INFO] ------------------------------------------------------------------------
Downloading: http://repo.maven.apache.org/maven2/org/codehaus/mojo/tomcat-maven-plugin/maven-metadata.xml
Downloaded: http://repo.maven.apache.org/maven2/org/codehaus/mojo/tomcat-maven-plugin/maven-metadata.xml (439 B at 0.7 KB/sec)
Downloading: http://repo1.maven.org/maven2/org/apache/directory/fortress/fortress-realm-impl/1.0-RC42/fortress-realm-impl-1.0-RC42.pom
Downloading: http://repo.maven.apache.org/maven2/org/apache/directory/fortress/fortress-realm-impl/1.0-RC42/fortress-realm-impl-1.0-RC42.pom
[WARNING] The POM for org.apache.directory.fortress:fortress-realm-impl:jar:1.0-RC42 is missing, no dependency information available
Downloading: http://repo1.maven.org/maven2/org/apache/directory/fortress/fortress-realm-impl/1.0-RC42/fortress-realm-impl-1.0-RC42.jar
Downloading: http://repo.maven.apache.org/maven2/org/apache/directory/fortress/fortress-realm-impl/1.0-RC42/fortress-realm-impl-1.0-RC42.jar
[INFO] ------------------------------------------------------------------------
[INFO] BUILD FAILURE
[INFO] ------------------------------------------------------------------------
[INFO] Total time: 17.537s
[INFO] Finished at: Sun Mar 13 07:49:54 UTC 2016
[INFO] Final Memory: 13M/246M
[INFO] ------------------------------------------------------------------------
Waiting for Jenkins to finish collecting data[ERROR] Failed to execute goal on project fortress-rest: Could not resolve dependencies for project org.apache.directory.fortress:fortress-rest:war:1.0-RC43-SNAPSHOT: Could not find artifact org.apache.directory.fortress:fortress-realm-impl:jar:1.0-RC42 in maven2 (http://repo1.maven.org/maven2) -> [Help 1]
[ERROR] 
[ERROR] To see the full stack trace of the errors, re-run Maven with the -e switch.
[ERROR] Re-run Maven using the -X switch to enable full debug logging.
[ERROR] 
[ERROR] For more information about the errors and possible solutions, please read the following articles:
[ERROR] [Help 1] http://cwiki.apache.org/confluence/display/MAVEN/DependencyResolutionException

[JENKINS] Archiving <https://analysis.apache.org/jenkins/job/directory-fortress-enmasse/ws/pom.xml> to org.apache.directory.fortress/fortress-rest/1.0-RC43-SNAPSHOT/fortress-rest-1.0-RC43-SNAPSHOT.pom
Sending e-mails to: notifications@directory.apache.org
channel stopped
Skipping sonar analysis due to bad build status FAILURE

Build failed in Jenkins: directory-fortress-enmasse #837

Posted by gm...@apache.org.
See <https://analysis.apache.org/jenkins/job/directory-fortress-enmasse/837/>

------------------------------------------
Started by timer
Building in workspace <https://analysis.apache.org/jenkins/job/directory-fortress-enmasse/ws/>
 > git rev-parse --is-inside-work-tree # timeout=10
Fetching changes from the remote Git repository
 > git config remote.origin.url https://git-wip-us.apache.org/repos/asf/directory-fortress-enmasse.git # timeout=10
Fetching upstream changes from https://git-wip-us.apache.org/repos/asf/directory-fortress-enmasse.git
 > git --version # timeout=10
 > git -c core.askpass=true fetch --tags --progress https://git-wip-us.apache.org/repos/asf/directory-fortress-enmasse.git +refs/heads/*:refs/remotes/origin/*
Seen branch in repository origin/1.0-RC41
Seen branch in repository origin/master
Seen 2 remote branches
Checking out Revision 51a2b3972ce0dccb031b3827a7a4b42a0873573e (origin/master)
 > git config core.sparsecheckout # timeout=10
 > git checkout -f 51a2b3972ce0dccb031b3827a7a4b42a0873573e
 > git rev-list 51a2b3972ce0dccb031b3827a7a4b42a0873573e # timeout=10
 > git tag -a -f -m Jenkins Build #837 jenkins-directory-fortress-enmasse-837 # timeout=10
Parsing POMs
Established TCP socket on 57307
[workspace] $ /x1/jenkins/jenkins-master/jenkins-home/tools/hudson.model.JDK/jdk1.7.0_65/bin/java -Xms256m -Xmx512m -XX:+UseCompressedOops -XX:MaxPermSize=256m -cp /x1/jenkins/jenkins-master/jenkins-home/plugins/maven-plugin/WEB-INF/lib/maven3-agent-1.7.jar:/x1/jenkins/jenkins-master/jenkins-home/tools/hudson.tasks.Maven_MavenInstallation/maven-3.0.5/boot/plexus-classworlds-2.4.jar org.jvnet.hudson.maven3.agent.Maven3Main /x1/jenkins/jenkins-master/jenkins-home/tools/hudson.tasks.Maven_MavenInstallation/maven-3.0.5 /x1/jenkins/jenkins-master/catalina-base/work/Catalina/localhost/jenkins/WEB-INF/lib/remoting-2.53.3.jar /x1/jenkins/jenkins-master/jenkins-home/plugins/maven-plugin/WEB-INF/lib/maven3-interceptor-1.7.jar /x1/jenkins/jenkins-master/jenkins-home/plugins/maven-plugin/WEB-INF/lib/maven3-interceptor-commons-1.7.jar 57307
<===[JENKINS REMOTING CAPACITY]===>   channel started
Executing Maven:  -B -f <https://analysis.apache.org/jenkins/job/directory-fortress-enmasse/ws/pom.xml> clean install -U -DskipTests -fae
[INFO] Scanning for projects...
[WARNING] 
[WARNING] Some problems were encountered while building the effective model for org.apache.directory.fortress:fortress-rest:war:1.0-RC43-SNAPSHOT
[WARNING] 'build.plugins.plugin.version' for org.codehaus.mojo:tomcat-maven-plugin is missing. @ line 330, column 15
[WARNING] 'reporting.plugins.plugin.version' for org.apache.maven.plugins:maven-javadoc-plugin is missing. @ line 455, column 15
[WARNING] 
[WARNING] It is highly recommended to fix these problems because they threaten the stability of your build.
[WARNING] 
[WARNING] For this reason, future Maven versions might no longer support building such malformed projects.
[WARNING] 
[INFO]                                                                         
[INFO] ------------------------------------------------------------------------
[INFO] Building Apache Fortress Rest 1.0-RC43-SNAPSHOT
[INFO] ------------------------------------------------------------------------
Downloading: http://repo.maven.apache.org/maven2/org/codehaus/mojo/tomcat-maven-plugin/maven-metadata.xml
Downloaded: http://repo.maven.apache.org/maven2/org/codehaus/mojo/tomcat-maven-plugin/maven-metadata.xml (439 B at 0.4 KB/sec)
Downloading: http://repo1.maven.org/maven2/org/apache/directory/fortress/fortress-realm-impl/1.0-RC42/fortress-realm-impl-1.0-RC42.pom
Downloading: http://repo.maven.apache.org/maven2/org/apache/directory/fortress/fortress-realm-impl/1.0-RC42/fortress-realm-impl-1.0-RC42.pom
[WARNING] The POM for org.apache.directory.fortress:fortress-realm-impl:jar:1.0-RC42 is missing, no dependency information available
Downloading: http://repo1.maven.org/maven2/org/apache/directory/fortress/fortress-realm-impl/1.0-RC42/fortress-realm-impl-1.0-RC42.jar
Downloading: http://repo.maven.apache.org/maven2/org/apache/directory/fortress/fortress-realm-impl/1.0-RC42/fortress-realm-impl-1.0-RC42.jar
[INFO] ------------------------------------------------------------------------
[INFO] BUILD FAILURE
[INFO] ------------------------------------------------------------------------
[INFO] Total time: 12.913s
[INFO] Finished at: Sat Mar 12 07:49:42 UTC 2016
[INFO] Final Memory: 15M/310M
[INFO] ------------------------------------------------------------------------
Waiting for Jenkins to finish collecting data[ERROR] Failed to execute goal on project fortress-rest: Could not resolve dependencies for project org.apache.directory.fortress:fortress-rest:war:1.0-RC43-SNAPSHOT: Could not find artifact org.apache.directory.fortress:fortress-realm-impl:jar:1.0-RC42 in maven2 (http://repo1.maven.org/maven2) -> [Help 1]
[ERROR] 
[ERROR] To see the full stack trace of the errors, re-run Maven with the -e switch.
[ERROR] Re-run Maven using the -X switch to enable full debug logging.
[ERROR] 
[ERROR] For more information about the errors and possible solutions, please read the following articles:
[ERROR] [Help 1] http://cwiki.apache.org/confluence/display/MAVEN/DependencyResolutionException

[JENKINS] Archiving <https://analysis.apache.org/jenkins/job/directory-fortress-enmasse/ws/pom.xml> to org.apache.directory.fortress/fortress-rest/1.0-RC43-SNAPSHOT/fortress-rest-1.0-RC43-SNAPSHOT.pom
Sending e-mails to: notifications@directory.apache.org
channel stopped
Skipping sonar analysis due to bad build status FAILURE

Build failed in Jenkins: directory-fortress-enmasse #836

Posted by gm...@apache.org.
See <https://analysis.apache.org/jenkins/job/directory-fortress-enmasse/836/>

------------------------------------------
Started by timer
Building in workspace <https://analysis.apache.org/jenkins/job/directory-fortress-enmasse/ws/>
 > git rev-parse --is-inside-work-tree # timeout=10
Fetching changes from the remote Git repository
 > git config remote.origin.url https://git-wip-us.apache.org/repos/asf/directory-fortress-enmasse.git # timeout=10
Fetching upstream changes from https://git-wip-us.apache.org/repos/asf/directory-fortress-enmasse.git
 > git --version # timeout=10
 > git -c core.askpass=true fetch --tags --progress https://git-wip-us.apache.org/repos/asf/directory-fortress-enmasse.git +refs/heads/*:refs/remotes/origin/*
Seen branch in repository origin/1.0-RC41
Seen branch in repository origin/master
Seen 2 remote branches
Checking out Revision 51a2b3972ce0dccb031b3827a7a4b42a0873573e (origin/master)
 > git config core.sparsecheckout # timeout=10
 > git checkout -f 51a2b3972ce0dccb031b3827a7a4b42a0873573e
 > git rev-list 51a2b3972ce0dccb031b3827a7a4b42a0873573e # timeout=10
 > git tag -a -f -m Jenkins Build #836 jenkins-directory-fortress-enmasse-836 # timeout=10
Parsing POMs
Established TCP socket on 34803
[workspace] $ /x1/jenkins/jenkins-master/jenkins-home/tools/hudson.model.JDK/jdk1.7.0_65/bin/java -Xms256m -Xmx512m -XX:+UseCompressedOops -XX:MaxPermSize=256m -cp /x1/jenkins/jenkins-master/jenkins-home/plugins/maven-plugin/WEB-INF/lib/maven3-agent-1.7.jar:/x1/jenkins/jenkins-master/jenkins-home/tools/hudson.tasks.Maven_MavenInstallation/maven-3.0.5/boot/plexus-classworlds-2.4.jar org.jvnet.hudson.maven3.agent.Maven3Main /x1/jenkins/jenkins-master/jenkins-home/tools/hudson.tasks.Maven_MavenInstallation/maven-3.0.5 /x1/jenkins/jenkins-master/catalina-base/work/Catalina/localhost/jenkins/WEB-INF/lib/remoting-2.53.3.jar /x1/jenkins/jenkins-master/jenkins-home/plugins/maven-plugin/WEB-INF/lib/maven3-interceptor-1.7.jar /x1/jenkins/jenkins-master/jenkins-home/plugins/maven-plugin/WEB-INF/lib/maven3-interceptor-commons-1.7.jar 34803
<===[JENKINS REMOTING CAPACITY]===>   channel started
Executing Maven:  -B -f <https://analysis.apache.org/jenkins/job/directory-fortress-enmasse/ws/pom.xml> clean install -U -DskipTests -fae
[INFO] Scanning for projects...
[WARNING] 
[WARNING] Some problems were encountered while building the effective model for org.apache.directory.fortress:fortress-rest:war:1.0-RC43-SNAPSHOT
[WARNING] 'build.plugins.plugin.version' for org.codehaus.mojo:tomcat-maven-plugin is missing. @ line 330, column 15
[WARNING] 'reporting.plugins.plugin.version' for org.apache.maven.plugins:maven-javadoc-plugin is missing. @ line 455, column 15
[WARNING] 
[WARNING] It is highly recommended to fix these problems because they threaten the stability of your build.
[WARNING] 
[WARNING] For this reason, future Maven versions might no longer support building such malformed projects.
[WARNING] 
[INFO]                                                                         
[INFO] ------------------------------------------------------------------------
[INFO] Building Apache Fortress Rest 1.0-RC43-SNAPSHOT
[INFO] ------------------------------------------------------------------------
Downloading: http://repo.maven.apache.org/maven2/org/codehaus/mojo/tomcat-maven-plugin/maven-metadata.xml
Downloaded: http://repo.maven.apache.org/maven2/org/codehaus/mojo/tomcat-maven-plugin/maven-metadata.xml (439 B at 1.2 KB/sec)
Downloading: http://repo1.maven.org/maven2/org/apache/directory/fortress/fortress-realm-impl/1.0-RC42/fortress-realm-impl-1.0-RC42.pom
Downloading: http://repo.maven.apache.org/maven2/org/apache/directory/fortress/fortress-realm-impl/1.0-RC42/fortress-realm-impl-1.0-RC42.pom
[WARNING] The POM for org.apache.directory.fortress:fortress-realm-impl:jar:1.0-RC42 is missing, no dependency information available
Downloading: http://repo1.maven.org/maven2/org/apache/directory/fortress/fortress-realm-impl/1.0-RC42/fortress-realm-impl-1.0-RC42.jar
Downloading: http://repo.maven.apache.org/maven2/org/apache/directory/fortress/fortress-realm-impl/1.0-RC42/fortress-realm-impl-1.0-RC42.jar
[INFO] ------------------------------------------------------------------------
[INFO] BUILD FAILURE
[INFO] ------------------------------------------------------------------------
[INFO] Total time: 12.586s
[INFO] Finished at: Fri Mar 11 07:49:36 UTC 2016
[INFO] Final Memory: 13M/246M
[INFO] ------------------------------------------------------------------------
[ERROR] Failed to execute goal on project fortress-rest: Could not resolve dependencies for project org.apache.directory.fortress:fortress-rest:war:1.0-RC43-SNAPSHOT: Could not find artifact org.apache.directory.fortress:fortress-realm-impl:jar:1.0-RC42 in maven2 (http://repo1.maven.org/maven2) -> [Help 1]
[ERROR] 
[ERROR] To see the full stack trace of the errors, re-run Maven with the -e switch.
[ERROR] Re-run Maven using the -X switch to enable full debug logging.
[ERROR] 
[ERROR] For more information about the errors and possible solutions, please read the following articles:
[ERROR] [Help 1] http://cwiki.apache.org/confluence/display/MAVEN/DependencyResolutionException
[JENKINS] Archiving <https://analysis.apache.org/jenkins/job/directory-fortress-enmasse/ws/pom.xml> to org.apache.directory.fortress/fortress-rest/1.0-RC43-SNAPSHOT/fortress-rest-1.0-RC43-SNAPSHOT.pom
Sending e-mails to: notifications@directory.apache.org
channel stopped
Skipping sonar analysis due to bad build status FAILURE

Build failed in Jenkins: directory-fortress-enmasse #835

Posted by gm...@apache.org.
See <https://analysis.apache.org/jenkins/job/directory-fortress-enmasse/835/>

------------------------------------------
Started by timer
Building in workspace <https://analysis.apache.org/jenkins/job/directory-fortress-enmasse/ws/>
 > git rev-parse --is-inside-work-tree # timeout=10
Fetching changes from the remote Git repository
 > git config remote.origin.url https://git-wip-us.apache.org/repos/asf/directory-fortress-enmasse.git # timeout=10
Fetching upstream changes from https://git-wip-us.apache.org/repos/asf/directory-fortress-enmasse.git
 > git --version # timeout=10
 > git -c core.askpass=true fetch --tags --progress https://git-wip-us.apache.org/repos/asf/directory-fortress-enmasse.git +refs/heads/*:refs/remotes/origin/*
Seen branch in repository origin/1.0-RC41
Seen branch in repository origin/master
Seen 2 remote branches
Checking out Revision 51a2b3972ce0dccb031b3827a7a4b42a0873573e (origin/master)
 > git config core.sparsecheckout # timeout=10
 > git checkout -f 51a2b3972ce0dccb031b3827a7a4b42a0873573e
 > git rev-list 51a2b3972ce0dccb031b3827a7a4b42a0873573e # timeout=10
 > git tag -a -f -m Jenkins Build #835 jenkins-directory-fortress-enmasse-835 # timeout=10
Parsing POMs
Established TCP socket on 50309
[workspace] $ /x1/jenkins/jenkins-master/jenkins-home/tools/hudson.model.JDK/jdk1.7.0_65/bin/java -Xms256m -Xmx512m -XX:+UseCompressedOops -XX:MaxPermSize=256m -cp /x1/jenkins/jenkins-master/jenkins-home/plugins/maven-plugin/WEB-INF/lib/maven3-agent-1.7.jar:/x1/jenkins/jenkins-master/jenkins-home/tools/hudson.tasks.Maven_MavenInstallation/maven-3.0.5/boot/plexus-classworlds-2.4.jar org.jvnet.hudson.maven3.agent.Maven3Main /x1/jenkins/jenkins-master/jenkins-home/tools/hudson.tasks.Maven_MavenInstallation/maven-3.0.5 /x1/jenkins/jenkins-master/catalina-base/work/Catalina/localhost/jenkins/WEB-INF/lib/remoting-2.53.3.jar /x1/jenkins/jenkins-master/jenkins-home/plugins/maven-plugin/WEB-INF/lib/maven3-interceptor-1.7.jar /x1/jenkins/jenkins-master/jenkins-home/plugins/maven-plugin/WEB-INF/lib/maven3-interceptor-commons-1.7.jar 50309
<===[JENKINS REMOTING CAPACITY]===>   channel started
Executing Maven:  -B -f <https://analysis.apache.org/jenkins/job/directory-fortress-enmasse/ws/pom.xml> clean install -U -DskipTests -fae
[INFO] Scanning for projects...
[WARNING] 
[WARNING] Some problems were encountered while building the effective model for org.apache.directory.fortress:fortress-rest:war:1.0-RC43-SNAPSHOT
[WARNING] 'build.plugins.plugin.version' for org.codehaus.mojo:tomcat-maven-plugin is missing. @ line 330, column 15
[WARNING] 'reporting.plugins.plugin.version' for org.apache.maven.plugins:maven-javadoc-plugin is missing. @ line 455, column 15
[WARNING] 
[WARNING] It is highly recommended to fix these problems because they threaten the stability of your build.
[WARNING] 
[WARNING] For this reason, future Maven versions might no longer support building such malformed projects.
[WARNING] 
[INFO]                                                                         
[INFO] ------------------------------------------------------------------------
[INFO] Building Apache Fortress Rest 1.0-RC43-SNAPSHOT
[INFO] ------------------------------------------------------------------------
Downloading: http://repo.maven.apache.org/maven2/org/codehaus/mojo/tomcat-maven-plugin/maven-metadata.xml
Downloaded: http://repo.maven.apache.org/maven2/org/codehaus/mojo/tomcat-maven-plugin/maven-metadata.xml (439 B at 1.0 KB/sec)
Downloading: http://repo1.maven.org/maven2/org/apache/directory/fortress/fortress-realm-impl/1.0-RC42/fortress-realm-impl-1.0-RC42.pom
Downloading: http://repo.maven.apache.org/maven2/org/apache/directory/fortress/fortress-realm-impl/1.0-RC42/fortress-realm-impl-1.0-RC42.pom
[WARNING] The POM for org.apache.directory.fortress:fortress-realm-impl:jar:1.0-RC42 is missing, no dependency information available
Downloading: http://repo1.maven.org/maven2/org/apache/directory/fortress/fortress-realm-impl/1.0-RC42/fortress-realm-impl-1.0-RC42.jar
Downloading: http://repo.maven.apache.org/maven2/org/apache/directory/fortress/fortress-realm-impl/1.0-RC42/fortress-realm-impl-1.0-RC42.jar
[INFO] ------------------------------------------------------------------------
[INFO] BUILD FAILURE
[INFO] ------------------------------------------------------------------------
[INFO] Total time: 14.707s
[INFO] Finished at: Thu Mar 10 07:49:32 UTC 2016
[INFO] Final Memory: 13M/246M
[INFO] ------------------------------------------------------------------------
Waiting for Jenkins to finish collecting data
[ERROR] Failed to execute goal on project fortress-rest: Could not resolve dependencies for project org.apache.directory.fortress:fortress-rest:war:1.0-RC43-SNAPSHOT: Could not find artifact org.apache.directory.fortress:fortress-realm-impl:jar:1.0-RC42 in maven2 (http://repo1.maven.org/maven2) -> [Help 1]
[ERROR] 
[ERROR] To see the full stack trace of the errors, re-run Maven with the -e switch.
[ERROR] Re-run Maven using the -X switch to enable full debug logging.
[ERROR] 
[ERROR] For more information about the errors and possible solutions, please read the following articles:
[ERROR] [Help 1] http://cwiki.apache.org/confluence/display/MAVEN/DependencyResolutionException
[JENKINS] Archiving <https://analysis.apache.org/jenkins/job/directory-fortress-enmasse/ws/pom.xml> to org.apache.directory.fortress/fortress-rest/1.0-RC43-SNAPSHOT/fortress-rest-1.0-RC43-SNAPSHOT.pom
Sending e-mails to: notifications@directory.apache.org
Skipping sonar analysis due to bad build status FAILURE

Build failed in Jenkins: directory-fortress-enmasse #834

Posted by gm...@apache.org.
See <https://analysis.apache.org/jenkins/job/directory-fortress-enmasse/834/changes>

Changes:

[smckinney] release preps

[smckinney] [maven-release-plugin] prepare release 1.0-RC42

[smckinney] release preps

[smckinney] [maven-release-plugin] prepare release 1.0-RC42

[smckinney] [maven-release-plugin] prepare for next development iteration

------------------------------------------
Started by upstream project "maven-plugins" build number 1034
originally caused by:
 Started by an SCM change
Building in workspace <https://analysis.apache.org/jenkins/job/directory-fortress-enmasse/ws/>
 > git rev-parse --is-inside-work-tree # timeout=10
Fetching changes from the remote Git repository
 > git config remote.origin.url https://git-wip-us.apache.org/repos/asf/directory-fortress-enmasse.git # timeout=10
Fetching upstream changes from https://git-wip-us.apache.org/repos/asf/directory-fortress-enmasse.git
 > git --version # timeout=10
 > git -c core.askpass=true fetch --tags --progress https://git-wip-us.apache.org/repos/asf/directory-fortress-enmasse.git +refs/heads/*:refs/remotes/origin/*
Seen branch in repository origin/1.0-RC41
Seen branch in repository origin/master
Seen 2 remote branches
Checking out Revision 51a2b3972ce0dccb031b3827a7a4b42a0873573e (origin/master)
 > git config core.sparsecheckout # timeout=10
 > git checkout -f 51a2b3972ce0dccb031b3827a7a4b42a0873573e
 > git rev-list 888831c1de84fb212e7c3fb58de3c9ba3948f6b5 # timeout=10
 > git tag -a -f -m Jenkins Build #834 jenkins-directory-fortress-enmasse-834 # timeout=10
Parsing POMs
Established TCP socket on 42832
[workspace] $ /x1/jenkins/jenkins-master/jenkins-home/tools/hudson.model.JDK/jdk1.7.0_65/bin/java -Xms256m -Xmx512m -XX:+UseCompressedOops -XX:MaxPermSize=256m -cp /x1/jenkins/jenkins-master/jenkins-home/plugins/maven-plugin/WEB-INF/lib/maven3-agent-1.7.jar:/x1/jenkins/jenkins-master/jenkins-home/tools/hudson.tasks.Maven_MavenInstallation/maven-3.0.5/boot/plexus-classworlds-2.4.jar org.jvnet.hudson.maven3.agent.Maven3Main /x1/jenkins/jenkins-master/jenkins-home/tools/hudson.tasks.Maven_MavenInstallation/maven-3.0.5 /x1/jenkins/jenkins-master/catalina-base/work/Catalina/localhost/jenkins/WEB-INF/lib/remoting-2.53.3.jar /x1/jenkins/jenkins-master/jenkins-home/plugins/maven-plugin/WEB-INF/lib/maven3-interceptor-1.7.jar /x1/jenkins/jenkins-master/jenkins-home/plugins/maven-plugin/WEB-INF/lib/maven3-interceptor-commons-1.7.jar 42832
<===[JENKINS REMOTING CAPACITY]===>   channel started
Executing Maven:  -B -f <https://analysis.apache.org/jenkins/job/directory-fortress-enmasse/ws/pom.xml> clean install -U -DskipTests -fae
[INFO] Scanning for projects...
[WARNING] 
[WARNING] Some problems were encountered while building the effective model for org.apache.directory.fortress:fortress-rest:war:1.0-RC43-SNAPSHOT
[WARNING] 'build.plugins.plugin.version' for org.codehaus.mojo:tomcat-maven-plugin is missing. @ line 330, column 15
[WARNING] 'reporting.plugins.plugin.version' for org.apache.maven.plugins:maven-javadoc-plugin is missing. @ line 455, column 15
[WARNING] 
[WARNING] It is highly recommended to fix these problems because they threaten the stability of your build.
[WARNING] 
[WARNING] For this reason, future Maven versions might no longer support building such malformed projects.
[WARNING] 
[INFO]                                                                         
[INFO] ------------------------------------------------------------------------
[INFO] Building Apache Fortress Rest 1.0-RC43-SNAPSHOT
[INFO] ------------------------------------------------------------------------
Downloading: http://repo.maven.apache.org/maven2/org/codehaus/mojo/tomcat-maven-plugin/maven-metadata.xml
Downloaded: http://repo.maven.apache.org/maven2/org/codehaus/mojo/tomcat-maven-plugin/maven-metadata.xml (439 B at 1.1 KB/sec)
Downloading: http://repo1.maven.org/maven2/org/apache/directory/fortress/fortress-realm-impl/1.0-RC42/fortress-realm-impl-1.0-RC42.pom
Downloading: http://repo.maven.apache.org/maven2/org/apache/directory/fortress/fortress-realm-impl/1.0-RC42/fortress-realm-impl-1.0-RC42.pom
[WARNING] The POM for org.apache.directory.fortress:fortress-realm-impl:jar:1.0-RC42 is missing, no dependency information available
Downloading: http://repo1.maven.org/maven2/org/apache/directory/fortress/fortress-realm-impl/1.0-RC42/fortress-realm-impl-1.0-RC42.jar
Downloading: http://repo.maven.apache.org/maven2/org/apache/directory/fortress/fortress-realm-impl/1.0-RC42/fortress-realm-impl-1.0-RC42.jar
[INFO] ------------------------------------------------------------------------
[INFO] BUILD FAILURE
[INFO] ------------------------------------------------------------------------
[INFO] Total time: 15.687s
[INFO] Finished at: Wed Mar 09 17:37:43 UTC 2016
[INFO] Final Memory: 13M/246M
[INFO] ------------------------------------------------------------------------
Waiting for Jenkins to finish collecting data[ERROR] Failed to execute goal on project fortress-rest: Could not resolve dependencies for project org.apache.directory.fortress:fortress-rest:war:1.0-RC43-SNAPSHOT: Could not find artifact org.apache.directory.fortress:fortress-realm-impl:jar:1.0-RC42 in maven2 (http://repo1.maven.org/maven2) -> [Help 1]
[ERROR] 
[ERROR] To see the full stack trace of the errors, re-run Maven with the -e switch.
[ERROR] Re-run Maven using the -X switch to enable full debug logging.
[ERROR] 
[ERROR] For more information about the errors and possible solutions, please read the following articles:
[ERROR] [Help 1] http://cwiki.apache.org/confluence/display/MAVEN/DependencyResolutionException

[JENKINS] Archiving <https://analysis.apache.org/jenkins/job/directory-fortress-enmasse/ws/pom.xml> to org.apache.directory.fortress/fortress-rest/1.0-RC43-SNAPSHOT/fortress-rest-1.0-RC43-SNAPSHOT.pom
Sending e-mails to: notifications@directory.apache.org
Skipping sonar analysis due to bad build status FAILURE
channel stopped

Build failed in Jenkins: directory-fortress-enmasse #833

Posted by gm...@apache.org.
See <https://analysis.apache.org/jenkins/job/directory-fortress-enmasse/833/>

------------------------------------------
Started by timer
Building in workspace <https://analysis.apache.org/jenkins/job/directory-fortress-enmasse/ws/>
 > git rev-parse --is-inside-work-tree # timeout=10
Fetching changes from the remote Git repository
 > git config remote.origin.url https://git-wip-us.apache.org/repos/asf/directory-fortress-enmasse.git # timeout=10
Fetching upstream changes from https://git-wip-us.apache.org/repos/asf/directory-fortress-enmasse.git
 > git --version # timeout=10
 > git -c core.askpass=true fetch --tags --progress https://git-wip-us.apache.org/repos/asf/directory-fortress-enmasse.git +refs/heads/*:refs/remotes/origin/*
Seen branch in repository origin/1.0-RC41
Seen branch in repository origin/master
Seen 2 remote branches
Checking out Revision 888831c1de84fb212e7c3fb58de3c9ba3948f6b5 (origin/master)
 > git config core.sparsecheckout # timeout=10
 > git checkout -f 888831c1de84fb212e7c3fb58de3c9ba3948f6b5
 > git rev-list 888831c1de84fb212e7c3fb58de3c9ba3948f6b5 # timeout=10
 > git tag -a -f -m Jenkins Build #833 jenkins-directory-fortress-enmasse-833 # timeout=10
Parsing POMs
Established TCP socket on 39312
[workspace] $ /x1/jenkins/jenkins-master/jenkins-home/tools/hudson.model.JDK/jdk1.7.0_65/bin/java -Xms256m -Xmx512m -XX:+UseCompressedOops -XX:MaxPermSize=256m -cp /x1/jenkins/jenkins-master/jenkins-home/plugins/maven-plugin/WEB-INF/lib/maven3-agent-1.7.jar:/x1/jenkins/jenkins-master/jenkins-home/tools/hudson.tasks.Maven_MavenInstallation/maven-3.0.5/boot/plexus-classworlds-2.4.jar org.jvnet.hudson.maven3.agent.Maven3Main /x1/jenkins/jenkins-master/jenkins-home/tools/hudson.tasks.Maven_MavenInstallation/maven-3.0.5 /x1/jenkins/jenkins-master/catalina-base/work/Catalina/localhost/jenkins/WEB-INF/lib/remoting-2.53.3.jar /x1/jenkins/jenkins-master/jenkins-home/plugins/maven-plugin/WEB-INF/lib/maven3-interceptor-1.7.jar /x1/jenkins/jenkins-master/jenkins-home/plugins/maven-plugin/WEB-INF/lib/maven3-interceptor-commons-1.7.jar 39312
<===[JENKINS REMOTING CAPACITY]===>   channel started
Executing Maven:  -B -f <https://analysis.apache.org/jenkins/job/directory-fortress-enmasse/ws/pom.xml> clean install -U -DskipTests -fae
[INFO] Scanning for projects...
[WARNING] 
[WARNING] Some problems were encountered while building the effective model for org.apache.directory.fortress:fortress-rest:war:1.0-RC43-SNAPSHOT
[WARNING] 'build.plugins.plugin.version' for org.codehaus.mojo:tomcat-maven-plugin is missing. @ line 330, column 15
[WARNING] 'reporting.plugins.plugin.version' for org.apache.maven.plugins:maven-javadoc-plugin is missing. @ line 455, column 15
[WARNING] 
[WARNING] It is highly recommended to fix these problems because they threaten the stability of your build.
[WARNING] 
[WARNING] For this reason, future Maven versions might no longer support building such malformed projects.
[WARNING] 
[INFO]                                                                         
[INFO] ------------------------------------------------------------------------
[INFO] Building Apache Fortress Rest 1.0-RC43-SNAPSHOT
[INFO] ------------------------------------------------------------------------
Downloading: http://repo.maven.apache.org/maven2/org/codehaus/mojo/tomcat-maven-plugin/maven-metadata.xml
Downloaded: http://repo.maven.apache.org/maven2/org/codehaus/mojo/tomcat-maven-plugin/maven-metadata.xml (439 B at 1.2 KB/sec)
Downloading: http://repo1.maven.org/maven2/org/apache/directory/fortress/fortress-realm-impl/1.0-RC42/fortress-realm-impl-1.0-RC42.pom
Downloading: http://repo.maven.apache.org/maven2/org/apache/directory/fortress/fortress-realm-impl/1.0-RC42/fortress-realm-impl-1.0-RC42.pom
[WARNING] The POM for org.apache.directory.fortress:fortress-realm-impl:jar:1.0-RC42 is missing, no dependency information available
Downloading: http://repo1.maven.org/maven2/org/apache/directory/fortress/fortress-realm-impl/1.0-RC42/fortress-realm-impl-1.0-RC42.jar
Downloading: http://repo.maven.apache.org/maven2/org/apache/directory/fortress/fortress-realm-impl/1.0-RC42/fortress-realm-impl-1.0-RC42.jar
[INFO] ------------------------------------------------------------------------
[INFO] BUILD FAILURE
[INFO] ------------------------------------------------------------------------
[INFO] Total time: 12.942s
[INFO] Finished at: Wed Mar 09 07:49:33 UTC 2016
[INFO] Final Memory: 13M/246M
[INFO] ------------------------------------------------------------------------
[ERROR] Failed to execute goal on project fortress-rest: Could not resolve dependencies for project org.apache.directory.fortress:fortress-rest:war:1.0-RC43-SNAPSHOT: Could not find artifact org.apache.directory.fortress:fortress-realm-impl:jar:1.0-RC42 in maven2 (http://repo1.maven.org/maven2) -> [Help 1]
[ERROR] 
[ERROR] To see the full stack trace of the errors, re-run Maven with the -e switch.
[ERROR] Re-run Maven using the -X switch to enable full debug logging.
[ERROR] 
[ERROR] For more information about the errors and possible solutions, please read the following articles:
[ERROR] [Help 1] http://cwiki.apache.org/confluence/display/MAVEN/DependencyResolutionException
[JENKINS] Archiving <https://analysis.apache.org/jenkins/job/directory-fortress-enmasse/ws/pom.xml> to org.apache.directory.fortress/fortress-rest/1.0-RC43-SNAPSHOT/fortress-rest-1.0-RC43-SNAPSHOT.pom
Sending e-mails to: notifications@directory.apache.org
channel stopped
Skipping sonar analysis due to bad build status FAILURE

Build failed in Jenkins: directory-fortress-enmasse #832

Posted by gm...@apache.org.
See <https://analysis.apache.org/jenkins/job/directory-fortress-enmasse/832/>

------------------------------------------
Started by upstream project "maven-plugins" build number 1033
originally caused by:
 Started by an SCM change
Building in workspace <https://analysis.apache.org/jenkins/job/directory-fortress-enmasse/ws/>
 > git rev-parse --is-inside-work-tree # timeout=10
Fetching changes from the remote Git repository
 > git config remote.origin.url https://git-wip-us.apache.org/repos/asf/directory-fortress-enmasse.git # timeout=10
Fetching upstream changes from https://git-wip-us.apache.org/repos/asf/directory-fortress-enmasse.git
 > git --version # timeout=10
 > git -c core.askpass=true fetch --tags --progress https://git-wip-us.apache.org/repos/asf/directory-fortress-enmasse.git +refs/heads/*:refs/remotes/origin/*
Seen branch in repository origin/1.0-RC41
Seen branch in repository origin/master
Seen 2 remote branches
Checking out Revision 888831c1de84fb212e7c3fb58de3c9ba3948f6b5 (origin/master)
 > git config core.sparsecheckout # timeout=10
 > git checkout -f 888831c1de84fb212e7c3fb58de3c9ba3948f6b5
 > git rev-list 888831c1de84fb212e7c3fb58de3c9ba3948f6b5 # timeout=10
 > git tag -a -f -m Jenkins Build #832 jenkins-directory-fortress-enmasse-832 # timeout=10
Parsing POMs
Established TCP socket on 50454
[workspace] $ /x1/jenkins/jenkins-master/jenkins-home/tools/hudson.model.JDK/jdk1.7.0_65/bin/java -Xms256m -Xmx512m -XX:+UseCompressedOops -XX:MaxPermSize=256m -cp /x1/jenkins/jenkins-master/jenkins-home/plugins/maven-plugin/WEB-INF/lib/maven3-agent-1.7.jar:/x1/jenkins/jenkins-master/jenkins-home/tools/hudson.tasks.Maven_MavenInstallation/maven-3.0.5/boot/plexus-classworlds-2.4.jar org.jvnet.hudson.maven3.agent.Maven3Main /x1/jenkins/jenkins-master/jenkins-home/tools/hudson.tasks.Maven_MavenInstallation/maven-3.0.5 /x1/jenkins/jenkins-master/catalina-base/work/Catalina/localhost/jenkins/WEB-INF/lib/remoting-2.53.3.jar /x1/jenkins/jenkins-master/jenkins-home/plugins/maven-plugin/WEB-INF/lib/maven3-interceptor-1.7.jar /x1/jenkins/jenkins-master/jenkins-home/plugins/maven-plugin/WEB-INF/lib/maven3-interceptor-commons-1.7.jar 50454
<===[JENKINS REMOTING CAPACITY]===>   channel started
Executing Maven:  -B -f <https://analysis.apache.org/jenkins/job/directory-fortress-enmasse/ws/pom.xml> clean install -U -DskipTests -fae
[INFO] Scanning for projects...
[WARNING] 
[WARNING] Some problems were encountered while building the effective model for org.apache.directory.fortress:fortress-rest:war:1.0-RC43-SNAPSHOT
[WARNING] 'build.plugins.plugin.version' for org.codehaus.mojo:tomcat-maven-plugin is missing. @ line 330, column 15
[WARNING] 'reporting.plugins.plugin.version' for org.apache.maven.plugins:maven-javadoc-plugin is missing. @ line 455, column 15
[WARNING] 
[WARNING] It is highly recommended to fix these problems because they threaten the stability of your build.
[WARNING] 
[WARNING] For this reason, future Maven versions might no longer support building such malformed projects.
[WARNING] 
[INFO]                                                                         
[INFO] ------------------------------------------------------------------------
[INFO] Building Apache Fortress Rest 1.0-RC43-SNAPSHOT
[INFO] ------------------------------------------------------------------------
Downloading: http://repo.maven.apache.org/maven2/org/codehaus/mojo/tomcat-maven-plugin/maven-metadata.xml
Downloaded: http://repo.maven.apache.org/maven2/org/codehaus/mojo/tomcat-maven-plugin/maven-metadata.xml (439 B at 0.7 KB/sec)
Downloading: http://repo1.maven.org/maven2/org/apache/directory/fortress/fortress-realm-impl/1.0-RC42/fortress-realm-impl-1.0-RC42.pom
Downloading: http://repo.maven.apache.org/maven2/org/apache/directory/fortress/fortress-realm-impl/1.0-RC42/fortress-realm-impl-1.0-RC42.pom
[WARNING] The POM for org.apache.directory.fortress:fortress-realm-impl:jar:1.0-RC42 is missing, no dependency information available
Downloading: http://repo1.maven.org/maven2/org/apache/directory/fortress/fortress-realm-impl/1.0-RC42/fortress-realm-impl-1.0-RC42.jar
Downloading: http://repo.maven.apache.org/maven2/org/apache/directory/fortress/fortress-realm-impl/1.0-RC42/fortress-realm-impl-1.0-RC42.jar
[INFO] ------------------------------------------------------------------------
[INFO] BUILD FAILURE
[INFO] ------------------------------------------------------------------------
[INFO] Total time: 15.156s
[INFO] Finished at: Tue Mar 08 16:59:12 UTC 2016
[INFO] Final Memory: 14M/310M
[INFO] ------------------------------------------------------------------------
Waiting for Jenkins to finish collecting data
[ERROR] Failed to execute goal on project fortress-rest: Could not resolve dependencies for project org.apache.directory.fortress:fortress-rest:war:1.0-RC43-SNAPSHOT: Could not find artifact org.apache.directory.fortress:fortress-realm-impl:jar:1.0-RC42 in maven2 (http://repo1.maven.org/maven2) -> [Help 1]
[ERROR] 
[ERROR] To see the full stack trace of the errors, re-run Maven with the -e switch.
[ERROR] Re-run Maven using the -X switch to enable full debug logging.
[ERROR] 
[ERROR] For more information about the errors and possible solutions, please read the following articles:
[ERROR] [Help 1] http://cwiki.apache.org/confluence/display/MAVEN/DependencyResolutionException
[JENKINS] Archiving <https://analysis.apache.org/jenkins/job/directory-fortress-enmasse/ws/pom.xml> to org.apache.directory.fortress/fortress-rest/1.0-RC43-SNAPSHOT/fortress-rest-1.0-RC43-SNAPSHOT.pom
Sending e-mails to: notifications@directory.apache.org
channel stopped
Skipping sonar analysis due to bad build status FAILURE

Build failed in Jenkins: directory-fortress-enmasse #831

Posted by gm...@apache.org.
See <https://analysis.apache.org/jenkins/job/directory-fortress-enmasse/831/changes>

Changes:

[smckinney] [maven-release-plugin] prepare release 1.0-RC42

[smckinney] [maven-release-plugin] prepare for next development iteration

------------------------------------------
Started by timer
Building in workspace <https://analysis.apache.org/jenkins/job/directory-fortress-enmasse/ws/>
 > git rev-parse --is-inside-work-tree # timeout=10
Fetching changes from the remote Git repository
 > git config remote.origin.url https://git-wip-us.apache.org/repos/asf/directory-fortress-enmasse.git # timeout=10
Fetching upstream changes from https://git-wip-us.apache.org/repos/asf/directory-fortress-enmasse.git
 > git --version # timeout=10
 > git -c core.askpass=true fetch --tags --progress https://git-wip-us.apache.org/repos/asf/directory-fortress-enmasse.git +refs/heads/*:refs/remotes/origin/*
Seen branch in repository origin/1.0-RC41
Seen branch in repository origin/master
Seen 2 remote branches
Checking out Revision 888831c1de84fb212e7c3fb58de3c9ba3948f6b5 (origin/master)
 > git config core.sparsecheckout # timeout=10
 > git checkout -f 888831c1de84fb212e7c3fb58de3c9ba3948f6b5
 > git rev-list 6094cdfc54c6057ce06bab375ecd60cbc95bc890 # timeout=10
 > git tag -a -f -m Jenkins Build #831 jenkins-directory-fortress-enmasse-831 # timeout=10
Parsing POMs
Established TCP socket on 53954
[workspace] $ /x1/jenkins/jenkins-master/jenkins-home/tools/hudson.model.JDK/jdk1.7.0_65/bin/java -Xms256m -Xmx512m -XX:+UseCompressedOops -XX:MaxPermSize=256m -cp /x1/jenkins/jenkins-master/jenkins-home/plugins/maven-plugin/WEB-INF/lib/maven3-agent-1.7.jar:/x1/jenkins/jenkins-master/jenkins-home/tools/hudson.tasks.Maven_MavenInstallation/maven-3.0.5/boot/plexus-classworlds-2.4.jar org.jvnet.hudson.maven3.agent.Maven3Main /x1/jenkins/jenkins-master/jenkins-home/tools/hudson.tasks.Maven_MavenInstallation/maven-3.0.5 /x1/jenkins/jenkins-master/catalina-base/work/Catalina/localhost/jenkins/WEB-INF/lib/remoting-2.53.3.jar /x1/jenkins/jenkins-master/jenkins-home/plugins/maven-plugin/WEB-INF/lib/maven3-interceptor-1.7.jar /x1/jenkins/jenkins-master/jenkins-home/plugins/maven-plugin/WEB-INF/lib/maven3-interceptor-commons-1.7.jar 53954
<===[JENKINS REMOTING CAPACITY]===>   channel started
Executing Maven:  -B -f <https://analysis.apache.org/jenkins/job/directory-fortress-enmasse/ws/pom.xml> clean install -U -DskipTests -fae
[INFO] Scanning for projects...
[WARNING] 
[WARNING] Some problems were encountered while building the effective model for org.apache.directory.fortress:fortress-rest:war:1.0-RC43-SNAPSHOT
[WARNING] 'build.plugins.plugin.version' for org.codehaus.mojo:tomcat-maven-plugin is missing. @ line 330, column 15
[WARNING] 'reporting.plugins.plugin.version' for org.apache.maven.plugins:maven-javadoc-plugin is missing. @ line 455, column 15
[WARNING] 
[WARNING] It is highly recommended to fix these problems because they threaten the stability of your build.
[WARNING] 
[WARNING] For this reason, future Maven versions might no longer support building such malformed projects.
[WARNING] 
[INFO]                                                                         
[INFO] ------------------------------------------------------------------------
[INFO] Building Apache Fortress Rest 1.0-RC43-SNAPSHOT
[INFO] ------------------------------------------------------------------------
Downloading: http://repo.maven.apache.org/maven2/org/codehaus/mojo/tomcat-maven-plugin/maven-metadata.xml
Downloaded: http://repo.maven.apache.org/maven2/org/codehaus/mojo/tomcat-maven-plugin/maven-metadata.xml (439 B at 0.6 KB/sec)
Downloading: http://repo1.maven.org/maven2/org/apache/directory/fortress/fortress-realm-impl/1.0-RC42/fortress-realm-impl-1.0-RC42.pom
Downloading: http://repo.maven.apache.org/maven2/org/apache/directory/fortress/fortress-realm-impl/1.0-RC42/fortress-realm-impl-1.0-RC42.pom
[WARNING] The POM for org.apache.directory.fortress:fortress-realm-impl:jar:1.0-RC42 is missing, no dependency information available
Downloading: http://repo1.maven.org/maven2/org/apache/directory/fortress/fortress-realm-impl/1.0-RC42/fortress-realm-impl-1.0-RC42.jar
Downloading: http://repo.maven.apache.org/maven2/org/apache/directory/fortress/fortress-realm-impl/1.0-RC42/fortress-realm-impl-1.0-RC42.jar
[INFO] ------------------------------------------------------------------------
[INFO] BUILD FAILURE
[INFO] ------------------------------------------------------------------------
[INFO] Total time: 15.236s
[INFO] Finished at: Tue Mar 08 07:49:39 UTC 2016
[INFO] Final Memory: 13M/246M
[INFO] ------------------------------------------------------------------------
Waiting for Jenkins to finish collecting data
[ERROR] Failed to execute goal on project fortress-rest: Could not resolve dependencies for project org.apache.directory.fortress:fortress-rest:war:1.0-RC43-SNAPSHOT: Could not find artifact org.apache.directory.fortress:fortress-realm-impl:jar:1.0-RC42 in maven2 (http://repo1.maven.org/maven2) -> [Help 1]
[ERROR] 
[ERROR] To see the full stack trace of the errors, re-run Maven with the -e switch.
[ERROR] Re-run Maven using the -X switch to enable full debug logging.
[ERROR] 
[ERROR] For more information about the errors and possible solutions, please read the following articles:
[ERROR] [Help 1] http://cwiki.apache.org/confluence/display/MAVEN/DependencyResolutionException
[JENKINS] Archiving <https://analysis.apache.org/jenkins/job/directory-fortress-enmasse/ws/pom.xml> to org.apache.directory.fortress/fortress-rest/1.0-RC43-SNAPSHOT/fortress-rest-1.0-RC43-SNAPSHOT.pom
Sending e-mails to: notifications@directory.apache.org
Skipping sonar analysis due to bad build status FAILURE
channel stopped

Build failed in Jenkins: directory-fortress-enmasse #830

Posted by gm...@apache.org.
See <https://analysis.apache.org/jenkins/job/directory-fortress-enmasse/830/changes>

Changes:

[smckinney] Release preps

[smckinney] Release preps

[smckinney] Release preps

[smckinney] [maven-release-plugin] prepare release 1.0-RC42

[smckinney] Release preps

[smckinney] [maven-release-plugin] prepare release 1.0-RC42

[smckinney] [maven-release-plugin] prepare for next development iteration

[smckinney] Release preps

------------------------------------------
Started by upstream project "maven-plugins" build number 1032
originally caused by:
 Started by an SCM change
Building in workspace <https://analysis.apache.org/jenkins/job/directory-fortress-enmasse/ws/>
 > git rev-parse --is-inside-work-tree # timeout=10
Fetching changes from the remote Git repository
 > git config remote.origin.url https://git-wip-us.apache.org/repos/asf/directory-fortress-enmasse.git # timeout=10
Fetching upstream changes from https://git-wip-us.apache.org/repos/asf/directory-fortress-enmasse.git
 > git --version # timeout=10
 > git -c core.askpass=true fetch --tags --progress https://git-wip-us.apache.org/repos/asf/directory-fortress-enmasse.git +refs/heads/*:refs/remotes/origin/*
Seen branch in repository origin/1.0-RC41
Seen branch in repository origin/master
Seen 2 remote branches
Checking out Revision 6094cdfc54c6057ce06bab375ecd60cbc95bc890 (origin/master)
 > git config core.sparsecheckout # timeout=10
 > git checkout -f 6094cdfc54c6057ce06bab375ecd60cbc95bc890
 > git rev-list 8118897c200a826516e6a02b77f473037dc37e2d # timeout=10
 > git tag -a -f -m Jenkins Build #830 jenkins-directory-fortress-enmasse-830 # timeout=10
Parsing POMs
Modules changed, recalculating dependency graph
Established TCP socket on 60568
[workspace] $ /x1/jenkins/jenkins-master/jenkins-home/tools/hudson.model.JDK/jdk1.7.0_65/bin/java -Xms256m -Xmx512m -XX:+UseCompressedOops -XX:MaxPermSize=256m -cp /x1/jenkins/jenkins-master/jenkins-home/plugins/maven-plugin/WEB-INF/lib/maven3-agent-1.7.jar:/x1/jenkins/jenkins-master/jenkins-home/tools/hudson.tasks.Maven_MavenInstallation/maven-3.0.5/boot/plexus-classworlds-2.4.jar org.jvnet.hudson.maven3.agent.Maven3Main /x1/jenkins/jenkins-master/jenkins-home/tools/hudson.tasks.Maven_MavenInstallation/maven-3.0.5 /x1/jenkins/jenkins-master/catalina-base/work/Catalina/localhost/jenkins/WEB-INF/lib/remoting-2.53.3.jar /x1/jenkins/jenkins-master/jenkins-home/plugins/maven-plugin/WEB-INF/lib/maven3-interceptor-1.7.jar /x1/jenkins/jenkins-master/jenkins-home/plugins/maven-plugin/WEB-INF/lib/maven3-interceptor-commons-1.7.jar 60568
<===[JENKINS REMOTING CAPACITY]===>   channel started
Executing Maven:  -B -f <https://analysis.apache.org/jenkins/job/directory-fortress-enmasse/ws/pom.xml> clean install -U -DskipTests -fae
[INFO] Scanning for projects...
[WARNING] 
[WARNING] Some problems were encountered while building the effective model for org.apache.directory.fortress:fortress-rest:war:1.0-RC42-SNAPSHOT
[WARNING] 'build.plugins.plugin.version' for org.codehaus.mojo:tomcat-maven-plugin is missing. @ line 330, column 15
[WARNING] 'reporting.plugins.plugin.version' for org.apache.maven.plugins:maven-javadoc-plugin is missing. @ line 455, column 15
[WARNING] 
[WARNING] It is highly recommended to fix these problems because they threaten the stability of your build.
[WARNING] 
[WARNING] For this reason, future Maven versions might no longer support building such malformed projects.
[WARNING] 
[INFO]                                                                         
[INFO] ------------------------------------------------------------------------
[INFO] Building Apache Fortress Rest 1.0-RC42-SNAPSHOT
[INFO] ------------------------------------------------------------------------
Downloading: http://repo.maven.apache.org/maven2/org/codehaus/mojo/tomcat-maven-plugin/maven-metadata.xml
Downloaded: http://repo.maven.apache.org/maven2/org/codehaus/mojo/tomcat-maven-plugin/maven-metadata.xml (439 B at 1.0 KB/sec)
Downloading: http://repo1.maven.org/maven2/org/apache/directory/fortress/fortress-realm-impl/1.0-RC42/fortress-realm-impl-1.0-RC42.pom
Downloading: http://repo.maven.apache.org/maven2/org/apache/directory/fortress/fortress-realm-impl/1.0-RC42/fortress-realm-impl-1.0-RC42.pom
[WARNING] The POM for org.apache.directory.fortress:fortress-realm-impl:jar:1.0-RC42 is missing, no dependency information available
Downloading: http://repo1.maven.org/maven2/org/apache/cxf/cxf-bundle-jaxrs/2.7.18/cxf-bundle-jaxrs-2.7.18.pom
Downloaded: http://repo1.maven.org/maven2/org/apache/cxf/cxf-bundle-jaxrs/2.7.18/cxf-bundle-jaxrs-2.7.18.pom (12 KB at 36.1 KB/sec)
Downloading: http://repo1.maven.org/maven2/org/springframework/spring-oxm/4.0.0.RELEASE/spring-oxm-4.0.0.RELEASE.pom
Downloaded: http://repo1.maven.org/maven2/org/springframework/spring-oxm/4.0.0.RELEASE/spring-oxm-4.0.0.RELEASE.pom (3 KB at 7.3 KB/sec)
Downloading: http://repo1.maven.org/maven2/org/springframework/security/spring-security-acl/4.0.0.RELEASE/spring-security-acl-4.0.0.RELEASE.pom
Downloaded: http://repo1.maven.org/maven2/org/springframework/security/spring-security-acl/4.0.0.RELEASE/spring-security-acl-4.0.0.RELEASE.pom (5 KB at 84.6 KB/sec)
Downloading: http://repo1.maven.org/maven2/org/springframework/security/spring-security-core/4.0.0.RELEASE/spring-security-core-4.0.0.RELEASE.pom
Downloaded: http://repo1.maven.org/maven2/org/springframework/security/spring-security-core/4.0.0.RELEASE/spring-security-core-4.0.0.RELEASE.pom (9 KB at 98.7 KB/sec)
Downloading: http://repo1.maven.org/maven2/org/springframework/spring-jdbc/4.1.6.RELEASE/spring-jdbc-4.1.6.RELEASE.pom
Downloaded: http://repo1.maven.org/maven2/org/springframework/spring-jdbc/4.1.6.RELEASE/spring-jdbc-4.1.6.RELEASE.pom (4 KB at 25.4 KB/sec)
Downloading: http://repo1.maven.org/maven2/org/springframework/spring-tx/4.1.6.RELEASE/spring-tx-4.1.6.RELEASE.pom
Downloaded: http://repo1.maven.org/maven2/org/springframework/spring-tx/4.1.6.RELEASE/spring-tx-4.1.6.RELEASE.pom (4 KB at 4.1 KB/sec)
Downloading: http://repo1.maven.org/maven2/org/springframework/security/spring-security-config/4.0.0.RELEASE/spring-security-config-4.0.0.RELEASE.pom
Downloaded: http://repo1.maven.org/maven2/org/springframework/security/spring-security-config/4.0.0.RELEASE/spring-security-config-4.0.0.RELEASE.pom (13 KB at 121.4 KB/sec)
Downloading: http://repo1.maven.org/maven2/org/springframework/security/spring-security-web/4.0.0.RELEASE/spring-security-web-4.0.0.RELEASE.pom
Downloaded: http://repo1.maven.org/maven2/org/springframework/security/spring-security-web/4.0.0.RELEASE/spring-security-web-4.0.0.RELEASE.pom (8 KB at 10.2 KB/sec)
Downloading: http://repo1.maven.org/maven2/org/apache/directory/fortress/fortress-realm-impl/1.0-RC42/fortress-realm-impl-1.0-RC42.jar
Downloading: http://repo1.maven.org/maven2/org/apache/cxf/cxf-bundle-jaxrs/2.7.18/cxf-bundle-jaxrs-2.7.18.jar
Downloading: http://repo1.maven.org/maven2/org/springframework/spring-oxm/4.0.0.RELEASE/spring-oxm-4.0.0.RELEASE.jar
Downloading: http://repo1.maven.org/maven2/org/springframework/security/spring-security-acl/4.0.0.RELEASE/spring-security-acl-4.0.0.RELEASE.jar
Downloading: http://repo1.maven.org/maven2/org/springframework/security/spring-security-core/4.0.0.RELEASE/spring-security-core-4.0.0.RELEASE.jar
Downloading: http://repo1.maven.org/maven2/org/springframework/spring-jdbc/4.1.6.RELEASE/spring-jdbc-4.1.6.RELEASE.jar
Downloaded: http://repo1.maven.org/maven2/org/springframework/spring-oxm/4.0.0.RELEASE/spring-oxm-4.0.0.RELEASE.jar (78 KB at 444.3 KB/sec)
Downloading: http://repo1.maven.org/maven2/org/springframework/spring-tx/4.1.6.RELEASE/spring-tx-4.1.6.RELEASE.jar
Downloaded: http://repo1.maven.org/maven2/org/springframework/security/spring-security-acl/4.0.0.RELEASE/spring-security-acl-4.0.0.RELEASE.jar (81 KB at 374.1 KB/sec)
Downloading: http://repo1.maven.org/maven2/org/springframework/security/spring-security-config/4.0.0.RELEASE/spring-security-config-4.0.0.RELEASE.jar
Downloaded: http://repo1.maven.org/maven2/org/springframework/security/spring-security-core/4.0.0.RELEASE/spring-security-core-4.0.0.RELEASE.jar (347 KB at 1146.5 KB/sec)
Downloading: http://repo1.maven.org/maven2/org/springframework/security/spring-security-web/4.0.0.RELEASE/spring-security-web-4.0.0.RELEASE.jar
Downloaded: http://repo1.maven.org/maven2/org/springframework/spring-tx/4.1.6.RELEASE/spring-tx-4.1.6.RELEASE.jar (247 KB at 1612.0 KB/sec)
Downloaded: http://repo1.maven.org/maven2/org/springframework/spring-jdbc/4.1.6.RELEASE/spring-jdbc-4.1.6.RELEASE.jar (417 KB at 1270.3 KB/sec)
Downloaded: http://repo1.maven.org/maven2/org/springframework/security/spring-security-config/4.0.0.RELEASE/spring-security-config-4.0.0.RELEASE.jar (461 KB at 2465.0 KB/sec)
Downloaded: http://repo1.maven.org/maven2/org/springframework/security/spring-security-web/4.0.0.RELEASE/spring-security-web-4.0.0.RELEASE.jar (315 KB at 2992.0 KB/sec)
Downloaded: http://repo1.maven.org/maven2/org/apache/cxf/cxf-bundle-jaxrs/2.7.18/cxf-bundle-jaxrs-2.7.18.jar (2767 KB at 1679.7 KB/sec)
Downloading: http://repo.maven.apache.org/maven2/org/apache/directory/fortress/fortress-realm-impl/1.0-RC42/fortress-realm-impl-1.0-RC42.jar
[INFO] ------------------------------------------------------------------------
[INFO] BUILD FAILURE
[INFO] ------------------------------------------------------------------------
[INFO] Total time: 1:02.178s
[INFO] Finished at: Mon Mar 07 16:35:45 UTC 2016
[INFO] Final Memory: 13M/246M
[INFO] ------------------------------------------------------------------------
Waiting for Jenkins to finish collecting data
[ERROR] Failed to execute goal on project fortress-rest: Could not resolve dependencies for project org.apache.directory.fortress:fortress-rest:war:1.0-RC42-SNAPSHOT: Could not find artifact org.apache.directory.fortress:fortress-realm-impl:jar:1.0-RC42 in maven2 (http://repo1.maven.org/maven2) -> [Help 1]
[ERROR] 
[ERROR] To see the full stack trace of the errors, re-run Maven with the -e switch.
[ERROR] Re-run Maven using the -X switch to enable full debug logging.
[ERROR] 
[ERROR] For more information about the errors and possible solutions, please read the following articles:
[ERROR] [Help 1] http://cwiki.apache.org/confluence/display/MAVEN/DependencyResolutionException
[JENKINS] Archiving <https://analysis.apache.org/jenkins/job/directory-fortress-enmasse/ws/pom.xml> to org.apache.directory.fortress/fortress-rest/1.0-RC42-SNAPSHOT/fortress-rest-1.0-RC42-SNAPSHOT.pom
Sending e-mails to: notifications@directory.apache.org
channel stopped
Skipping sonar analysis due to bad build status FAILURE