You are viewing a plain text version of this content. The canonical link for it is here.
Posted to dev@zookeeper.apache.org by Apache Jenkins Server <je...@builds.apache.org> on 2015/02/12 12:54:09 UTC
ZooKeeper-trunk - Build # 2593 - Still Failing
See https://builds.apache.org/job/ZooKeeper-trunk/2593/
###################################################################################
########################## LAST 60 LINES OF THE CONSOLE ###########################
[...truncated 355834 lines...]
[junit] 2015-02-12 11:53:55,911 [myid:] - INFO [main:FileTxnSnapLog@298] - Snapshotting: 0xb to /home/jenkins/jenkins-slave/workspace/ZooKeeper-trunk/trunk/build/test/tmp/test5648717489293009580.junit.dir/version-2/snapshot.b
[junit] 2015-02-12 11:53:55,913 [myid:] - INFO [main:FourLetterWordMain@43] - connecting to 127.0.0.1 11221
[junit] 2015-02-12 11:53:55,914 [myid:] - INFO [NIOServerCxnFactory.AcceptThread:0.0.0.0/0.0.0.0:11221:NIOServerCnxnFactory$AcceptThread@296] - Accepted socket connection from /127.0.0.1:49580
[junit] 2015-02-12 11:53:55,915 [myid:] - INFO [NIOWorkerThread-1:NIOServerCnxn@835] - Processing stat command from /127.0.0.1:49580
[junit] 2015-02-12 11:53:55,915 [myid:] - INFO [NIOWorkerThread-1:NIOServerCnxn$StatCommand@684] - Stat command output
[junit] 2015-02-12 11:53:55,916 [myid:] - INFO [NIOWorkerThread-1:NIOServerCnxn@1006] - Closed socket connection for client /127.0.0.1:49580 (no session established for client)
[junit] 2015-02-12 11:53:55,916 [myid:] - INFO [main:JMXEnv@224] - ensureParent:[InMemoryDataTree, StandaloneServer_port]
[junit] 2015-02-12 11:53:55,918 [myid:] - INFO [main:JMXEnv@241] - expect:InMemoryDataTree
[junit] 2015-02-12 11:53:55,918 [myid:] - INFO [main:JMXEnv@245] - found:InMemoryDataTree org.apache.ZooKeeperService:name0=StandaloneServer_port11221,name1=InMemoryDataTree
[junit] 2015-02-12 11:53:55,918 [myid:] - INFO [main:JMXEnv@241] - expect:StandaloneServer_port
[junit] 2015-02-12 11:53:55,919 [myid:] - INFO [main:JMXEnv@245] - found:StandaloneServer_port org.apache.ZooKeeperService:name0=StandaloneServer_port11221
[junit] 2015-02-12 11:53:55,919 [myid:] - INFO [main:JUnit4ZKTestRunner$LoggedInvokeMethod@55] - Memory used 85029
[junit] 2015-02-12 11:53:55,919 [myid:] - INFO [main:JUnit4ZKTestRunner$LoggedInvokeMethod@60] - Number of threads 24
[junit] 2015-02-12 11:53:55,920 [myid:] - INFO [main:JUnit4ZKTestRunner$LoggedInvokeMethod@65] - FINISHED TEST METHOD testQuota
[junit] 2015-02-12 11:53:55,920 [myid:] - INFO [main:ClientBase@521] - tearDown starting
[junit] 2015-02-12 11:53:55,981 [myid:] - INFO [main:ZooKeeper@968] - Session: 0x1000d97dd640000 closed
[junit] 2015-02-12 11:53:55,981 [myid:] - INFO [main:ClientBase@491] - STOPPING server
[junit] 2015-02-12 11:53:55,981 [myid:] - INFO [main-EventThread:ClientCnxn$EventThread@531] - EventThread shut down
[junit] 2015-02-12 11:53:55,981 [myid:] - INFO [NIOServerCxnFactory.AcceptThread:0.0.0.0/0.0.0.0:11221:NIOServerCnxnFactory$AcceptThread@219] - accept thread exitted run method
[junit] 2015-02-12 11:53:55,981 [myid:] - INFO [NIOServerCxnFactory.SelectorThread-1:NIOServerCnxnFactory$SelectorThread@420] - selector thread exitted run method
[junit] 2015-02-12 11:53:55,982 [myid:] - INFO [ConnnectionExpirer:NIOServerCnxnFactory$ConnectionExpirerThread@583] - ConnnectionExpirerThread interrupted
[junit] 2015-02-12 11:53:55,982 [myid:] - INFO [NIOServerCxnFactory.SelectorThread-0:NIOServerCnxnFactory$SelectorThread@420] - selector thread exitted run method
[junit] 2015-02-12 11:53:55,983 [myid:] - INFO [main:ZooKeeperServer@440] - shutting down
[junit] 2015-02-12 11:53:55,983 [myid:] - INFO [main:SessionTrackerImpl@232] - Shutting down
[junit] 2015-02-12 11:53:55,983 [myid:] - INFO [main:PrepRequestProcessor@974] - Shutting down
[junit] 2015-02-12 11:53:55,983 [myid:] - INFO [main:SyncRequestProcessor@191] - Shutting down
[junit] 2015-02-12 11:53:55,983 [myid:] - INFO [ProcessThread(sid:0 cport:11221)::PrepRequestProcessor@156] - PrepRequestProcessor exited loop!
[junit] 2015-02-12 11:53:55,984 [myid:] - INFO [SyncThread:0:SyncRequestProcessor@169] - SyncRequestProcessor exited!
[junit] 2015-02-12 11:53:55,985 [myid:] - INFO [main:FinalRequestProcessor@477] - shutdown of request processor complete
[junit] 2015-02-12 11:53:55,985 [myid:] - INFO [main:MBeanRegistry@119] - Unregister MBean [org.apache.ZooKeeperService:name0=StandaloneServer_port11221,name1=InMemoryDataTree]
[junit] 2015-02-12 11:53:55,985 [myid:] - INFO [main:MBeanRegistry@119] - Unregister MBean [org.apache.ZooKeeperService:name0=StandaloneServer_port11221]
[junit] 2015-02-12 11:53:55,986 [myid:] - INFO [main:FourLetterWordMain@43] - connecting to 127.0.0.1 11221
[junit] 2015-02-12 11:53:55,986 [myid:] - INFO [main:JMXEnv@142] - ensureOnly:[]
[junit] 2015-02-12 11:53:55,991 [myid:] - INFO [main:ClientBase@546] - fdcount after test is: 46 at start it was 34
[junit] 2015-02-12 11:53:55,991 [myid:] - INFO [main:ClientBase@548] - sleeping for 20 secs
[junit] 2015-02-12 11:53:55,993 [myid:] - INFO [main:ZKTestCase$1@65] - SUCCEEDED testQuota
[junit] 2015-02-12 11:53:55,993 [myid:] - INFO [main:ZKTestCase$1@60] - FINISHED testQuota
[junit] Tests run: 1, Failures: 0, Errors: 0, Skipped: 0, Time elapsed: 0.568 sec
BUILD FAILED
/home/jenkins/jenkins-slave/workspace/ZooKeeper-trunk/trunk/build.xml:1422: The following error occurred while executing this line:
/home/jenkins/jenkins-slave/workspace/ZooKeeper-trunk/trunk/build.xml:1333: Tests failed!
Total time: 44 minutes 52 seconds
Build step 'Execute shell' marked build as failure
[FINDBUGS] Skipping publisher since build result is FAILURE
[WARNINGS] Skipping publisher since build result is FAILURE
Archiving artifacts
Sending artifact delta relative to ZooKeeper-trunk #2582
Archived 3 artifacts
Archive block size is 32768
Received 0 blocks and 18102957 bytes
Compression is 0.0%
Took 5.1 sec
Recording fingerprints
Recording test results
Publishing Javadoc
Email was triggered for: Failure
Sending email for trigger: Failure
###################################################################################
############################## FAILED TESTS (if any) ##############################
1 tests failed.
REGRESSION: org.apache.zookeeper.server.quorum.ReconfigRecoveryTest.testCurrentObserverIsParticipantInNewConfig
Error Message:
waiting for server 2 being up
Stack Trace:
junit.framework.AssertionFailedError: waiting for server 2 being up
at org.apache.zookeeper.server.quorum.ReconfigRecoveryTest.testCurrentObserverIsParticipantInNewConfig(ReconfigRecoveryTest.java:529)
at org.apache.zookeeper.JUnit4ZKTestRunner$LoggedInvokeMethod.evaluate(JUnit4ZKTestRunner.java:52)
ZooKeeper-trunk - Build # 2597 - Still Failing
Posted by Apache Jenkins Server <je...@builds.apache.org>.
See https://builds.apache.org/job/ZooKeeper-trunk/2597/
###################################################################################
########################## LAST 60 LINES OF THE CONSOLE ###########################
[...truncated 350145 lines...]
[junit] 2015-02-16 11:15:22,306 [myid:] - INFO [main:FileTxnSnapLog@298] - Snapshotting: 0xb to /home/jenkins/jenkins-slave/workspace/ZooKeeper-trunk/trunk/build/test/tmp/test158903472705570200.junit.dir/version-2/snapshot.b
[junit] 2015-02-16 11:15:22,308 [myid:] - INFO [main:FourLetterWordMain@43] - connecting to 127.0.0.1 11221
[junit] 2015-02-16 11:15:22,309 [myid:] - INFO [NIOServerCxnFactory.AcceptThread:0.0.0.0/0.0.0.0:11221:NIOServerCnxnFactory$AcceptThread@296] - Accepted socket connection from /127.0.0.1:50240
[junit] 2015-02-16 11:15:22,310 [myid:] - INFO [NIOWorkerThread-1:NIOServerCnxn@835] - Processing stat command from /127.0.0.1:50240
[junit] 2015-02-16 11:15:22,310 [myid:] - INFO [NIOWorkerThread-1:NIOServerCnxn$StatCommand@684] - Stat command output
[junit] 2015-02-16 11:15:22,311 [myid:] - INFO [NIOWorkerThread-1:NIOServerCnxn@1006] - Closed socket connection for client /127.0.0.1:50240 (no session established for client)
[junit] 2015-02-16 11:15:22,311 [myid:] - INFO [main:JMXEnv@224] - ensureParent:[InMemoryDataTree, StandaloneServer_port]
[junit] 2015-02-16 11:15:22,313 [myid:] - INFO [main:JMXEnv@241] - expect:InMemoryDataTree
[junit] 2015-02-16 11:15:22,313 [myid:] - INFO [main:JMXEnv@245] - found:InMemoryDataTree org.apache.ZooKeeperService:name0=StandaloneServer_port11221,name1=InMemoryDataTree
[junit] 2015-02-16 11:15:22,314 [myid:] - INFO [main:JMXEnv@241] - expect:StandaloneServer_port
[junit] 2015-02-16 11:15:22,314 [myid:] - INFO [main:JMXEnv@245] - found:StandaloneServer_port org.apache.ZooKeeperService:name0=StandaloneServer_port11221
[junit] 2015-02-16 11:15:22,314 [myid:] - INFO [main:JUnit4ZKTestRunner$LoggedInvokeMethod@55] - Memory used 85028
[junit] 2015-02-16 11:15:22,314 [myid:] - INFO [main:JUnit4ZKTestRunner$LoggedInvokeMethod@60] - Number of threads 24
[junit] 2015-02-16 11:15:22,314 [myid:] - INFO [main:JUnit4ZKTestRunner$LoggedInvokeMethod@65] - FINISHED TEST METHOD testQuota
[junit] 2015-02-16 11:15:22,315 [myid:] - INFO [main:ClientBase@521] - tearDown starting
[junit] 2015-02-16 11:15:22,373 [myid:] - INFO [main:ZooKeeper@968] - Session: 0x102ba70424a0000 closed
[junit] 2015-02-16 11:15:22,374 [myid:] - INFO [main:ClientBase@491] - STOPPING server
[junit] 2015-02-16 11:15:22,374 [myid:] - INFO [ConnnectionExpirer:NIOServerCnxnFactory$ConnectionExpirerThread@583] - ConnnectionExpirerThread interrupted
[junit] 2015-02-16 11:15:22,374 [myid:] - INFO [NIOServerCxnFactory.SelectorThread-0:NIOServerCnxnFactory$SelectorThread@420] - selector thread exitted run method
[junit] 2015-02-16 11:15:22,374 [myid:] - INFO [NIOServerCxnFactory.AcceptThread:0.0.0.0/0.0.0.0:11221:NIOServerCnxnFactory$AcceptThread@219] - accept thread exitted run method
[junit] 2015-02-16 11:15:22,374 [myid:] - INFO [NIOServerCxnFactory.SelectorThread-1:NIOServerCnxnFactory$SelectorThread@420] - selector thread exitted run method
[junit] 2015-02-16 11:15:22,374 [myid:] - INFO [main-EventThread:ClientCnxn$EventThread@531] - EventThread shut down
[junit] 2015-02-16 11:15:22,375 [myid:] - INFO [main:ZooKeeperServer@440] - shutting down
[junit] 2015-02-16 11:15:22,375 [myid:] - INFO [main:SessionTrackerImpl@232] - Shutting down
[junit] 2015-02-16 11:15:22,375 [myid:] - INFO [main:PrepRequestProcessor@974] - Shutting down
[junit] 2015-02-16 11:15:22,376 [myid:] - INFO [main:SyncRequestProcessor@191] - Shutting down
[junit] 2015-02-16 11:15:22,376 [myid:] - INFO [ProcessThread(sid:0 cport:11221)::PrepRequestProcessor@156] - PrepRequestProcessor exited loop!
[junit] 2015-02-16 11:15:22,376 [myid:] - INFO [SyncThread:0:SyncRequestProcessor@169] - SyncRequestProcessor exited!
[junit] 2015-02-16 11:15:22,377 [myid:] - INFO [main:FinalRequestProcessor@477] - shutdown of request processor complete
[junit] 2015-02-16 11:15:22,377 [myid:] - INFO [main:MBeanRegistry@119] - Unregister MBean [org.apache.ZooKeeperService:name0=StandaloneServer_port11221,name1=InMemoryDataTree]
[junit] 2015-02-16 11:15:22,377 [myid:] - INFO [main:MBeanRegistry@119] - Unregister MBean [org.apache.ZooKeeperService:name0=StandaloneServer_port11221]
[junit] 2015-02-16 11:15:22,378 [myid:] - INFO [main:FourLetterWordMain@43] - connecting to 127.0.0.1 11221
[junit] 2015-02-16 11:15:22,378 [myid:] - INFO [main:JMXEnv@142] - ensureOnly:[]
[junit] 2015-02-16 11:15:22,382 [myid:] - INFO [main:ClientBase@546] - fdcount after test is: 46 at start it was 34
[junit] 2015-02-16 11:15:22,382 [myid:] - INFO [main:ClientBase@548] - sleeping for 20 secs
[junit] 2015-02-16 11:15:22,384 [myid:] - INFO [main:ZKTestCase$1@65] - SUCCEEDED testQuota
[junit] 2015-02-16 11:15:22,384 [myid:] - INFO [main:ZKTestCase$1@60] - FINISHED testQuota
[junit] Tests run: 1, Failures: 0, Errors: 0, Skipped: 0, Time elapsed: 0.544 sec
BUILD FAILED
/home/jenkins/jenkins-slave/workspace/ZooKeeper-trunk/trunk/build.xml:1422: The following error occurred while executing this line:
/home/jenkins/jenkins-slave/workspace/ZooKeeper-trunk/trunk/build.xml:1333: Tests failed!
Total time: 43 minutes 47 seconds
Build step 'Execute shell' marked build as failure
[FINDBUGS] Skipping publisher since build result is FAILURE
[WARNINGS] Skipping publisher since build result is FAILURE
Archiving artifacts
Sending artifact delta relative to ZooKeeper-trunk #2582
Archived 3 artifacts
Archive block size is 32768
Received 0 blocks and 18101111 bytes
Compression is 0.0%
Took 5.8 sec
Recording fingerprints
Recording test results
Publishing Javadoc
Email was triggered for: Failure
Sending email for trigger: Failure
###################################################################################
############################## FAILED TESTS (if any) ##############################
2 tests failed.
REGRESSION: org.apache.zookeeper.test.ReconfigTest.testPortChange
Error Message:
expected:<test[1]> but was:<test[0]>
Stack Trace:
junit.framework.AssertionFailedError: expected:<test[1]> but was:<test[0]>
at org.apache.zookeeper.test.ReconfigTest.testNormalOperation(ReconfigTest.java:151)
at org.apache.zookeeper.test.ReconfigTest.testPortChange(ReconfigTest.java:600)
at org.apache.zookeeper.JUnit4ZKTestRunner$LoggedInvokeMethod.evaluate(JUnit4ZKTestRunner.java:52)
FAILED: org.apache.zookeeper.test.AsyncHammerTest.testHammer
Error Message:
null
Stack Trace:
junit.framework.AssertionFailedError
at org.apache.zookeeper.test.AsyncHammerTest.testHammer(AsyncHammerTest.java:186)
at org.apache.zookeeper.JUnit4ZKTestRunner$LoggedInvokeMethod.evaluate(JUnit4ZKTestRunner.java:52)
ZooKeeper-trunk - Build # 2596 - Still Failing
Posted by Apache Jenkins Server <je...@builds.apache.org>.
See https://builds.apache.org/job/ZooKeeper-trunk/2596/
###################################################################################
########################## LAST 60 LINES OF THE CONSOLE ###########################
[...truncated 348958 lines...]
[junit] 2015-02-15 11:14:42,095 [myid:] - INFO [main:FileTxnSnapLog@298] - Snapshotting: 0xb to /home/jenkins/jenkins-slave/workspace/ZooKeeper-trunk/trunk/build/test/tmp/test5750547087466025456.junit.dir/version-2/snapshot.b
[junit] 2015-02-15 11:14:42,097 [myid:] - INFO [main:FourLetterWordMain@43] - connecting to 127.0.0.1 11221
[junit] 2015-02-15 11:14:42,098 [myid:] - INFO [NIOServerCxnFactory.AcceptThread:0.0.0.0/0.0.0.0:11221:NIOServerCnxnFactory$AcceptThread@296] - Accepted socket connection from /127.0.0.1:38544
[junit] 2015-02-15 11:14:42,099 [myid:] - INFO [NIOWorkerThread-1:NIOServerCnxn@835] - Processing stat command from /127.0.0.1:38544
[junit] 2015-02-15 11:14:42,099 [myid:] - INFO [NIOWorkerThread-1:NIOServerCnxn$StatCommand@684] - Stat command output
[junit] 2015-02-15 11:14:42,100 [myid:] - INFO [NIOWorkerThread-1:NIOServerCnxn@1006] - Closed socket connection for client /127.0.0.1:38544 (no session established for client)
[junit] 2015-02-15 11:14:42,100 [myid:] - INFO [main:JMXEnv@224] - ensureParent:[InMemoryDataTree, StandaloneServer_port]
[junit] 2015-02-15 11:14:42,102 [myid:] - INFO [main:JMXEnv@241] - expect:InMemoryDataTree
[junit] 2015-02-15 11:14:42,102 [myid:] - INFO [main:JMXEnv@245] - found:InMemoryDataTree org.apache.ZooKeeperService:name0=StandaloneServer_port11221,name1=InMemoryDataTree
[junit] 2015-02-15 11:14:42,102 [myid:] - INFO [main:JMXEnv@241] - expect:StandaloneServer_port
[junit] 2015-02-15 11:14:42,102 [myid:] - INFO [main:JMXEnv@245] - found:StandaloneServer_port org.apache.ZooKeeperService:name0=StandaloneServer_port11221
[junit] 2015-02-15 11:14:42,103 [myid:] - INFO [main:JUnit4ZKTestRunner$LoggedInvokeMethod@55] - Memory used 85028
[junit] 2015-02-15 11:14:42,103 [myid:] - INFO [main:JUnit4ZKTestRunner$LoggedInvokeMethod@60] - Number of threads 24
[junit] 2015-02-15 11:14:42,103 [myid:] - INFO [main:JUnit4ZKTestRunner$LoggedInvokeMethod@65] - FINISHED TEST METHOD testQuota
[junit] 2015-02-15 11:14:42,103 [myid:] - INFO [main:ClientBase@521] - tearDown starting
[junit] 2015-02-15 11:14:42,161 [myid:] - INFO [main:ZooKeeper@968] - Session: 0x102b54949360000 closed
[junit] 2015-02-15 11:14:42,162 [myid:] - INFO [main:ClientBase@491] - STOPPING server
[junit] 2015-02-15 11:14:42,162 [myid:] - INFO [main-EventThread:ClientCnxn$EventThread@531] - EventThread shut down
[junit] 2015-02-15 11:14:42,162 [myid:] - INFO [ConnnectionExpirer:NIOServerCnxnFactory$ConnectionExpirerThread@583] - ConnnectionExpirerThread interrupted
[junit] 2015-02-15 11:14:42,162 [myid:] - INFO [NIOServerCxnFactory.SelectorThread-0:NIOServerCnxnFactory$SelectorThread@420] - selector thread exitted run method
[junit] 2015-02-15 11:14:42,162 [myid:] - INFO [NIOServerCxnFactory.AcceptThread:0.0.0.0/0.0.0.0:11221:NIOServerCnxnFactory$AcceptThread@219] - accept thread exitted run method
[junit] 2015-02-15 11:14:42,162 [myid:] - INFO [NIOServerCxnFactory.SelectorThread-1:NIOServerCnxnFactory$SelectorThread@420] - selector thread exitted run method
[junit] 2015-02-15 11:14:42,163 [myid:] - INFO [main:ZooKeeperServer@440] - shutting down
[junit] 2015-02-15 11:14:42,164 [myid:] - INFO [main:SessionTrackerImpl@232] - Shutting down
[junit] 2015-02-15 11:14:42,164 [myid:] - INFO [main:PrepRequestProcessor@974] - Shutting down
[junit] 2015-02-15 11:14:42,164 [myid:] - INFO [main:SyncRequestProcessor@191] - Shutting down
[junit] 2015-02-15 11:14:42,164 [myid:] - INFO [ProcessThread(sid:0 cport:11221)::PrepRequestProcessor@156] - PrepRequestProcessor exited loop!
[junit] 2015-02-15 11:14:42,165 [myid:] - INFO [SyncThread:0:SyncRequestProcessor@169] - SyncRequestProcessor exited!
[junit] 2015-02-15 11:14:42,165 [myid:] - INFO [main:FinalRequestProcessor@477] - shutdown of request processor complete
[junit] 2015-02-15 11:14:42,165 [myid:] - INFO [main:MBeanRegistry@119] - Unregister MBean [org.apache.ZooKeeperService:name0=StandaloneServer_port11221,name1=InMemoryDataTree]
[junit] 2015-02-15 11:14:42,166 [myid:] - INFO [main:MBeanRegistry@119] - Unregister MBean [org.apache.ZooKeeperService:name0=StandaloneServer_port11221]
[junit] 2015-02-15 11:14:42,166 [myid:] - INFO [main:FourLetterWordMain@43] - connecting to 127.0.0.1 11221
[junit] 2015-02-15 11:14:42,167 [myid:] - INFO [main:JMXEnv@142] - ensureOnly:[]
[junit] 2015-02-15 11:14:42,171 [myid:] - INFO [main:ClientBase@546] - fdcount after test is: 46 at start it was 34
[junit] 2015-02-15 11:14:42,171 [myid:] - INFO [main:ClientBase@548] - sleeping for 20 secs
[junit] 2015-02-15 11:14:42,173 [myid:] - INFO [main:ZKTestCase$1@65] - SUCCEEDED testQuota
[junit] 2015-02-15 11:14:42,173 [myid:] - INFO [main:ZKTestCase$1@60] - FINISHED testQuota
[junit] Tests run: 1, Failures: 0, Errors: 0, Skipped: 0, Time elapsed: 0.545 sec
BUILD FAILED
/home/jenkins/jenkins-slave/workspace/ZooKeeper-trunk/trunk/build.xml:1422: The following error occurred while executing this line:
/home/jenkins/jenkins-slave/workspace/ZooKeeper-trunk/trunk/build.xml:1333: Tests failed!
Total time: 43 minutes 4 seconds
Build step 'Execute shell' marked build as failure
[FINDBUGS] Skipping publisher since build result is FAILURE
[WARNINGS] Skipping publisher since build result is FAILURE
Archiving artifacts
Sending artifact delta relative to ZooKeeper-trunk #2582
Archived 3 artifacts
Archive block size is 32768
Received 0 blocks and 18107648 bytes
Compression is 0.0%
Took 4.8 sec
Recording fingerprints
Recording test results
Publishing Javadoc
Email was triggered for: Failure
Sending email for trigger: Failure
###################################################################################
############################## FAILED TESTS (if any) ##############################
1 tests failed.
REGRESSION: org.apache.zookeeper.test.AsyncHammerTest.testHammer
Error Message:
null
Stack Trace:
junit.framework.AssertionFailedError
at org.apache.zookeeper.test.AsyncHammerTest.testHammer(AsyncHammerTest.java:186)
at org.apache.zookeeper.JUnit4ZKTestRunner$LoggedInvokeMethod.evaluate(JUnit4ZKTestRunner.java:52)
ZooKeeper-trunk - Build # 2595 - Still Failing
Posted by Apache Jenkins Server <je...@builds.apache.org>.
See https://builds.apache.org/job/ZooKeeper-trunk/2595/
###################################################################################
########################## LAST 60 LINES OF THE CONSOLE ###########################
[...truncated 353708 lines...]
[junit] 2015-02-14 11:16:09,577 [myid:] - INFO [main:FileTxnSnapLog@298] - Snapshotting: 0xb to /home/jenkins/jenkins-slave/workspace/ZooKeeper-trunk/trunk/build/test/tmp/test6953503950586754470.junit.dir/version-2/snapshot.b
[junit] 2015-02-14 11:16:09,579 [myid:] - INFO [main:FourLetterWordMain@43] - connecting to 127.0.0.1 11221
[junit] 2015-02-14 11:16:09,580 [myid:] - INFO [NIOServerCxnFactory.AcceptThread:0.0.0.0/0.0.0.0:11221:NIOServerCnxnFactory$AcceptThread@296] - Accepted socket connection from /127.0.0.1:42444
[junit] 2015-02-14 11:16:09,581 [myid:] - INFO [NIOWorkerThread-1:NIOServerCnxn@835] - Processing stat command from /127.0.0.1:42444
[junit] 2015-02-14 11:16:09,581 [myid:] - INFO [NIOWorkerThread-1:NIOServerCnxn$StatCommand@684] - Stat command output
[junit] 2015-02-14 11:16:09,582 [myid:] - INFO [NIOWorkerThread-1:NIOServerCnxn@1006] - Closed socket connection for client /127.0.0.1:42444 (no session established for client)
[junit] 2015-02-14 11:16:09,582 [myid:] - INFO [main:JMXEnv@224] - ensureParent:[InMemoryDataTree, StandaloneServer_port]
[junit] 2015-02-14 11:16:09,584 [myid:] - INFO [main:JMXEnv@241] - expect:InMemoryDataTree
[junit] 2015-02-14 11:16:09,584 [myid:] - INFO [main:JMXEnv@245] - found:InMemoryDataTree org.apache.ZooKeeperService:name0=StandaloneServer_port11221,name1=InMemoryDataTree
[junit] 2015-02-14 11:16:09,584 [myid:] - INFO [main:JMXEnv@241] - expect:StandaloneServer_port
[junit] 2015-02-14 11:16:09,584 [myid:] - INFO [main:JMXEnv@245] - found:StandaloneServer_port org.apache.ZooKeeperService:name0=StandaloneServer_port11221
[junit] 2015-02-14 11:16:09,585 [myid:] - INFO [main:JUnit4ZKTestRunner$LoggedInvokeMethod@55] - Memory used 85028
[junit] 2015-02-14 11:16:09,585 [myid:] - INFO [main:JUnit4ZKTestRunner$LoggedInvokeMethod@60] - Number of threads 24
[junit] 2015-02-14 11:16:09,585 [myid:] - INFO [main:JUnit4ZKTestRunner$LoggedInvokeMethod@65] - FINISHED TEST METHOD testQuota
[junit] 2015-02-14 11:16:09,585 [myid:] - INFO [main:ClientBase@521] - tearDown starting
[junit] 2015-02-14 11:16:09,645 [myid:] - INFO [main:ZooKeeper@968] - Session: 0x102b02442ef0000 closed
[junit] 2015-02-14 11:16:09,645 [myid:] - INFO [main:ClientBase@491] - STOPPING server
[junit] 2015-02-14 11:16:09,646 [myid:] - INFO [main-EventThread:ClientCnxn$EventThread@531] - EventThread shut down
[junit] 2015-02-14 11:16:09,646 [myid:] - INFO [NIOServerCxnFactory.AcceptThread:0.0.0.0/0.0.0.0:11221:NIOServerCnxnFactory$AcceptThread@219] - accept thread exitted run method
[junit] 2015-02-14 11:16:09,646 [myid:] - INFO [ConnnectionExpirer:NIOServerCnxnFactory$ConnectionExpirerThread@583] - ConnnectionExpirerThread interrupted
[junit] 2015-02-14 11:16:09,646 [myid:] - INFO [NIOServerCxnFactory.SelectorThread-1:NIOServerCnxnFactory$SelectorThread@420] - selector thread exitted run method
[junit] 2015-02-14 11:16:09,646 [myid:] - INFO [NIOServerCxnFactory.SelectorThread-0:NIOServerCnxnFactory$SelectorThread@420] - selector thread exitted run method
[junit] 2015-02-14 11:16:09,647 [myid:] - INFO [main:ZooKeeperServer@440] - shutting down
[junit] 2015-02-14 11:16:09,647 [myid:] - INFO [main:SessionTrackerImpl@232] - Shutting down
[junit] 2015-02-14 11:16:09,647 [myid:] - INFO [main:PrepRequestProcessor@974] - Shutting down
[junit] 2015-02-14 11:16:09,647 [myid:] - INFO [main:SyncRequestProcessor@191] - Shutting down
[junit] 2015-02-14 11:16:09,648 [myid:] - INFO [ProcessThread(sid:0 cport:11221)::PrepRequestProcessor@156] - PrepRequestProcessor exited loop!
[junit] 2015-02-14 11:16:09,648 [myid:] - INFO [SyncThread:0:SyncRequestProcessor@169] - SyncRequestProcessor exited!
[junit] 2015-02-14 11:16:09,649 [myid:] - INFO [main:FinalRequestProcessor@477] - shutdown of request processor complete
[junit] 2015-02-14 11:16:09,649 [myid:] - INFO [main:MBeanRegistry@119] - Unregister MBean [org.apache.ZooKeeperService:name0=StandaloneServer_port11221,name1=InMemoryDataTree]
[junit] 2015-02-14 11:16:09,649 [myid:] - INFO [main:MBeanRegistry@119] - Unregister MBean [org.apache.ZooKeeperService:name0=StandaloneServer_port11221]
[junit] 2015-02-14 11:16:09,650 [myid:] - INFO [main:FourLetterWordMain@43] - connecting to 127.0.0.1 11221
[junit] 2015-02-14 11:16:09,650 [myid:] - INFO [main:JMXEnv@142] - ensureOnly:[]
[junit] 2015-02-14 11:16:09,654 [myid:] - INFO [main:ClientBase@546] - fdcount after test is: 46 at start it was 34
[junit] 2015-02-14 11:16:09,654 [myid:] - INFO [main:ClientBase@548] - sleeping for 20 secs
[junit] 2015-02-14 11:16:09,656 [myid:] - INFO [main:ZKTestCase$1@65] - SUCCEEDED testQuota
[junit] 2015-02-14 11:16:09,656 [myid:] - INFO [main:ZKTestCase$1@60] - FINISHED testQuota
[junit] Tests run: 1, Failures: 0, Errors: 0, Skipped: 0, Time elapsed: 0.567 sec
BUILD FAILED
/home/jenkins/jenkins-slave/workspace/ZooKeeper-trunk/trunk/build.xml:1422: The following error occurred while executing this line:
/home/jenkins/jenkins-slave/workspace/ZooKeeper-trunk/trunk/build.xml:1333: Tests failed!
Total time: 44 minutes 29 seconds
Build step 'Execute shell' marked build as failure
[FINDBUGS] Skipping publisher since build result is FAILURE
[WARNINGS] Skipping publisher since build result is FAILURE
Archiving artifacts
Sending artifact delta relative to ZooKeeper-trunk #2582
Archived 3 artifacts
Archive block size is 32768
Received 0 blocks and 18104180 bytes
Compression is 0.0%
Took 4.7 sec
Recording fingerprints
Recording test results
Publishing Javadoc
Email was triggered for: Failure
Sending email for trigger: Failure
###################################################################################
############################## FAILED TESTS (if any) ##############################
1 tests failed.
FAILED: org.apache.zookeeper.test.ReconfigTest.testPortChange
Error Message:
expected:<test[1]> but was:<test[0]>
Stack Trace:
junit.framework.AssertionFailedError: expected:<test[1]> but was:<test[0]>
at org.apache.zookeeper.test.ReconfigTest.testNormalOperation(ReconfigTest.java:151)
at org.apache.zookeeper.test.ReconfigTest.testPortChange(ReconfigTest.java:600)
at org.apache.zookeeper.JUnit4ZKTestRunner$LoggedInvokeMethod.evaluate(JUnit4ZKTestRunner.java:52)
ZooKeeper-trunk - Build # 2594 - Still Failing
Posted by Apache Jenkins Server <je...@builds.apache.org>.
See https://builds.apache.org/job/ZooKeeper-trunk/2594/
###################################################################################
########################## LAST 60 LINES OF THE CONSOLE ###########################
[...truncated 349261 lines...]
[junit] 2015-02-13 11:14:56,486 [myid:] - INFO [main:FileTxnSnapLog@298] - Snapshotting: 0xb to /home/jenkins/jenkins-slave/workspace/ZooKeeper-trunk/trunk/build/test/tmp/test1233063270114385390.junit.dir/version-2/snapshot.b
[junit] 2015-02-13 11:14:56,488 [myid:] - INFO [main:FourLetterWordMain@43] - connecting to 127.0.0.1 11221
[junit] 2015-02-13 11:14:56,489 [myid:] - INFO [NIOServerCxnFactory.AcceptThread:0.0.0.0/0.0.0.0:11221:NIOServerCnxnFactory$AcceptThread@296] - Accepted socket connection from /127.0.0.1:39037
[junit] 2015-02-13 11:14:56,490 [myid:] - INFO [NIOWorkerThread-1:NIOServerCnxn@835] - Processing stat command from /127.0.0.1:39037
[junit] 2015-02-13 11:14:56,490 [myid:] - INFO [NIOWorkerThread-1:NIOServerCnxn$StatCommand@684] - Stat command output
[junit] 2015-02-13 11:14:56,491 [myid:] - INFO [NIOWorkerThread-1:NIOServerCnxn@1006] - Closed socket connection for client /127.0.0.1:39037 (no session established for client)
[junit] 2015-02-13 11:14:56,491 [myid:] - INFO [main:JMXEnv@224] - ensureParent:[InMemoryDataTree, StandaloneServer_port]
[junit] 2015-02-13 11:14:56,493 [myid:] - INFO [main:JMXEnv@241] - expect:InMemoryDataTree
[junit] 2015-02-13 11:14:56,493 [myid:] - INFO [main:JMXEnv@245] - found:InMemoryDataTree org.apache.ZooKeeperService:name0=StandaloneServer_port11221,name1=InMemoryDataTree
[junit] 2015-02-13 11:14:56,493 [myid:] - INFO [main:JMXEnv@241] - expect:StandaloneServer_port
[junit] 2015-02-13 11:14:56,493 [myid:] - INFO [main:JMXEnv@245] - found:StandaloneServer_port org.apache.ZooKeeperService:name0=StandaloneServer_port11221
[junit] 2015-02-13 11:14:56,494 [myid:] - INFO [main:JUnit4ZKTestRunner$LoggedInvokeMethod@55] - Memory used 85028
[junit] 2015-02-13 11:14:56,494 [myid:] - INFO [main:JUnit4ZKTestRunner$LoggedInvokeMethod@60] - Number of threads 24
[junit] 2015-02-13 11:14:56,494 [myid:] - INFO [main:JUnit4ZKTestRunner$LoggedInvokeMethod@65] - FINISHED TEST METHOD testQuota
[junit] 2015-02-13 11:14:56,494 [myid:] - INFO [main:ClientBase@521] - tearDown starting
[junit] 2015-02-13 11:14:56,556 [myid:] - INFO [main:ZooKeeper@968] - Session: 0x102aafcc9710000 closed
[junit] 2015-02-13 11:14:56,556 [myid:] - INFO [main:ClientBase@491] - STOPPING server
[junit] 2015-02-13 11:14:56,557 [myid:] - INFO [main-EventThread:ClientCnxn$EventThread@531] - EventThread shut down
[junit] 2015-02-13 11:14:56,557 [myid:] - INFO [NIOServerCxnFactory.SelectorThread-0:NIOServerCnxnFactory$SelectorThread@420] - selector thread exitted run method
[junit] 2015-02-13 11:14:56,557 [myid:] - INFO [NIOServerCxnFactory.AcceptThread:0.0.0.0/0.0.0.0:11221:NIOServerCnxnFactory$AcceptThread@219] - accept thread exitted run method
[junit] 2015-02-13 11:14:56,557 [myid:] - INFO [NIOServerCxnFactory.SelectorThread-1:NIOServerCnxnFactory$SelectorThread@420] - selector thread exitted run method
[junit] 2015-02-13 11:14:56,557 [myid:] - INFO [ConnnectionExpirer:NIOServerCnxnFactory$ConnectionExpirerThread@583] - ConnnectionExpirerThread interrupted
[junit] 2015-02-13 11:14:56,558 [myid:] - INFO [main:ZooKeeperServer@440] - shutting down
[junit] 2015-02-13 11:14:56,558 [myid:] - INFO [main:SessionTrackerImpl@232] - Shutting down
[junit] 2015-02-13 11:14:56,559 [myid:] - INFO [main:PrepRequestProcessor@974] - Shutting down
[junit] 2015-02-13 11:14:56,559 [myid:] - INFO [main:SyncRequestProcessor@191] - Shutting down
[junit] 2015-02-13 11:14:56,559 [myid:] - INFO [ProcessThread(sid:0 cport:11221)::PrepRequestProcessor@156] - PrepRequestProcessor exited loop!
[junit] 2015-02-13 11:14:56,559 [myid:] - INFO [SyncThread:0:SyncRequestProcessor@169] - SyncRequestProcessor exited!
[junit] 2015-02-13 11:14:56,560 [myid:] - INFO [main:FinalRequestProcessor@477] - shutdown of request processor complete
[junit] 2015-02-13 11:14:56,560 [myid:] - INFO [main:MBeanRegistry@119] - Unregister MBean [org.apache.ZooKeeperService:name0=StandaloneServer_port11221,name1=InMemoryDataTree]
[junit] 2015-02-13 11:14:56,561 [myid:] - INFO [main:MBeanRegistry@119] - Unregister MBean [org.apache.ZooKeeperService:name0=StandaloneServer_port11221]
[junit] 2015-02-13 11:14:56,561 [myid:] - INFO [main:FourLetterWordMain@43] - connecting to 127.0.0.1 11221
[junit] 2015-02-13 11:14:56,561 [myid:] - INFO [main:JMXEnv@142] - ensureOnly:[]
[junit] 2015-02-13 11:14:56,566 [myid:] - INFO [main:ClientBase@546] - fdcount after test is: 46 at start it was 34
[junit] 2015-02-13 11:14:56,566 [myid:] - INFO [main:ClientBase@548] - sleeping for 20 secs
[junit] 2015-02-13 11:14:56,568 [myid:] - INFO [main:ZKTestCase$1@65] - SUCCEEDED testQuota
[junit] 2015-02-13 11:14:56,568 [myid:] - INFO [main:ZKTestCase$1@60] - FINISHED testQuota
[junit] Tests run: 1, Failures: 0, Errors: 0, Skipped: 0, Time elapsed: 0.547 sec
BUILD FAILED
/home/jenkins/jenkins-slave/workspace/ZooKeeper-trunk/trunk/build.xml:1422: The following error occurred while executing this line:
/home/jenkins/jenkins-slave/workspace/ZooKeeper-trunk/trunk/build.xml:1333: Tests failed!
Total time: 43 minutes 16 seconds
Build step 'Execute shell' marked build as failure
[FINDBUGS] Skipping publisher since build result is FAILURE
[WARNINGS] Skipping publisher since build result is FAILURE
Archiving artifacts
Sending artifact delta relative to ZooKeeper-trunk #2582
Archived 3 artifacts
Archive block size is 32768
Received 0 blocks and 18102278 bytes
Compression is 0.0%
Took 4.7 sec
Recording fingerprints
Recording test results
Publishing Javadoc
Email was triggered for: Failure
Sending email for trigger: Failure
###################################################################################
############################## FAILED TESTS (if any) ##############################
2 tests failed.
REGRESSION: org.apache.zookeeper.test.AsyncHammerTest.testHammer
Error Message:
null
Stack Trace:
junit.framework.AssertionFailedError
at org.apache.zookeeper.test.AsyncHammerTest.testHammer(AsyncHammerTest.java:186)
at org.apache.zookeeper.JUnit4ZKTestRunner$LoggedInvokeMethod.evaluate(JUnit4ZKTestRunner.java:52)
REGRESSION: org.apache.zookeeper.test.ReconfigTest.testPortChange
Error Message:
expected:<test[1]> but was:<test[0]>
Stack Trace:
junit.framework.AssertionFailedError: expected:<test[1]> but was:<test[0]>
at org.apache.zookeeper.test.ReconfigTest.testNormalOperation(ReconfigTest.java:151)
at org.apache.zookeeper.test.ReconfigTest.testPortChange(ReconfigTest.java:600)
at org.apache.zookeeper.JUnit4ZKTestRunner$LoggedInvokeMethod.evaluate(JUnit4ZKTestRunner.java:52)