You are viewing a plain text version of this content. The canonical link for it is here.
Posted to builds@beam.apache.org by Apache Jenkins Server <je...@builds.apache.org> on 2022/09/16 19:17:32 UTC
Build failed in Jenkins: beam_PerformanceTests_InfluxDbIO_IT #2328
See <https://ci-beam.apache.org/job/beam_PerformanceTests_InfluxDbIO_IT/2328/display/redirect?page=changes>
Changes:
[noreply] [Website] Correct spelling of structural (#23225)
[noreply] TensorRT Initial commit (#22131)
[noreply] Fix Kafka performance test sourceOption to match expected hash (#23274)
------------------------------------------
[...truncated 185.03 KB...]
Resolve mutations for :runners:java-fn-execution:compileJava (Thread[Execution worker Thread 2,5,main]) completed. Took 0.0 secs.
:runners:java-fn-execution:compileJava (Thread[Execution worker Thread 5,5,main]) started.
> Task :runners:java-fn-execution:compileJava FROM-CACHE
Custom actions are attached to task ':runners:java-fn-execution:compileJava'.
Build cache key for task ':runners:java-fn-execution:compileJava' is fe71cd3c0e12fd6a8bc12d21975a91d1
Task ':runners:java-fn-execution:compileJava' is not up-to-date because:
No history is available.
Loaded cache entry for task ':runners:java-fn-execution:compileJava' with cache key fe71cd3c0e12fd6a8bc12d21975a91d1
:runners:java-fn-execution:compileJava (Thread[Execution worker Thread 5,5,main]) completed. Took 0.087 secs.
Resolve mutations for :runners:java-fn-execution:classes (Thread[Execution worker Thread 5,5,main]) started.
Resolve mutations for :runners:java-fn-execution:classes (Thread[Execution worker Thread 5,5,main]) completed. Took 0.0 secs.
:runners:java-fn-execution:classes (Thread[Execution worker Thread 5,5,main]) started.
> Task :runners:java-fn-execution:classes UP-TO-DATE
Skipping task ':runners:java-fn-execution:classes' as it has no actions.
:runners:java-fn-execution:classes (Thread[Execution worker Thread 5,5,main]) completed. Took 0.0 secs.
Resolve mutations for :runners:java-fn-execution:jar (Thread[Execution worker Thread 5,5,main]) started.
Resolve mutations for :runners:java-fn-execution:jar (Thread[Execution worker Thread 5,5,main]) completed. Took 0.0 secs.
:runners:java-fn-execution:jar (Thread[Execution worker Thread 6,5,main]) started.
> Task :runners:java-fn-execution:jar
Caching disabled for task ':runners:java-fn-execution:jar' because:
Not worth caching
Task ':runners:java-fn-execution:jar' is not up-to-date because:
No history is available.
file or directory '<https://ci-beam.apache.org/job/beam_PerformanceTests_InfluxDbIO_IT/ws/src/runners/java-fn-execution/build/resources/main',> not found
:runners:java-fn-execution:jar (Thread[Execution worker Thread 6,5,main]) completed. Took 0.04 secs.
work action resolve beam-runners-java-fn-execution.jar (project :runners:java-fn-execution) (Thread[Execution worker Thread 6,5,main]) started.
work action null (Thread[Execution worker Thread 6,5,main]) completed. Took 0.0 secs.
Resolve mutations for :runners:direct-java:compileJava (Thread[Execution worker Thread 6,5,main]) started.
Resolve mutations for :runners:direct-java:compileJava (Thread[Execution worker Thread 6,5,main]) completed. Took 0.0 secs.
:runners:direct-java:compileJava (Thread[Execution worker Thread 4,5,main]) started.
> Task :runners:direct-java:compileJava FROM-CACHE
Custom actions are attached to task ':runners:direct-java:compileJava'.
Build cache key for task ':runners:direct-java:compileJava' is a3733318a34234f0c4ccc15aa6e7c1a8
Task ':runners:direct-java:compileJava' is not up-to-date because:
No history is available.
Loaded cache entry for task ':runners:direct-java:compileJava' with cache key a3733318a34234f0c4ccc15aa6e7c1a8
:runners:direct-java:compileJava (Thread[Execution worker Thread 4,5,main]) completed. Took 0.092 secs.
Resolve mutations for :runners:direct-java:classes (Thread[Execution worker,5,main]) started.
Resolve mutations for :runners:direct-java:classes (Thread[Execution worker,5,main]) completed. Took 0.0 secs.
:runners:direct-java:classes (Thread[Execution worker,5,main]) started.
> Task :runners:direct-java:classes UP-TO-DATE
Skipping task ':runners:direct-java:classes' as it has no actions.
:runners:direct-java:classes (Thread[Execution worker,5,main]) completed. Took 0.0 secs.
Resolve mutations for :runners:direct-java:shadowJar (Thread[Execution worker,5,main]) started.
Resolve mutations for :runners:direct-java:shadowJar (Thread[Execution worker,5,main]) completed. Took 0.0 secs.
:runners:direct-java:shadowJar (Thread[included builds,5,main]) started.
> Task :runners:core-java:compileTestJava FROM-CACHE
Custom actions are attached to task ':runners:core-java:compileTestJava'.
Build cache key for task ':runners:core-java:compileTestJava' is 2c2711a187e4b603d11a41b926619f03
Task ':runners:core-java:compileTestJava' is not up-to-date because:
No history is available.
Loaded cache entry for task ':runners:core-java:compileTestJava' with cache key 2c2711a187e4b603d11a41b926619f03
:runners:core-java:compileTestJava (Thread[Execution worker Thread 3,5,main]) completed. Took 0.339 secs.
Resolve mutations for :runners:core-java:testClasses (Thread[Execution worker Thread 3,5,main]) started.
Resolve mutations for :runners:core-java:testClasses (Thread[Execution worker Thread 3,5,main]) completed. Took 0.0 secs.
:runners:core-java:testClasses (Thread[Execution worker Thread 3,5,main]) started.
> Task :runners:core-java:testClasses UP-TO-DATE
Skipping task ':runners:core-java:testClasses' as it has no actions.
:runners:core-java:testClasses (Thread[Execution worker Thread 3,5,main]) completed. Took 0.0 secs.
Resolve mutations for :runners:core-java:testJar (Thread[Execution worker Thread 3,5,main]) started.
Resolve mutations for :runners:core-java:testJar (Thread[Execution worker Thread 3,5,main]) completed. Took 0.0 secs.
:runners:core-java:testJar (Thread[Execution worker Thread 4,5,main]) started.
> Task :runners:core-java:testJar
Caching disabled for task ':runners:core-java:testJar' because:
Not worth caching
Task ':runners:core-java:testJar' is not up-to-date because:
No history is available.
file or directory '<https://ci-beam.apache.org/job/beam_PerformanceTests_InfluxDbIO_IT/ws/src/runners/core-java/build/resources/test',> not found
:runners:core-java:testJar (Thread[Execution worker Thread 4,5,main]) completed. Took 0.034 secs.
work action resolve beam-runners-core-java-tests.jar (project :runners:core-java) (Thread[Execution worker Thread 4,5,main]) started.
work action null (Thread[Execution worker Thread 4,5,main]) completed. Took 0.0 secs.
> Task :runners:direct-java:shadowJar FROM-CACHE
Custom actions are attached to task ':runners:direct-java:shadowJar'.
Build cache key for task ':runners:direct-java:shadowJar' is 11d762368b5e9134d317b0738adf48a4
Task ':runners:direct-java:shadowJar' is not up-to-date because:
No history is available.
Loaded cache entry for task ':runners:direct-java:shadowJar' with cache key 11d762368b5e9134d317b0738adf48a4
:runners:direct-java:shadowJar (Thread[included builds,5,main]) completed. Took 0.297 secs.
work action resolve beam-runners-direct-java.jar (project :runners:direct-java) (Thread[included builds,5,main]) started.
work action null (Thread[included builds,5,main]) completed. Took 0.0 secs.
work action resolve beam-runners-direct-java.jar (project :runners:direct-java) (Thread[included builds,5,main]) started.
work action null (Thread[included builds,5,main]) completed. Took 0.0 secs.
Resolve mutations for :runners:direct-java:compileTestJava (Thread[included builds,5,main]) started.
Resolve mutations for :runners:direct-java:compileTestJava (Thread[included builds,5,main]) completed. Took 0.0 secs.
:runners:direct-java:compileTestJava (Thread[Execution worker Thread 2,5,main]) started.
> Task :runners:direct-java:compileTestJava FROM-CACHE
Custom actions are attached to task ':runners:direct-java:compileTestJava'.
Build cache key for task ':runners:direct-java:compileTestJava' is 6f9b73dbbacf6a9ce65dff8e087aa583
Task ':runners:direct-java:compileTestJava' is not up-to-date because:
No history is available.
Loaded cache entry for task ':runners:direct-java:compileTestJava' with cache key 6f9b73dbbacf6a9ce65dff8e087aa583
:runners:direct-java:compileTestJava (Thread[Execution worker Thread 2,5,main]) completed. Took 0.126 secs.
Resolve mutations for :runners:direct-java:testClasses (Thread[Execution worker Thread 2,5,main]) started.
Resolve mutations for :runners:direct-java:testClasses (Thread[Execution worker Thread 2,5,main]) completed. Took 0.0 secs.
:runners:direct-java:testClasses (Thread[Execution worker,5,main]) started.
> Task :runners:direct-java:testClasses UP-TO-DATE
Skipping task ':runners:direct-java:testClasses' as it has no actions.
:runners:direct-java:testClasses (Thread[Execution worker,5,main]) completed. Took 0.0 secs.
Resolve mutations for :runners:direct-java:shadowTestJar (Thread[Execution worker Thread 3,5,main]) started.
Resolve mutations for :runners:direct-java:shadowTestJar (Thread[Execution worker Thread 3,5,main]) completed. Took 0.0 secs.
:runners:direct-java:shadowTestJar (Thread[Execution worker Thread 3,5,main]) started.
> Task :runners:direct-java:shadowTestJar FROM-CACHE
Build cache key for task ':runners:direct-java:shadowTestJar' is bfe27741881843f362850380fed3b3fe
Task ':runners:direct-java:shadowTestJar' is not up-to-date because:
No history is available.
Loaded cache entry for task ':runners:direct-java:shadowTestJar' with cache key bfe27741881843f362850380fed3b3fe
:runners:direct-java:shadowTestJar (Thread[Execution worker Thread 3,5,main]) completed. Took 0.202 secs.
work action resolve beam-runners-direct-java-tests.jar (project :runners:direct-java) (Thread[Execution worker Thread 3,5,main]) started.
work action null (Thread[Execution worker Thread 3,5,main]) completed. Took 0.0 secs.
Resolve mutations for :sdks:java:io:influxdb:integrationTest (Thread[Execution worker Thread 3,5,main]) started.
Resolve mutations for :sdks:java:io:influxdb:integrationTest (Thread[Execution worker Thread 3,5,main]) completed. Took 0.0 secs.
:sdks:java:io:influxdb:integrationTest (Thread[Execution worker,5,main]) started.
producer locations for task group 0 (Thread[included builds,5,main]) started.
producer locations for task group 0 (Thread[included builds,5,main]) completed. Took 0.0 secs.
Gradle Test Executor 204 started executing tests.
> Task :sdks:java:io:influxdb:integrationTest
Custom actions are attached to task ':sdks:java:io:influxdb:integrationTest'.
Build cache key for task ':sdks:java:io:influxdb:integrationTest' is 8fd386cc3de9837efa4d8f303672676e
Task ':sdks:java:io:influxdb:integrationTest' is not up-to-date because:
Task.upToDateWhen is false.
Starting process 'Gradle Test Executor 204'. Working directory: <https://ci-beam.apache.org/job/beam_PerformanceTests_InfluxDbIO_IT/ws/src/sdks/java/io/influxdb> Command: /usr/lib/jvm/java-8-openjdk-amd64/bin/java -DbeamTestPipelineOptions=["--influxDBURL=http://34.69.123.87:8086","--influxDBUserName=superadmin","--influxDBPassword=supersecretpassword","--databaseName=db1"] -Djava.security.manager=worker.org.gradle.process.internal.worker.child.BootstrapSecurityManager -Dorg.gradle.internal.worker.tmpdir=<https://ci-beam.apache.org/job/beam_PerformanceTests_InfluxDbIO_IT/ws/src/sdks/java/io/influxdb/build/tmp/integrationTest/work> -Dorg.gradle.native=false -Xmx2g -Dfile.encoding=UTF-8 -Duser.country=US -Duser.language=en -Duser.variant -ea -cp /home/jenkins/.gradle/caches/7.5.1/workerMain/gradle-worker.jar worker.org.gradle.process.internal.worker.GradleWorkerMain 'Gradle Test Executor 204'
Successfully started process 'Gradle Test Executor 204'
org.apache.beam.sdk.io.influxdb.InfluxDbIOIT > testWriteAndReadWithMultipleMetric FAILED
org.influxdb.InfluxDBIOException: java.net.SocketTimeoutException: connect timed out
at org.influxdb.impl.InfluxDBImpl.execute(InfluxDBImpl.java:836)
at org.influxdb.impl.InfluxDBImpl.executeQuery(InfluxDBImpl.java:819)
at org.influxdb.impl.InfluxDBImpl.query(InfluxDBImpl.java:554)
at org.apache.beam.sdk.io.influxdb.InfluxDbIOIT.initTest(InfluxDbIOIT.java:99)
Caused by:
java.net.SocketTimeoutException: connect timed out
at java.net.PlainSocketImpl.socketConnect(Native Method)
at java.net.AbstractPlainSocketImpl.doConnect(AbstractPlainSocketImpl.java:350)
at java.net.AbstractPlainSocketImpl.connectToAddress(AbstractPlainSocketImpl.java:206)
at java.net.AbstractPlainSocketImpl.connect(AbstractPlainSocketImpl.java:188)
at java.net.SocksSocketImpl.connect(SocksSocketImpl.java:392)
at java.net.Socket.connect(Socket.java:607)
at okhttp3.internal.platform.Platform.connectSocket(Platform.kt:119)
at okhttp3.internal.connection.RealConnection.connectSocket(RealConnection.kt:283)
at okhttp3.internal.connection.RealConnection.connect(RealConnection.kt:195)
at okhttp3.internal.connection.ExchangeFinder.findConnection(ExchangeFinder.kt:249)
at okhttp3.internal.connection.ExchangeFinder.findHealthyConnection(ExchangeFinder.kt:108)
at okhttp3.internal.connection.ExchangeFinder.find(ExchangeFinder.kt:76)
at okhttp3.internal.connection.RealCall.initExchange$okhttp(RealCall.kt:245)
at okhttp3.internal.connection.ConnectInterceptor.intercept(ConnectInterceptor.kt:32)
at okhttp3.internal.http.RealInterceptorChain.proceed(RealInterceptorChain.kt:100)
at okhttp3.internal.cache.CacheInterceptor.intercept(CacheInterceptor.kt:82)
at okhttp3.internal.http.RealInterceptorChain.proceed(RealInterceptorChain.kt:100)
at okhttp3.internal.http.BridgeInterceptor.intercept(BridgeInterceptor.kt:83)
at okhttp3.internal.http.RealInterceptorChain.proceed(RealInterceptorChain.kt:100)
at okhttp3.internal.http.RetryAndFollowUpInterceptor.intercept(RetryAndFollowUpInterceptor.kt:76)
at okhttp3.internal.http.RealInterceptorChain.proceed(RealInterceptorChain.kt:100)
at org.influxdb.impl.BasicAuthInterceptor.intercept(BasicAuthInterceptor.java:22)
at okhttp3.internal.http.RealInterceptorChain.proceed(RealInterceptorChain.kt:100)
at org.influxdb.impl.GzipRequestInterceptor.intercept(GzipRequestInterceptor.java:42)
at okhttp3.internal.http.RealInterceptorChain.proceed(RealInterceptorChain.kt:100)
at okhttp3.logging.HttpLoggingInterceptor.intercept(HttpLoggingInterceptor.kt:152)
at okhttp3.internal.http.RealInterceptorChain.proceed(RealInterceptorChain.kt:100)
at okhttp3.internal.connection.RealCall.getResponseWithInterceptorChain$okhttp(RealCall.kt:197)
at okhttp3.internal.connection.RealCall.execute(RealCall.kt:148)
at retrofit2.OkHttpCall.execute(OkHttpCall.java:190)
at org.influxdb.impl.InfluxDBImpl.execute(InfluxDBImpl.java:824)
... 3 more
org.apache.beam.sdk.io.influxdb.InfluxDbIOIT > testWriteAndRead FAILED
java.lang.AssertionError: Count All/Flatten.PCollections.out:
Expected: <2000L>
but: was <1999L>
at org.apache.beam.sdk.testing.PAssert$PAssertionSite.capture(PAssert.java:175)
at org.apache.beam.sdk.testing.PAssert.thatSingleton(PAssert.java:498)
at org.apache.beam.sdk.testing.PAssert.thatSingleton(PAssert.java:490)
at org.apache.beam.sdk.io.influxdb.InfluxDbIOIT.testWriteAndRead(InfluxDbIOIT.java:162)
Caused by:
java.lang.AssertionError:
Expected: <2000L>
but: was <1999L>
at org.hamcrest.MatcherAssert.assertThat(MatcherAssert.java:18)
at org.hamcrest.MatcherAssert.assertThat(MatcherAssert.java:6)
at org.apache.beam.sdk.testing.PAssert$AssertIsEqualTo.apply(PAssert.java:1643)
at org.apache.beam.sdk.testing.PAssert$AssertIsEqualTo.apply(PAssert.java:1634)
at org.apache.beam.sdk.testing.PAssert$CheckRelationAgainstExpected.apply(PAssert.java:1299)
at org.apache.beam.sdk.testing.PAssert$CheckRelationAgainstExpected.apply(PAssert.java:1279)
at org.apache.beam.sdk.testing.PAssert.doChecks(PAssert.java:1621)
at org.apache.beam.sdk.testing.PAssert$SingletonCheckerDoFn.processElement(PAssert.java:1614)
at org.apache.beam.sdk.testing.PAssert$SingletonCheckerDoFn$DoFnInvoker.invokeProcessElement(Unknown Source)
at org.apache.beam.repackaged.direct_java.runners.core.SimpleDoFnRunner.invokeProcessElement(SimpleDoFnRunner.java:211)
at org.apache.beam.repackaged.direct_java.runners.core.SimpleDoFnRunner.processElement(SimpleDoFnRunner.java:188)
at org.apache.beam.repackaged.direct_java.runners.core.SimplePushbackSideInputDoFnRunner.processElementInReadyWindows(SimplePushbackSideInputDoFnRunner.java:79)
at org.apache.beam.runners.direct.ParDoEvaluator.processElement(ParDoEvaluator.java:244)
at org.apache.beam.runners.direct.DoFnLifecycleManagerRemovingTransformEvaluator.processElement(DoFnLifecycleManagerRemovingTransformEvaluator.java:54)
at org.apache.beam.runners.direct.DirectTransformExecutor.processElements(DirectTransformExecutor.java:165)
at org.apache.beam.runners.direct.DirectTransformExecutor.run(DirectTransformExecutor.java:129)
at java.util.concurrent.Executors$RunnableAdapter.call(Executors.java:511)
at java.util.concurrent.FutureTask.run(FutureTask.java:266)
at java.util.concurrent.ThreadPoolExecutor.runWorker(ThreadPoolExecutor.java:1149)
at java.util.concurrent.ThreadPoolExecutor$Worker.run(ThreadPoolExecutor.java:624)
at java.lang.Thread.run(Thread.java:750)
Gradle Test Executor 204 finished executing tests.
> Task :sdks:java:io:influxdb:integrationTest FAILED
6 tests completed, 2 failed
Finished generating test XML results (0.001 secs) into: <https://ci-beam.apache.org/job/beam_PerformanceTests_InfluxDbIO_IT/ws/src/sdks/java/io/influxdb/build/test-results/integrationTest>
Generating HTML test report...
Finished generating test html results (0.005 secs) into: <https://ci-beam.apache.org/job/beam_PerformanceTests_InfluxDbIO_IT/ws/src/sdks/java/io/influxdb/build/reports/tests/integrationTest>
:sdks:java:io:influxdb:integrationTest (Thread[Execution worker,5,main]) completed. Took 20.21 secs.
FAILURE: Build failed with an exception.
* What went wrong:
Execution failed for task ':sdks:java:io:influxdb:integrationTest'.
> There were failing tests. See the report at: file://<https://ci-beam.apache.org/job/beam_PerformanceTests_InfluxDbIO_IT/ws/src/sdks/java/io/influxdb/build/reports/tests/integrationTest/index.html>
* Try:
> Run with --stacktrace option to get the stack trace.
> Run with --debug option to get more log output.
* Get more help at https://help.gradle.org
Deprecated Gradle features were used in this build, making it incompatible with Gradle 8.0.
You can use '--warning-mode all' to show the individual deprecation warnings and determine if they come from your own scripts or plugins.
See https://docs.gradle.org/7.5.1/userguide/command_line_interface.html#sec:command_line_warnings
BUILD FAILED in 28s
77 actionable tasks: 42 executed, 33 from cache, 2 up-to-date
Publishing build scan...
https://gradle.com/s/gviralymsskac
Build step 'Invoke Gradle script' changed build result to FAILURE
Build step 'Invoke Gradle script' marked build as failure
---------------------------------------------------------------------
To unsubscribe, e-mail: builds-unsubscribe@beam.apache.org
For additional commands, e-mail: builds-help@beam.apache.org
Jenkins build is back to normal : beam_PerformanceTests_InfluxDbIO_IT #2336
Posted by Apache Jenkins Server <je...@builds.apache.org>.
See <https://ci-beam.apache.org/job/beam_PerformanceTests_InfluxDbIO_IT/2336/display/redirect>
---------------------------------------------------------------------
To unsubscribe, e-mail: builds-unsubscribe@beam.apache.org
For additional commands, e-mail: builds-help@beam.apache.org
Build failed in Jenkins: beam_PerformanceTests_InfluxDbIO_IT #2335
Posted by Apache Jenkins Server <je...@builds.apache.org>.
See <https://ci-beam.apache.org/job/beam_PerformanceTests_InfluxDbIO_IT/2335/display/redirect>
Changes:
------------------------------------------
[...truncated 182.50 KB...]
:sdks:java:core:shadowTestJar (Thread[Execution worker Thread 5,5,main]) completed. Took 0.113 secs.
work action resolve beam-sdks-java-core-tests.jar (project :sdks:java:core) (Thread[Execution worker Thread 5,5,main]) started.
work action null (Thread[Execution worker Thread 5,5,main]) completed. Took 0.0 secs.
Resolve mutations for :runners:core-java:compileTestJava (Thread[Execution worker Thread 5,5,main]) started.
Resolve mutations for :runners:core-java:compileTestJava (Thread[Execution worker Thread 5,5,main]) completed. Took 0.0 secs.
:runners:core-java:compileTestJava (Thread[included builds,5,main]) started.
> Task :sdks:java:harness:compileJava FROM-CACHE
Custom actions are attached to task ':sdks:java:harness:compileJava'.
Build cache key for task ':sdks:java:harness:compileJava' is 55c1ba444de22ad92ffdd61cd925c48a
Task ':sdks:java:harness:compileJava' is not up-to-date because:
No history is available.
Loaded cache entry for task ':sdks:java:harness:compileJava' with cache key 55c1ba444de22ad92ffdd61cd925c48a
:sdks:java:harness:compileJava (Thread[Execution worker Thread 6,5,main]) completed. Took 0.071 secs.
Resolve mutations for :sdks:java:harness:classes (Thread[Execution worker Thread 6,5,main]) started.
Resolve mutations for :sdks:java:harness:classes (Thread[Execution worker Thread 6,5,main]) completed. Took 0.0 secs.
:sdks:java:harness:classes (Thread[Execution worker Thread 7,5,main]) started.
> Task :sdks:java:harness:classes UP-TO-DATE
Skipping task ':sdks:java:harness:classes' as it has no actions.
:sdks:java:harness:classes (Thread[Execution worker Thread 7,5,main]) completed. Took 0.0 secs.
Resolve mutations for :sdks:java:harness:jar (Thread[Execution worker Thread 2,5,main]) started.
Resolve mutations for :sdks:java:harness:jar (Thread[Execution worker Thread 2,5,main]) completed. Took 0.0 secs.
:sdks:java:harness:jar (Thread[Execution worker,5,main]) started.
> Task :sdks:java:harness:jar
Caching disabled for task ':sdks:java:harness:jar' because:
Not worth caching
Task ':sdks:java:harness:jar' is not up-to-date because:
No history is available.
file or directory '<https://ci-beam.apache.org/job/beam_PerformanceTests_InfluxDbIO_IT/ws/src/sdks/java/harness/build/resources/main',> not found
:sdks:java:harness:jar (Thread[Execution worker,5,main]) completed. Took 0.056 secs.
work action resolve beam-sdks-java-harness-unshaded.jar (project :sdks:java:harness) (Thread[Execution worker,5,main]) started.
work action null (Thread[Execution worker,5,main]) completed. Took 0.0 secs.
Resolve mutations for :runners:java-fn-execution:compileJava (Thread[Execution worker Thread 5,5,main]) started.
Resolve mutations for :runners:java-fn-execution:compileJava (Thread[Execution worker Thread 5,5,main]) completed. Took 0.0 secs.
:runners:java-fn-execution:compileJava (Thread[Execution worker Thread 4,5,main]) started.
> Task :runners:java-fn-execution:compileJava FROM-CACHE
Custom actions are attached to task ':runners:java-fn-execution:compileJava'.
Build cache key for task ':runners:java-fn-execution:compileJava' is fe71cd3c0e12fd6a8bc12d21975a91d1
Task ':runners:java-fn-execution:compileJava' is not up-to-date because:
No history is available.
Loaded cache entry for task ':runners:java-fn-execution:compileJava' with cache key fe71cd3c0e12fd6a8bc12d21975a91d1
:runners:java-fn-execution:compileJava (Thread[Execution worker Thread 4,5,main]) completed. Took 0.076 secs.
Resolve mutations for :runners:java-fn-execution:classes (Thread[Execution worker Thread 4,5,main]) started.
Resolve mutations for :runners:java-fn-execution:classes (Thread[Execution worker Thread 4,5,main]) completed. Took 0.0 secs.
:runners:java-fn-execution:classes (Thread[Execution worker Thread 4,5,main]) started.
> Task :runners:java-fn-execution:classes UP-TO-DATE
Skipping task ':runners:java-fn-execution:classes' as it has no actions.
:runners:java-fn-execution:classes (Thread[Execution worker Thread 4,5,main]) completed. Took 0.0 secs.
Resolve mutations for :runners:java-fn-execution:jar (Thread[Execution worker Thread 4,5,main]) started.
Resolve mutations for :runners:java-fn-execution:jar (Thread[Execution worker Thread 4,5,main]) completed. Took 0.0 secs.
:runners:java-fn-execution:jar (Thread[Execution worker Thread 4,5,main]) started.
> Task :runners:java-fn-execution:jar
Caching disabled for task ':runners:java-fn-execution:jar' because:
Not worth caching
Task ':runners:java-fn-execution:jar' is not up-to-date because:
No history is available.
file or directory '<https://ci-beam.apache.org/job/beam_PerformanceTests_InfluxDbIO_IT/ws/src/runners/java-fn-execution/build/resources/main',> not found
:runners:java-fn-execution:jar (Thread[Execution worker Thread 4,5,main]) completed. Took 0.039 secs.
work action resolve beam-runners-java-fn-execution.jar (project :runners:java-fn-execution) (Thread[Execution worker Thread 4,5,main]) started.
work action null (Thread[Execution worker Thread 4,5,main]) completed. Took 0.0 secs.
Resolve mutations for :runners:direct-java:compileJava (Thread[Execution worker Thread 7,5,main]) started.
Resolve mutations for :runners:direct-java:compileJava (Thread[Execution worker Thread 7,5,main]) completed. Took 0.0 secs.
:runners:direct-java:compileJava (Thread[Execution worker Thread 7,5,main]) started.
> Task :runners:core-java:compileTestJava FROM-CACHE
Custom actions are attached to task ':runners:core-java:compileTestJava'.
Build cache key for task ':runners:core-java:compileTestJava' is 2c2711a187e4b603d11a41b926619f03
Task ':runners:core-java:compileTestJava' is not up-to-date because:
No history is available.
Loaded cache entry for task ':runners:core-java:compileTestJava' with cache key 2c2711a187e4b603d11a41b926619f03
:runners:core-java:compileTestJava (Thread[included builds,5,main]) completed. Took 0.305 secs.
Resolve mutations for :runners:core-java:testClasses (Thread[included builds,5,main]) started.
Resolve mutations for :runners:core-java:testClasses (Thread[included builds,5,main]) completed. Took 0.0 secs.
:runners:core-java:testClasses (Thread[included builds,5,main]) started.
> Task :runners:core-java:testClasses UP-TO-DATE
Skipping task ':runners:core-java:testClasses' as it has no actions.
:runners:core-java:testClasses (Thread[included builds,5,main]) completed. Took 0.0 secs.
Resolve mutations for :runners:core-java:testJar (Thread[Execution worker,5,main]) started.
Resolve mutations for :runners:core-java:testJar (Thread[Execution worker,5,main]) completed. Took 0.0 secs.
:runners:core-java:testJar (Thread[Execution worker,5,main]) started.
> Task :runners:direct-java:compileJava FROM-CACHE
Custom actions are attached to task ':runners:direct-java:compileJava'.
Build cache key for task ':runners:direct-java:compileJava' is a3733318a34234f0c4ccc15aa6e7c1a8
Task ':runners:direct-java:compileJava' is not up-to-date because:
No history is available.
Loaded cache entry for task ':runners:direct-java:compileJava' with cache key a3733318a34234f0c4ccc15aa6e7c1a8
:runners:direct-java:compileJava (Thread[Execution worker Thread 7,5,main]) completed. Took 0.084 secs.
Resolve mutations for :runners:direct-java:classes (Thread[included builds,5,main]) started.
Resolve mutations for :runners:direct-java:classes (Thread[included builds,5,main]) completed. Took 0.0 secs.
:runners:direct-java:classes (Thread[Execution worker Thread 5,5,main]) started.
> Task :runners:direct-java:classes UP-TO-DATE
Skipping task ':runners:direct-java:classes' as it has no actions.
:runners:direct-java:classes (Thread[Execution worker Thread 5,5,main]) completed. Took 0.0 secs.
Resolve mutations for :runners:direct-java:shadowJar (Thread[Execution worker Thread 4,5,main]) started.
Resolve mutations for :runners:direct-java:shadowJar (Thread[Execution worker Thread 4,5,main]) completed. Took 0.0 secs.
:runners:direct-java:shadowJar (Thread[Execution worker Thread 4,5,main]) started.
> Task :runners:core-java:testJar
Caching disabled for task ':runners:core-java:testJar' because:
Not worth caching
Task ':runners:core-java:testJar' is not up-to-date because:
No history is available.
file or directory '<https://ci-beam.apache.org/job/beam_PerformanceTests_InfluxDbIO_IT/ws/src/runners/core-java/build/resources/test',> not found
:runners:core-java:testJar (Thread[Execution worker,5,main]) completed. Took 0.033 secs.
work action resolve beam-runners-core-java-tests.jar (project :runners:core-java) (Thread[Execution worker,5,main]) started.
work action null (Thread[Execution worker,5,main]) completed. Took 0.0 secs.
> Task :runners:direct-java:shadowJar FROM-CACHE
Custom actions are attached to task ':runners:direct-java:shadowJar'.
Build cache key for task ':runners:direct-java:shadowJar' is 11d762368b5e9134d317b0738adf48a4
Task ':runners:direct-java:shadowJar' is not up-to-date because:
No history is available.
Loaded cache entry for task ':runners:direct-java:shadowJar' with cache key 11d762368b5e9134d317b0738adf48a4
:runners:direct-java:shadowJar (Thread[Execution worker Thread 4,5,main]) completed. Took 0.294 secs.
work action resolve beam-runners-direct-java.jar (project :runners:direct-java) (Thread[Execution worker Thread 4,5,main]) started.
work action null (Thread[Execution worker Thread 4,5,main]) completed. Took 0.0 secs.
work action resolve beam-runners-direct-java.jar (project :runners:direct-java) (Thread[Execution worker Thread 7,5,main]) started.
work action null (Thread[Execution worker Thread 7,5,main]) completed. Took 0.0 secs.
Resolve mutations for :runners:direct-java:compileTestJava (Thread[Execution worker Thread 7,5,main]) started.
Resolve mutations for :runners:direct-java:compileTestJava (Thread[Execution worker Thread 7,5,main]) completed. Took 0.0 secs.
:runners:direct-java:compileTestJava (Thread[Execution worker Thread 5,5,main]) started.
> Task :runners:direct-java:compileTestJava FROM-CACHE
Custom actions are attached to task ':runners:direct-java:compileTestJava'.
Build cache key for task ':runners:direct-java:compileTestJava' is 6f9b73dbbacf6a9ce65dff8e087aa583
Task ':runners:direct-java:compileTestJava' is not up-to-date because:
No history is available.
Loaded cache entry for task ':runners:direct-java:compileTestJava' with cache key 6f9b73dbbacf6a9ce65dff8e087aa583
:runners:direct-java:compileTestJava (Thread[Execution worker Thread 5,5,main]) completed. Took 0.098 secs.
Resolve mutations for :runners:direct-java:testClasses (Thread[Execution worker Thread 5,5,main]) started.
Resolve mutations for :runners:direct-java:testClasses (Thread[Execution worker Thread 5,5,main]) completed. Took 0.0 secs.
:runners:direct-java:testClasses (Thread[Execution worker Thread 5,5,main]) started.
> Task :runners:direct-java:testClasses UP-TO-DATE
Skipping task ':runners:direct-java:testClasses' as it has no actions.
:runners:direct-java:testClasses (Thread[Execution worker Thread 5,5,main]) completed. Took 0.0 secs.
Resolve mutations for :runners:direct-java:shadowTestJar (Thread[Execution worker Thread 5,5,main]) started.
Resolve mutations for :runners:direct-java:shadowTestJar (Thread[Execution worker Thread 5,5,main]) completed. Took 0.0 secs.
:runners:direct-java:shadowTestJar (Thread[Execution worker Thread 3,5,main]) started.
> Task :runners:direct-java:shadowTestJar FROM-CACHE
Build cache key for task ':runners:direct-java:shadowTestJar' is bfe27741881843f362850380fed3b3fe
Task ':runners:direct-java:shadowTestJar' is not up-to-date because:
No history is available.
Loaded cache entry for task ':runners:direct-java:shadowTestJar' with cache key bfe27741881843f362850380fed3b3fe
:runners:direct-java:shadowTestJar (Thread[Execution worker Thread 3,5,main]) completed. Took 0.2 secs.
work action resolve beam-runners-direct-java-tests.jar (project :runners:direct-java) (Thread[Execution worker Thread 3,5,main]) started.
work action null (Thread[Execution worker Thread 3,5,main]) completed. Took 0.0 secs.
Resolve mutations for :sdks:java:io:influxdb:integrationTest (Thread[Execution worker Thread 3,5,main]) started.
Resolve mutations for :sdks:java:io:influxdb:integrationTest (Thread[Execution worker Thread 3,5,main]) completed. Took 0.0 secs.
:sdks:java:io:influxdb:integrationTest (Thread[Execution worker Thread 3,5,main]) started.
producer locations for task group 0 (Thread[included builds,5,main]) started.
producer locations for task group 0 (Thread[included builds,5,main]) completed. Took 0.0 secs.
Gradle Test Executor 268 started executing tests.
> Task :sdks:java:io:influxdb:integrationTest
Custom actions are attached to task ':sdks:java:io:influxdb:integrationTest'.
Build cache key for task ':sdks:java:io:influxdb:integrationTest' is 8fd386cc3de9837efa4d8f303672676e
Task ':sdks:java:io:influxdb:integrationTest' is not up-to-date because:
Task.upToDateWhen is false.
Starting process 'Gradle Test Executor 268'. Working directory: <https://ci-beam.apache.org/job/beam_PerformanceTests_InfluxDbIO_IT/ws/src/sdks/java/io/influxdb> Command: /usr/lib/jvm/java-8-openjdk-amd64/bin/java -DbeamTestPipelineOptions=["--influxDBURL=http://34.171.115.122:8086","--influxDBUserName=superadmin","--influxDBPassword=supersecretpassword","--databaseName=db1"] -Djava.security.manager=worker.org.gradle.process.internal.worker.child.BootstrapSecurityManager -Dorg.gradle.internal.worker.tmpdir=<https://ci-beam.apache.org/job/beam_PerformanceTests_InfluxDbIO_IT/ws/src/sdks/java/io/influxdb/build/tmp/integrationTest/work> -Dorg.gradle.native=false -Xmx2g -Dfile.encoding=UTF-8 -Duser.country=US -Duser.language=en -Duser.variant -ea -cp /home/jenkins/.gradle/caches/7.5.1/workerMain/gradle-worker.jar worker.org.gradle.process.internal.worker.GradleWorkerMain 'Gradle Test Executor 268'
Successfully started process 'Gradle Test Executor 268'
org.apache.beam.sdk.io.influxdb.InfluxDbIOIT > testWriteAndReadWithMultipleMetric FAILED
org.influxdb.InfluxDBIOException: java.net.SocketTimeoutException: connect timed out
at org.influxdb.impl.InfluxDBImpl.execute(InfluxDBImpl.java:836)
at org.influxdb.impl.InfluxDBImpl.executeQuery(InfluxDBImpl.java:819)
at org.influxdb.impl.InfluxDBImpl.query(InfluxDBImpl.java:554)
at org.apache.beam.sdk.io.influxdb.InfluxDbIOIT.initTest(InfluxDbIOIT.java:99)
Caused by:
java.net.SocketTimeoutException: connect timed out
at java.net.PlainSocketImpl.socketConnect(Native Method)
at java.net.AbstractPlainSocketImpl.doConnect(AbstractPlainSocketImpl.java:350)
at java.net.AbstractPlainSocketImpl.connectToAddress(AbstractPlainSocketImpl.java:206)
at java.net.AbstractPlainSocketImpl.connect(AbstractPlainSocketImpl.java:188)
at java.net.SocksSocketImpl.connect(SocksSocketImpl.java:392)
at java.net.Socket.connect(Socket.java:607)
at okhttp3.internal.platform.Platform.connectSocket(Platform.kt:119)
at okhttp3.internal.connection.RealConnection.connectSocket(RealConnection.kt:283)
at okhttp3.internal.connection.RealConnection.connect(RealConnection.kt:195)
at okhttp3.internal.connection.ExchangeFinder.findConnection(ExchangeFinder.kt:249)
at okhttp3.internal.connection.ExchangeFinder.findHealthyConnection(ExchangeFinder.kt:108)
at okhttp3.internal.connection.ExchangeFinder.find(ExchangeFinder.kt:76)
at okhttp3.internal.connection.RealCall.initExchange$okhttp(RealCall.kt:245)
at okhttp3.internal.connection.ConnectInterceptor.intercept(ConnectInterceptor.kt:32)
at okhttp3.internal.http.RealInterceptorChain.proceed(RealInterceptorChain.kt:100)
at okhttp3.internal.cache.CacheInterceptor.intercept(CacheInterceptor.kt:82)
at okhttp3.internal.http.RealInterceptorChain.proceed(RealInterceptorChain.kt:100)
at okhttp3.internal.http.BridgeInterceptor.intercept(BridgeInterceptor.kt:83)
at okhttp3.internal.http.RealInterceptorChain.proceed(RealInterceptorChain.kt:100)
at okhttp3.internal.http.RetryAndFollowUpInterceptor.intercept(RetryAndFollowUpInterceptor.kt:76)
at okhttp3.internal.http.RealInterceptorChain.proceed(RealInterceptorChain.kt:100)
at org.influxdb.impl.BasicAuthInterceptor.intercept(BasicAuthInterceptor.java:22)
at okhttp3.internal.http.RealInterceptorChain.proceed(RealInterceptorChain.kt:100)
at org.influxdb.impl.GzipRequestInterceptor.intercept(GzipRequestInterceptor.java:42)
at okhttp3.internal.http.RealInterceptorChain.proceed(RealInterceptorChain.kt:100)
at okhttp3.logging.HttpLoggingInterceptor.intercept(HttpLoggingInterceptor.kt:152)
at okhttp3.internal.http.RealInterceptorChain.proceed(RealInterceptorChain.kt:100)
at okhttp3.internal.connection.RealCall.getResponseWithInterceptorChain$okhttp(RealCall.kt:197)
at okhttp3.internal.connection.RealCall.execute(RealCall.kt:148)
at retrofit2.OkHttpCall.execute(OkHttpCall.java:190)
at org.influxdb.impl.InfluxDBImpl.execute(InfluxDBImpl.java:824)
... 3 more
Gradle Test Executor 268 finished executing tests.
> Task :sdks:java:io:influxdb:integrationTest FAILED
6 tests completed, 1 failed
Finished generating test XML results (0.001 secs) into: <https://ci-beam.apache.org/job/beam_PerformanceTests_InfluxDbIO_IT/ws/src/sdks/java/io/influxdb/build/test-results/integrationTest>
Generating HTML test report...
Finished generating test html results (0.002 secs) into: <https://ci-beam.apache.org/job/beam_PerformanceTests_InfluxDbIO_IT/ws/src/sdks/java/io/influxdb/build/reports/tests/integrationTest>
:sdks:java:io:influxdb:integrationTest (Thread[Execution worker Thread 3,5,main]) completed. Took 23.704 secs.
FAILURE: Build failed with an exception.
* What went wrong:
Execution failed for task ':sdks:java:io:influxdb:integrationTest'.
> There were failing tests. See the report at: file://<https://ci-beam.apache.org/job/beam_PerformanceTests_InfluxDbIO_IT/ws/src/sdks/java/io/influxdb/build/reports/tests/integrationTest/index.html>
* Try:
> Run with --stacktrace option to get the stack trace.
> Run with --debug option to get more log output.
* Get more help at https://help.gradle.org
Deprecated Gradle features were used in this build, making it incompatible with Gradle 8.0.
You can use '--warning-mode all' to show the individual deprecation warnings and determine if they come from your own scripts or plugins.
See https://docs.gradle.org/7.5.1/userguide/command_line_interface.html#sec:command_line_warnings
BUILD FAILED in 31s
77 actionable tasks: 42 executed, 33 from cache, 2 up-to-date
Publishing build scan...
https://gradle.com/s/duhwfwyfxhmyu
Build step 'Invoke Gradle script' changed build result to FAILURE
Build step 'Invoke Gradle script' marked build as failure
---------------------------------------------------------------------
To unsubscribe, e-mail: builds-unsubscribe@beam.apache.org
For additional commands, e-mail: builds-help@beam.apache.org
Build failed in Jenkins: beam_PerformanceTests_InfluxDbIO_IT #2334
Posted by Apache Jenkins Server <je...@builds.apache.org>.
See <https://ci-beam.apache.org/job/beam_PerformanceTests_InfluxDbIO_IT/2334/display/redirect?page=changes>
Changes:
[noreply] Add drop_example flag to the RunInference and Model Handler (#23266)
------------------------------------------
[...truncated 183.14 KB...]
Loaded cache entry for task ':sdks:java:harness:compileJava' with cache key 55c1ba444de22ad92ffdd61cd925c48a
:sdks:java:harness:compileJava (Thread[Execution worker Thread 7,5,main]) completed. Took 0.081 secs.
Resolve mutations for :sdks:java:harness:classes (Thread[Execution worker Thread 7,5,main]) started.
Resolve mutations for :sdks:java:harness:classes (Thread[Execution worker Thread 7,5,main]) completed. Took 0.0 secs.
:sdks:java:harness:classes (Thread[Execution worker Thread 3,5,main]) started.
> Task :sdks:java:harness:classes UP-TO-DATE
Skipping task ':sdks:java:harness:classes' as it has no actions.
:sdks:java:harness:classes (Thread[Execution worker Thread 3,5,main]) completed. Took 0.0 secs.
Resolve mutations for :sdks:java:harness:jar (Thread[Execution worker Thread 3,5,main]) started.
> Task :sdks:java:core:shadowTestJar FROM-CACHE
Build cache key for task ':sdks:java:core:shadowTestJar' is 38233f99ae3a24535a25a96612c80de0
Task ':sdks:java:core:shadowTestJar' is not up-to-date because:
No history is available.
Loaded cache entry for task ':sdks:java:core:shadowTestJar' with cache key 38233f99ae3a24535a25a96612c80de0
Resolve mutations for :sdks:java:harness:jar (Thread[Execution worker Thread 3,5,main]) completed. Took 0.0 secs.
:sdks:java:core:shadowTestJar (Thread[Execution worker Thread 6,5,main]) completed. Took 0.115 secs.
work action resolve beam-sdks-java-core-tests.jar (project :sdks:java:core) (Thread[Execution worker Thread 3,5,main]) started.
:sdks:java:harness:jar (Thread[Execution worker Thread 6,5,main]) started.
work action null (Thread[Execution worker Thread 3,5,main]) completed. Took 0.0 secs.
Resolve mutations for :runners:core-java:compileTestJava (Thread[Execution worker Thread 2,5,main]) started.
Resolve mutations for :runners:core-java:compileTestJava (Thread[Execution worker Thread 2,5,main]) completed. Took 0.0 secs.
:runners:core-java:compileTestJava (Thread[Execution worker Thread 7,5,main]) started.
> Task :sdks:java:harness:jar
Caching disabled for task ':sdks:java:harness:jar' because:
Not worth caching
Task ':sdks:java:harness:jar' is not up-to-date because:
No history is available.
file or directory '<https://ci-beam.apache.org/job/beam_PerformanceTests_InfluxDbIO_IT/ws/src/sdks/java/harness/build/resources/main',> not found
:sdks:java:harness:jar (Thread[Execution worker Thread 6,5,main]) completed. Took 0.066 secs.
work action resolve beam-sdks-java-harness-unshaded.jar (project :sdks:java:harness) (Thread[Execution worker Thread 6,5,main]) started.
work action null (Thread[Execution worker Thread 6,5,main]) completed. Took 0.0 secs.
Resolve mutations for :runners:java-fn-execution:compileJava (Thread[Execution worker Thread 5,5,main]) started.
Resolve mutations for :runners:java-fn-execution:compileJava (Thread[Execution worker Thread 5,5,main]) completed. Took 0.0 secs.
:runners:java-fn-execution:compileJava (Thread[Execution worker Thread 3,5,main]) started.
> Task :runners:java-fn-execution:compileJava FROM-CACHE
Custom actions are attached to task ':runners:java-fn-execution:compileJava'.
Build cache key for task ':runners:java-fn-execution:compileJava' is fe71cd3c0e12fd6a8bc12d21975a91d1
Task ':runners:java-fn-execution:compileJava' is not up-to-date because:
No history is available.
Loaded cache entry for task ':runners:java-fn-execution:compileJava' with cache key fe71cd3c0e12fd6a8bc12d21975a91d1
:runners:java-fn-execution:compileJava (Thread[Execution worker Thread 3,5,main]) completed. Took 0.084 secs.
Resolve mutations for :runners:java-fn-execution:classes (Thread[Execution worker Thread 3,5,main]) started.
Resolve mutations for :runners:java-fn-execution:classes (Thread[Execution worker Thread 3,5,main]) completed. Took 0.0 secs.
:runners:java-fn-execution:classes (Thread[Execution worker Thread 4,5,main]) started.
> Task :runners:java-fn-execution:classes UP-TO-DATE
Skipping task ':runners:java-fn-execution:classes' as it has no actions.
:runners:java-fn-execution:classes (Thread[Execution worker Thread 4,5,main]) completed. Took 0.0 secs.
Resolve mutations for :runners:java-fn-execution:jar (Thread[Execution worker Thread 4,5,main]) started.
Resolve mutations for :runners:java-fn-execution:jar (Thread[Execution worker Thread 4,5,main]) completed. Took 0.0 secs.
:runners:java-fn-execution:jar (Thread[Execution worker Thread 6,5,main]) started.
> Task :runners:java-fn-execution:jar
Caching disabled for task ':runners:java-fn-execution:jar' because:
Not worth caching
Task ':runners:java-fn-execution:jar' is not up-to-date because:
No history is available.
file or directory '<https://ci-beam.apache.org/job/beam_PerformanceTests_InfluxDbIO_IT/ws/src/runners/java-fn-execution/build/resources/main',> not found
:runners:java-fn-execution:jar (Thread[Execution worker Thread 6,5,main]) completed. Took 0.041 secs.
work action resolve beam-runners-java-fn-execution.jar (project :runners:java-fn-execution) (Thread[Execution worker Thread 6,5,main]) started.
work action null (Thread[Execution worker Thread 6,5,main]) completed. Took 0.0 secs.
Resolve mutations for :runners:direct-java:compileJava (Thread[Execution worker,5,main]) started.
Resolve mutations for :runners:direct-java:compileJava (Thread[Execution worker,5,main]) completed. Took 0.0 secs.
:runners:direct-java:compileJava (Thread[Execution worker,5,main]) started.
> Task :runners:direct-java:compileJava FROM-CACHE
Custom actions are attached to task ':runners:direct-java:compileJava'.
Build cache key for task ':runners:direct-java:compileJava' is a3733318a34234f0c4ccc15aa6e7c1a8
Task ':runners:direct-java:compileJava' is not up-to-date because:
No history is available.
Loaded cache entry for task ':runners:direct-java:compileJava' with cache key a3733318a34234f0c4ccc15aa6e7c1a8
:runners:direct-java:compileJava (Thread[Execution worker,5,main]) completed. Took 0.095 secs.
Resolve mutations for :runners:direct-java:classes (Thread[Execution worker,5,main]) started.
Resolve mutations for :runners:direct-java:classes (Thread[Execution worker,5,main]) completed. Took 0.0 secs.
:runners:direct-java:classes (Thread[Execution worker,5,main]) started.
> Task :runners:direct-java:classes UP-TO-DATE
Skipping task ':runners:direct-java:classes' as it has no actions.
:runners:direct-java:classes (Thread[Execution worker,5,main]) completed. Took 0.0 secs.
Resolve mutations for :runners:direct-java:shadowJar (Thread[included builds,5,main]) started.
Resolve mutations for :runners:direct-java:shadowJar (Thread[included builds,5,main]) completed. Took 0.0 secs.
:runners:direct-java:shadowJar (Thread[Execution worker Thread 5,5,main]) started.
> Task :runners:core-java:compileTestJava FROM-CACHE
Custom actions are attached to task ':runners:core-java:compileTestJava'.
Build cache key for task ':runners:core-java:compileTestJava' is 2c2711a187e4b603d11a41b926619f03
Task ':runners:core-java:compileTestJava' is not up-to-date because:
No history is available.
Loaded cache entry for task ':runners:core-java:compileTestJava' with cache key 2c2711a187e4b603d11a41b926619f03
:runners:core-java:compileTestJava (Thread[Execution worker Thread 7,5,main]) completed. Took 0.326 secs.
Resolve mutations for :runners:core-java:testClasses (Thread[Execution worker Thread 7,5,main]) started.
Resolve mutations for :runners:core-java:testClasses (Thread[Execution worker Thread 7,5,main]) completed. Took 0.0 secs.
:runners:core-java:testClasses (Thread[Execution worker Thread 4,5,main]) started.
> Task :runners:core-java:testClasses UP-TO-DATE
Skipping task ':runners:core-java:testClasses' as it has no actions.
:runners:core-java:testClasses (Thread[Execution worker Thread 4,5,main]) completed. Took 0.0 secs.
Resolve mutations for :runners:core-java:testJar (Thread[Execution worker,5,main]) started.
Resolve mutations for :runners:core-java:testJar (Thread[Execution worker,5,main]) completed. Took 0.0 secs.
:runners:core-java:testJar (Thread[Execution worker,5,main]) started.
> Task :runners:core-java:testJar
Caching disabled for task ':runners:core-java:testJar' because:
Not worth caching
Task ':runners:core-java:testJar' is not up-to-date because:
No history is available.
file or directory '<https://ci-beam.apache.org/job/beam_PerformanceTests_InfluxDbIO_IT/ws/src/runners/core-java/build/resources/test',> not found
:runners:core-java:testJar (Thread[Execution worker,5,main]) completed. Took 0.035 secs.
work action resolve beam-runners-core-java-tests.jar (project :runners:core-java) (Thread[Execution worker Thread 4,5,main]) started.
work action null (Thread[Execution worker Thread 4,5,main]) completed. Took 0.0 secs.
> Task :runners:direct-java:shadowJar FROM-CACHE
Custom actions are attached to task ':runners:direct-java:shadowJar'.
Build cache key for task ':runners:direct-java:shadowJar' is 11d762368b5e9134d317b0738adf48a4
Task ':runners:direct-java:shadowJar' is not up-to-date because:
No history is available.
Loaded cache entry for task ':runners:direct-java:shadowJar' with cache key 11d762368b5e9134d317b0738adf48a4
:runners:direct-java:shadowJar (Thread[Execution worker Thread 5,5,main]) completed. Took 0.303 secs.
work action resolve beam-runners-direct-java.jar (project :runners:direct-java) (Thread[Execution worker Thread 5,5,main]) started.
work action null (Thread[Execution worker Thread 5,5,main]) completed. Took 0.0 secs.
work action resolve beam-runners-direct-java.jar (project :runners:direct-java) (Thread[Execution worker Thread 3,5,main]) started.
work action null (Thread[Execution worker Thread 3,5,main]) completed. Took 0.0 secs.
Resolve mutations for :runners:direct-java:compileTestJava (Thread[Execution worker Thread 3,5,main]) started.
Resolve mutations for :runners:direct-java:compileTestJava (Thread[Execution worker Thread 3,5,main]) completed. Took 0.0 secs.
:runners:direct-java:compileTestJava (Thread[Execution worker,5,main]) started.
> Task :runners:direct-java:compileTestJava FROM-CACHE
Custom actions are attached to task ':runners:direct-java:compileTestJava'.
Build cache key for task ':runners:direct-java:compileTestJava' is 6f9b73dbbacf6a9ce65dff8e087aa583
Task ':runners:direct-java:compileTestJava' is not up-to-date because:
No history is available.
Loaded cache entry for task ':runners:direct-java:compileTestJava' with cache key 6f9b73dbbacf6a9ce65dff8e087aa583
:runners:direct-java:compileTestJava (Thread[Execution worker,5,main]) completed. Took 0.103 secs.
Resolve mutations for :runners:direct-java:testClasses (Thread[Execution worker Thread 4,5,main]) started.
Resolve mutations for :runners:direct-java:testClasses (Thread[Execution worker Thread 4,5,main]) completed. Took 0.0 secs.
:runners:direct-java:testClasses (Thread[Execution worker Thread 4,5,main]) started.
> Task :runners:direct-java:testClasses UP-TO-DATE
Skipping task ':runners:direct-java:testClasses' as it has no actions.
:runners:direct-java:testClasses (Thread[Execution worker Thread 4,5,main]) completed. Took 0.0 secs.
Resolve mutations for :runners:direct-java:shadowTestJar (Thread[Execution worker Thread 4,5,main]) started.
Resolve mutations for :runners:direct-java:shadowTestJar (Thread[Execution worker Thread 4,5,main]) completed. Took 0.0 secs.
:runners:direct-java:shadowTestJar (Thread[Execution worker Thread 4,5,main]) started.
> Task :runners:direct-java:shadowTestJar FROM-CACHE
Build cache key for task ':runners:direct-java:shadowTestJar' is bfe27741881843f362850380fed3b3fe
Task ':runners:direct-java:shadowTestJar' is not up-to-date because:
No history is available.
Loaded cache entry for task ':runners:direct-java:shadowTestJar' with cache key bfe27741881843f362850380fed3b3fe
:runners:direct-java:shadowTestJar (Thread[Execution worker Thread 4,5,main]) completed. Took 0.208 secs.
work action resolve beam-runners-direct-java-tests.jar (project :runners:direct-java) (Thread[Execution worker Thread 4,5,main]) started.
work action null (Thread[Execution worker Thread 4,5,main]) completed. Took 0.0 secs.
Resolve mutations for :sdks:java:io:influxdb:integrationTest (Thread[Execution worker Thread 4,5,main]) started.
Resolve mutations for :sdks:java:io:influxdb:integrationTest (Thread[Execution worker Thread 4,5,main]) completed. Took 0.0 secs.
:sdks:java:io:influxdb:integrationTest (Thread[Execution worker Thread 3,5,main]) started.
producer locations for task group 0 (Thread[Execution worker Thread 4,5,main]) started.
producer locations for task group 0 (Thread[Execution worker Thread 4,5,main]) completed. Took 0.0 secs.
Gradle Test Executor 259 started executing tests.
> Task :sdks:java:io:influxdb:integrationTest
Custom actions are attached to task ':sdks:java:io:influxdb:integrationTest'.
Build cache key for task ':sdks:java:io:influxdb:integrationTest' is 8fd386cc3de9837efa4d8f303672676e
Task ':sdks:java:io:influxdb:integrationTest' is not up-to-date because:
Task.upToDateWhen is false.
Starting process 'Gradle Test Executor 259'. Working directory: <https://ci-beam.apache.org/job/beam_PerformanceTests_InfluxDbIO_IT/ws/src/sdks/java/io/influxdb> Command: /usr/lib/jvm/java-8-openjdk-amd64/bin/java -DbeamTestPipelineOptions=["--influxDBURL=http://34.170.79.95:8086","--influxDBUserName=superadmin","--influxDBPassword=supersecretpassword","--databaseName=db1"] -Djava.security.manager=worker.org.gradle.process.internal.worker.child.BootstrapSecurityManager -Dorg.gradle.internal.worker.tmpdir=<https://ci-beam.apache.org/job/beam_PerformanceTests_InfluxDbIO_IT/ws/src/sdks/java/io/influxdb/build/tmp/integrationTest/work> -Dorg.gradle.native=false -Xmx2g -Dfile.encoding=UTF-8 -Duser.country=US -Duser.language=en -Duser.variant -ea -cp /home/jenkins/.gradle/caches/7.5.1/workerMain/gradle-worker.jar worker.org.gradle.process.internal.worker.GradleWorkerMain 'Gradle Test Executor 259'
Successfully started process 'Gradle Test Executor 259'
org.apache.beam.sdk.io.influxdb.InfluxDbIOIT > testWriteAndReadWithMultipleMetric FAILED
org.influxdb.InfluxDBIOException: java.net.SocketTimeoutException: connect timed out
at org.influxdb.impl.InfluxDBImpl.execute(InfluxDBImpl.java:836)
at org.influxdb.impl.InfluxDBImpl.executeQuery(InfluxDBImpl.java:819)
at org.influxdb.impl.InfluxDBImpl.query(InfluxDBImpl.java:554)
at org.apache.beam.sdk.io.influxdb.InfluxDbIOIT.initTest(InfluxDbIOIT.java:99)
Caused by:
java.net.SocketTimeoutException: connect timed out
at java.net.PlainSocketImpl.socketConnect(Native Method)
at java.net.AbstractPlainSocketImpl.doConnect(AbstractPlainSocketImpl.java:350)
at java.net.AbstractPlainSocketImpl.connectToAddress(AbstractPlainSocketImpl.java:206)
at java.net.AbstractPlainSocketImpl.connect(AbstractPlainSocketImpl.java:188)
at java.net.SocksSocketImpl.connect(SocksSocketImpl.java:392)
at java.net.Socket.connect(Socket.java:607)
at okhttp3.internal.platform.Platform.connectSocket(Platform.kt:119)
at okhttp3.internal.connection.RealConnection.connectSocket(RealConnection.kt:283)
at okhttp3.internal.connection.RealConnection.connect(RealConnection.kt:195)
at okhttp3.internal.connection.ExchangeFinder.findConnection(ExchangeFinder.kt:249)
at okhttp3.internal.connection.ExchangeFinder.findHealthyConnection(ExchangeFinder.kt:108)
at okhttp3.internal.connection.ExchangeFinder.find(ExchangeFinder.kt:76)
at okhttp3.internal.connection.RealCall.initExchange$okhttp(RealCall.kt:245)
at okhttp3.internal.connection.ConnectInterceptor.intercept(ConnectInterceptor.kt:32)
at okhttp3.internal.http.RealInterceptorChain.proceed(RealInterceptorChain.kt:100)
at okhttp3.internal.cache.CacheInterceptor.intercept(CacheInterceptor.kt:82)
at okhttp3.internal.http.RealInterceptorChain.proceed(RealInterceptorChain.kt:100)
at okhttp3.internal.http.BridgeInterceptor.intercept(BridgeInterceptor.kt:83)
at okhttp3.internal.http.RealInterceptorChain.proceed(RealInterceptorChain.kt:100)
at okhttp3.internal.http.RetryAndFollowUpInterceptor.intercept(RetryAndFollowUpInterceptor.kt:76)
at okhttp3.internal.http.RealInterceptorChain.proceed(RealInterceptorChain.kt:100)
at org.influxdb.impl.BasicAuthInterceptor.intercept(BasicAuthInterceptor.java:22)
at okhttp3.internal.http.RealInterceptorChain.proceed(RealInterceptorChain.kt:100)
at org.influxdb.impl.GzipRequestInterceptor.intercept(GzipRequestInterceptor.java:42)
at okhttp3.internal.http.RealInterceptorChain.proceed(RealInterceptorChain.kt:100)
at okhttp3.logging.HttpLoggingInterceptor.intercept(HttpLoggingInterceptor.kt:152)
at okhttp3.internal.http.RealInterceptorChain.proceed(RealInterceptorChain.kt:100)
at okhttp3.internal.connection.RealCall.getResponseWithInterceptorChain$okhttp(RealCall.kt:197)
at okhttp3.internal.connection.RealCall.execute(RealCall.kt:148)
at retrofit2.OkHttpCall.execute(OkHttpCall.java:190)
at org.influxdb.impl.InfluxDBImpl.execute(InfluxDBImpl.java:824)
... 3 more
Gradle Test Executor 259 finished executing tests.
> Task :sdks:java:io:influxdb:integrationTest FAILED
6 tests completed, 1 failed
Finished generating test XML results (0.001 secs) into: <https://ci-beam.apache.org/job/beam_PerformanceTests_InfluxDbIO_IT/ws/src/sdks/java/io/influxdb/build/test-results/integrationTest>
Generating HTML test report...
Finished generating test html results (0.002 secs) into: <https://ci-beam.apache.org/job/beam_PerformanceTests_InfluxDbIO_IT/ws/src/sdks/java/io/influxdb/build/reports/tests/integrationTest>
:sdks:java:io:influxdb:integrationTest (Thread[Execution worker Thread 3,5,main]) completed. Took 18.488 secs.
FAILURE: Build failed with an exception.
* What went wrong:
Execution failed for task ':sdks:java:io:influxdb:integrationTest'.
> There were failing tests. See the report at: file://<https://ci-beam.apache.org/job/beam_PerformanceTests_InfluxDbIO_IT/ws/src/sdks/java/io/influxdb/build/reports/tests/integrationTest/index.html>
* Try:
> Run with --stacktrace option to get the stack trace.
> Run with --debug option to get more log output.
* Get more help at https://help.gradle.org
Deprecated Gradle features were used in this build, making it incompatible with Gradle 8.0.
You can use '--warning-mode all' to show the individual deprecation warnings and determine if they come from your own scripts or plugins.
See https://docs.gradle.org/7.5.1/userguide/command_line_interface.html#sec:command_line_warnings
BUILD FAILED in 26s
77 actionable tasks: 42 executed, 33 from cache, 2 up-to-date
Publishing build scan...
https://gradle.com/s/vxtbrzqtsgrzw
Build step 'Invoke Gradle script' changed build result to FAILURE
Build step 'Invoke Gradle script' marked build as failure
---------------------------------------------------------------------
To unsubscribe, e-mail: builds-unsubscribe@beam.apache.org
For additional commands, e-mail: builds-help@beam.apache.org
Build failed in Jenkins: beam_PerformanceTests_InfluxDbIO_IT #2333
Posted by Apache Jenkins Server <je...@builds.apache.org>.
See <https://ci-beam.apache.org/job/beam_PerformanceTests_InfluxDbIO_IT/2333/display/redirect>
Changes:
------------------------------------------
[...truncated 182.78 KB...]
:sdks:java:core:shadowTestJar (Thread[Execution worker Thread 4,5,main]) completed. Took 0.107 secs.
work action resolve beam-sdks-java-core-tests.jar (project :sdks:java:core) (Thread[Execution worker Thread 4,5,main]) started.
work action null (Thread[Execution worker Thread 4,5,main]) completed. Took 0.0 secs.
Resolve mutations for :runners:core-java:compileTestJava (Thread[Execution worker,5,main]) started.
Resolve mutations for :runners:core-java:compileTestJava (Thread[Execution worker,5,main]) completed. Took 0.0 secs.
:runners:core-java:compileTestJava (Thread[Execution worker,5,main]) started.
> Task :sdks:java:harness:compileJava FROM-CACHE
Custom actions are attached to task ':sdks:java:harness:compileJava'.
Build cache key for task ':sdks:java:harness:compileJava' is 55c1ba444de22ad92ffdd61cd925c48a
Task ':sdks:java:harness:compileJava' is not up-to-date because:
No history is available.
Loaded cache entry for task ':sdks:java:harness:compileJava' with cache key 55c1ba444de22ad92ffdd61cd925c48a
:sdks:java:harness:compileJava (Thread[Execution worker Thread 3,5,main]) completed. Took 0.075 secs.
Resolve mutations for :sdks:java:harness:classes (Thread[Execution worker Thread 3,5,main]) started.
Resolve mutations for :sdks:java:harness:classes (Thread[Execution worker Thread 3,5,main]) completed. Took 0.0 secs.
:sdks:java:harness:classes (Thread[Execution worker Thread 3,5,main]) started.
> Task :sdks:java:harness:classes UP-TO-DATE
Skipping task ':sdks:java:harness:classes' as it has no actions.
:sdks:java:harness:classes (Thread[Execution worker Thread 3,5,main]) completed. Took 0.0 secs.
Resolve mutations for :sdks:java:harness:jar (Thread[Execution worker Thread 3,5,main]) started.
Resolve mutations for :sdks:java:harness:jar (Thread[Execution worker Thread 3,5,main]) completed. Took 0.0 secs.
:sdks:java:harness:jar (Thread[Execution worker Thread 3,5,main]) started.
> Task :sdks:java:harness:jar
Caching disabled for task ':sdks:java:harness:jar' because:
Not worth caching
Task ':sdks:java:harness:jar' is not up-to-date because:
No history is available.
file or directory '<https://ci-beam.apache.org/job/beam_PerformanceTests_InfluxDbIO_IT/ws/src/sdks/java/harness/build/resources/main',> not found
:sdks:java:harness:jar (Thread[Execution worker Thread 3,5,main]) completed. Took 0.056 secs.
work action resolve beam-sdks-java-harness-unshaded.jar (project :sdks:java:harness) (Thread[Execution worker Thread 2,5,main]) started.
work action null (Thread[Execution worker Thread 2,5,main]) completed. Took 0.0 secs.
Resolve mutations for :runners:java-fn-execution:compileJava (Thread[Execution worker Thread 4,5,main]) started.
Resolve mutations for :runners:java-fn-execution:compileJava (Thread[Execution worker Thread 4,5,main]) completed. Took 0.0 secs.
:runners:java-fn-execution:compileJava (Thread[Execution worker Thread 3,5,main]) started.
> Task :runners:java-fn-execution:compileJava FROM-CACHE
Custom actions are attached to task ':runners:java-fn-execution:compileJava'.
Build cache key for task ':runners:java-fn-execution:compileJava' is fe71cd3c0e12fd6a8bc12d21975a91d1
Task ':runners:java-fn-execution:compileJava' is not up-to-date because:
No history is available.
Loaded cache entry for task ':runners:java-fn-execution:compileJava' with cache key fe71cd3c0e12fd6a8bc12d21975a91d1
:runners:java-fn-execution:compileJava (Thread[Execution worker Thread 3,5,main]) completed. Took 0.078 secs.
Resolve mutations for :runners:java-fn-execution:classes (Thread[Execution worker Thread 3,5,main]) started.
Resolve mutations for :runners:java-fn-execution:classes (Thread[Execution worker Thread 3,5,main]) completed. Took 0.0 secs.
:runners:java-fn-execution:classes (Thread[Execution worker Thread 5,5,main]) started.
> Task :runners:java-fn-execution:classes UP-TO-DATE
Skipping task ':runners:java-fn-execution:classes' as it has no actions.
:runners:java-fn-execution:classes (Thread[Execution worker Thread 5,5,main]) completed. Took 0.0 secs.
Resolve mutations for :runners:java-fn-execution:jar (Thread[Execution worker Thread 3,5,main]) started.
Resolve mutations for :runners:java-fn-execution:jar (Thread[Execution worker Thread 3,5,main]) completed. Took 0.0 secs.
:runners:java-fn-execution:jar (Thread[Execution worker Thread 6,5,main]) started.
> Task :runners:java-fn-execution:jar
Caching disabled for task ':runners:java-fn-execution:jar' because:
Not worth caching
Task ':runners:java-fn-execution:jar' is not up-to-date because:
No history is available.
file or directory '<https://ci-beam.apache.org/job/beam_PerformanceTests_InfluxDbIO_IT/ws/src/runners/java-fn-execution/build/resources/main',> not found
:runners:java-fn-execution:jar (Thread[Execution worker Thread 6,5,main]) completed. Took 0.04 secs.
work action resolve beam-runners-java-fn-execution.jar (project :runners:java-fn-execution) (Thread[Execution worker Thread 5,5,main]) started.
work action null (Thread[Execution worker Thread 5,5,main]) completed. Took 0.0 secs.
Resolve mutations for :runners:direct-java:compileJava (Thread[Execution worker Thread 5,5,main]) started.
Resolve mutations for :runners:direct-java:compileJava (Thread[Execution worker Thread 5,5,main]) completed. Took 0.0 secs.
:runners:direct-java:compileJava (Thread[Execution worker Thread 6,5,main]) started.
> Task :runners:core-java:compileTestJava FROM-CACHE
Custom actions are attached to task ':runners:core-java:compileTestJava'.
Build cache key for task ':runners:core-java:compileTestJava' is 2c2711a187e4b603d11a41b926619f03
Task ':runners:core-java:compileTestJava' is not up-to-date because:
No history is available.
Loaded cache entry for task ':runners:core-java:compileTestJava' with cache key 2c2711a187e4b603d11a41b926619f03
:runners:core-java:compileTestJava (Thread[Execution worker,5,main]) completed. Took 0.315 secs.
Resolve mutations for :runners:core-java:testClasses (Thread[Execution worker,5,main]) started.
Resolve mutations for :runners:core-java:testClasses (Thread[Execution worker,5,main]) completed. Took 0.0 secs.
:runners:core-java:testClasses (Thread[Execution worker,5,main]) started.
> Task :runners:core-java:testClasses UP-TO-DATE
Skipping task ':runners:core-java:testClasses' as it has no actions.
:runners:core-java:testClasses (Thread[Execution worker,5,main]) completed. Took 0.0 secs.
Resolve mutations for :runners:core-java:testJar (Thread[Execution worker,5,main]) started.
Resolve mutations for :runners:core-java:testJar (Thread[Execution worker,5,main]) completed. Took 0.0 secs.
:runners:core-java:testJar (Thread[Execution worker,5,main]) started.
> Task :runners:direct-java:compileJava FROM-CACHE
Custom actions are attached to task ':runners:direct-java:compileJava'.
Build cache key for task ':runners:direct-java:compileJava' is a3733318a34234f0c4ccc15aa6e7c1a8
Task ':runners:direct-java:compileJava' is not up-to-date because:
No history is available.
Loaded cache entry for task ':runners:direct-java:compileJava' with cache key a3733318a34234f0c4ccc15aa6e7c1a8
:runners:direct-java:compileJava (Thread[Execution worker Thread 6,5,main]) completed. Took 0.087 secs.
Resolve mutations for :runners:direct-java:classes (Thread[Execution worker Thread 4,5,main]) started.
Resolve mutations for :runners:direct-java:classes (Thread[Execution worker Thread 4,5,main]) completed. Took 0.0 secs.
:runners:direct-java:classes (Thread[Execution worker Thread 4,5,main]) started.
> Task :runners:direct-java:classes UP-TO-DATE
Skipping task ':runners:direct-java:classes' as it has no actions.
:runners:direct-java:classes (Thread[Execution worker Thread 4,5,main]) completed. Took 0.0 secs.
Resolve mutations for :runners:direct-java:shadowJar (Thread[Execution worker Thread 5,5,main]) started.
Resolve mutations for :runners:direct-java:shadowJar (Thread[Execution worker Thread 5,5,main]) completed. Took 0.0 secs.
:runners:direct-java:shadowJar (Thread[Execution worker Thread 7,5,main]) started.
> Task :runners:core-java:testJar
Caching disabled for task ':runners:core-java:testJar' because:
Not worth caching
Task ':runners:core-java:testJar' is not up-to-date because:
No history is available.
file or directory '<https://ci-beam.apache.org/job/beam_PerformanceTests_InfluxDbIO_IT/ws/src/runners/core-java/build/resources/test',> not found
:runners:core-java:testJar (Thread[Execution worker,5,main]) completed. Took 0.033 secs.
work action resolve beam-runners-core-java-tests.jar (project :runners:core-java) (Thread[Execution worker Thread 4,5,main]) started.
work action null (Thread[Execution worker Thread 4,5,main]) completed. Took 0.0 secs.
> Task :runners:direct-java:shadowJar FROM-CACHE
Custom actions are attached to task ':runners:direct-java:shadowJar'.
Build cache key for task ':runners:direct-java:shadowJar' is 11d762368b5e9134d317b0738adf48a4
Task ':runners:direct-java:shadowJar' is not up-to-date because:
No history is available.
Loaded cache entry for task ':runners:direct-java:shadowJar' with cache key 11d762368b5e9134d317b0738adf48a4
:runners:direct-java:shadowJar (Thread[Execution worker Thread 7,5,main]) completed. Took 0.294 secs.
work action resolve beam-runners-direct-java.jar (project :runners:direct-java) (Thread[Execution worker Thread 7,5,main]) started.
work action null (Thread[Execution worker Thread 7,5,main]) completed. Took 0.0 secs.
work action resolve beam-runners-direct-java.jar (project :runners:direct-java) (Thread[Execution worker Thread 7,5,main]) started.
work action null (Thread[Execution worker Thread 7,5,main]) completed. Took 0.0 secs.
Resolve mutations for :runners:direct-java:compileTestJava (Thread[Execution worker Thread 7,5,main]) started.
Resolve mutations for :runners:direct-java:compileTestJava (Thread[Execution worker Thread 7,5,main]) completed. Took 0.0 secs.
:runners:direct-java:compileTestJava (Thread[Execution worker,5,main]) started.
> Task :runners:direct-java:compileTestJava FROM-CACHE
Custom actions are attached to task ':runners:direct-java:compileTestJava'.
Build cache key for task ':runners:direct-java:compileTestJava' is 6f9b73dbbacf6a9ce65dff8e087aa583
Task ':runners:direct-java:compileTestJava' is not up-to-date because:
No history is available.
Loaded cache entry for task ':runners:direct-java:compileTestJava' with cache key 6f9b73dbbacf6a9ce65dff8e087aa583
:runners:direct-java:compileTestJava (Thread[Execution worker,5,main]) completed. Took 0.097 secs.
Resolve mutations for :runners:direct-java:testClasses (Thread[Execution worker,5,main]) started.
Resolve mutations for :runners:direct-java:testClasses (Thread[Execution worker,5,main]) completed. Took 0.0 secs.
:runners:direct-java:testClasses (Thread[included builds,5,main]) started.
> Task :runners:direct-java:testClasses UP-TO-DATE
Skipping task ':runners:direct-java:testClasses' as it has no actions.
:runners:direct-java:testClasses (Thread[included builds,5,main]) completed. Took 0.0 secs.
Resolve mutations for :runners:direct-java:shadowTestJar (Thread[Execution worker Thread 2,5,main]) started.
Resolve mutations for :runners:direct-java:shadowTestJar (Thread[Execution worker Thread 2,5,main]) completed. Took 0.0 secs.
:runners:direct-java:shadowTestJar (Thread[Execution worker Thread 2,5,main]) started.
> Task :runners:direct-java:shadowTestJar FROM-CACHE
Build cache key for task ':runners:direct-java:shadowTestJar' is bfe27741881843f362850380fed3b3fe
Task ':runners:direct-java:shadowTestJar' is not up-to-date because:
No history is available.
Loaded cache entry for task ':runners:direct-java:shadowTestJar' with cache key bfe27741881843f362850380fed3b3fe
:runners:direct-java:shadowTestJar (Thread[Execution worker Thread 2,5,main]) completed. Took 0.199 secs.
work action resolve beam-runners-direct-java-tests.jar (project :runners:direct-java) (Thread[Execution worker Thread 2,5,main]) started.
work action null (Thread[Execution worker Thread 2,5,main]) completed. Took 0.0 secs.
Resolve mutations for :sdks:java:io:influxdb:integrationTest (Thread[Execution worker Thread 2,5,main]) started.
Resolve mutations for :sdks:java:io:influxdb:integrationTest (Thread[Execution worker Thread 2,5,main]) completed. Took 0.0 secs.
:sdks:java:io:influxdb:integrationTest (Thread[included builds,5,main]) started.
producer locations for task group 0 (Thread[Execution worker Thread 2,5,main]) started.
producer locations for task group 0 (Thread[Execution worker Thread 2,5,main]) completed. Took 0.0 secs.
Gradle Test Executor 250 started executing tests.
> Task :sdks:java:io:influxdb:integrationTest
Custom actions are attached to task ':sdks:java:io:influxdb:integrationTest'.
Build cache key for task ':sdks:java:io:influxdb:integrationTest' is 8fd386cc3de9837efa4d8f303672676e
Task ':sdks:java:io:influxdb:integrationTest' is not up-to-date because:
Task.upToDateWhen is false.
Starting process 'Gradle Test Executor 250'. Working directory: <https://ci-beam.apache.org/job/beam_PerformanceTests_InfluxDbIO_IT/ws/src/sdks/java/io/influxdb> Command: /usr/lib/jvm/java-8-openjdk-amd64/bin/java -DbeamTestPipelineOptions=["--influxDBURL=http://34.136.79.93:8086","--influxDBUserName=superadmin","--influxDBPassword=supersecretpassword","--databaseName=db1"] -Djava.security.manager=worker.org.gradle.process.internal.worker.child.BootstrapSecurityManager -Dorg.gradle.internal.worker.tmpdir=<https://ci-beam.apache.org/job/beam_PerformanceTests_InfluxDbIO_IT/ws/src/sdks/java/io/influxdb/build/tmp/integrationTest/work> -Dorg.gradle.native=false -Xmx2g -Dfile.encoding=UTF-8 -Duser.country=US -Duser.language=en -Duser.variant -ea -cp /home/jenkins/.gradle/caches/7.5.1/workerMain/gradle-worker.jar worker.org.gradle.process.internal.worker.GradleWorkerMain 'Gradle Test Executor 250'
Successfully started process 'Gradle Test Executor 250'
org.apache.beam.sdk.io.influxdb.InfluxDbIOIT > testWriteAndReadWithMultipleMetric FAILED
org.influxdb.InfluxDBIOException: java.net.SocketTimeoutException: connect timed out
at org.influxdb.impl.InfluxDBImpl.execute(InfluxDBImpl.java:836)
at org.influxdb.impl.InfluxDBImpl.executeQuery(InfluxDBImpl.java:819)
at org.influxdb.impl.InfluxDBImpl.query(InfluxDBImpl.java:554)
at org.apache.beam.sdk.io.influxdb.InfluxDbIOIT.initTest(InfluxDbIOIT.java:99)
Caused by:
java.net.SocketTimeoutException: connect timed out
at java.net.PlainSocketImpl.socketConnect(Native Method)
at java.net.AbstractPlainSocketImpl.doConnect(AbstractPlainSocketImpl.java:350)
at java.net.AbstractPlainSocketImpl.connectToAddress(AbstractPlainSocketImpl.java:206)
at java.net.AbstractPlainSocketImpl.connect(AbstractPlainSocketImpl.java:188)
at java.net.SocksSocketImpl.connect(SocksSocketImpl.java:392)
at java.net.Socket.connect(Socket.java:607)
at okhttp3.internal.platform.Platform.connectSocket(Platform.kt:119)
at okhttp3.internal.connection.RealConnection.connectSocket(RealConnection.kt:283)
at okhttp3.internal.connection.RealConnection.connect(RealConnection.kt:195)
at okhttp3.internal.connection.ExchangeFinder.findConnection(ExchangeFinder.kt:249)
at okhttp3.internal.connection.ExchangeFinder.findHealthyConnection(ExchangeFinder.kt:108)
at okhttp3.internal.connection.ExchangeFinder.find(ExchangeFinder.kt:76)
at okhttp3.internal.connection.RealCall.initExchange$okhttp(RealCall.kt:245)
at okhttp3.internal.connection.ConnectInterceptor.intercept(ConnectInterceptor.kt:32)
at okhttp3.internal.http.RealInterceptorChain.proceed(RealInterceptorChain.kt:100)
at okhttp3.internal.cache.CacheInterceptor.intercept(CacheInterceptor.kt:82)
at okhttp3.internal.http.RealInterceptorChain.proceed(RealInterceptorChain.kt:100)
at okhttp3.internal.http.BridgeInterceptor.intercept(BridgeInterceptor.kt:83)
at okhttp3.internal.http.RealInterceptorChain.proceed(RealInterceptorChain.kt:100)
at okhttp3.internal.http.RetryAndFollowUpInterceptor.intercept(RetryAndFollowUpInterceptor.kt:76)
at okhttp3.internal.http.RealInterceptorChain.proceed(RealInterceptorChain.kt:100)
at org.influxdb.impl.BasicAuthInterceptor.intercept(BasicAuthInterceptor.java:22)
at okhttp3.internal.http.RealInterceptorChain.proceed(RealInterceptorChain.kt:100)
at org.influxdb.impl.GzipRequestInterceptor.intercept(GzipRequestInterceptor.java:42)
at okhttp3.internal.http.RealInterceptorChain.proceed(RealInterceptorChain.kt:100)
at okhttp3.logging.HttpLoggingInterceptor.intercept(HttpLoggingInterceptor.kt:152)
at okhttp3.internal.http.RealInterceptorChain.proceed(RealInterceptorChain.kt:100)
at okhttp3.internal.connection.RealCall.getResponseWithInterceptorChain$okhttp(RealCall.kt:197)
at okhttp3.internal.connection.RealCall.execute(RealCall.kt:148)
at retrofit2.OkHttpCall.execute(OkHttpCall.java:190)
at org.influxdb.impl.InfluxDBImpl.execute(InfluxDBImpl.java:824)
... 3 more
Gradle Test Executor 250 finished executing tests.
> Task :sdks:java:io:influxdb:integrationTest FAILED
6 tests completed, 1 failed
Finished generating test XML results (0.001 secs) into: <https://ci-beam.apache.org/job/beam_PerformanceTests_InfluxDbIO_IT/ws/src/sdks/java/io/influxdb/build/test-results/integrationTest>
Generating HTML test report...
Finished generating test html results (0.002 secs) into: <https://ci-beam.apache.org/job/beam_PerformanceTests_InfluxDbIO_IT/ws/src/sdks/java/io/influxdb/build/reports/tests/integrationTest>
:sdks:java:io:influxdb:integrationTest (Thread[included builds,5,main]) completed. Took 16.528 secs.
FAILURE: Build failed with an exception.
* What went wrong:
Execution failed for task ':sdks:java:io:influxdb:integrationTest'.
> There were failing tests. See the report at: file://<https://ci-beam.apache.org/job/beam_PerformanceTests_InfluxDbIO_IT/ws/src/sdks/java/io/influxdb/build/reports/tests/integrationTest/index.html>
* Try:
> Run with --stacktrace option to get the stack trace.
> Run with --debug option to get more log output.
* Get more help at https://help.gradle.org
Deprecated Gradle features were used in this build, making it incompatible with Gradle 8.0.
You can use '--warning-mode all' to show the individual deprecation warnings and determine if they come from your own scripts or plugins.
See https://docs.gradle.org/7.5.1/userguide/command_line_interface.html#sec:command_line_warnings
BUILD FAILED in 24s
77 actionable tasks: 42 executed, 33 from cache, 2 up-to-date
Publishing build scan...
https://gradle.com/s/odgns3lckn7ig
Build step 'Invoke Gradle script' changed build result to FAILURE
Build step 'Invoke Gradle script' marked build as failure
---------------------------------------------------------------------
To unsubscribe, e-mail: builds-unsubscribe@beam.apache.org
For additional commands, e-mail: builds-help@beam.apache.org
Build failed in Jenkins: beam_PerformanceTests_InfluxDbIO_IT #2332
Posted by Apache Jenkins Server <je...@builds.apache.org>.
See <https://ci-beam.apache.org/job/beam_PerformanceTests_InfluxDbIO_IT/2332/display/redirect>
Changes:
------------------------------------------
[...truncated 181.98 KB...]
:sdks:java:core:shadowTestJar (Thread[Execution worker Thread 5,5,main]) completed. Took 0.105 secs.
work action resolve beam-sdks-java-core-tests.jar (project :sdks:java:core) (Thread[Execution worker Thread 5,5,main]) started.
work action null (Thread[Execution worker Thread 5,5,main]) completed. Took 0.0 secs.
Resolve mutations for :runners:core-java:compileTestJava (Thread[Execution worker Thread 5,5,main]) started.
Resolve mutations for :runners:core-java:compileTestJava (Thread[Execution worker Thread 5,5,main]) completed. Took 0.0 secs.
:runners:core-java:compileTestJava (Thread[Execution worker,5,main]) started.
> Task :sdks:java:harness:compileJava FROM-CACHE
Custom actions are attached to task ':sdks:java:harness:compileJava'.
Build cache key for task ':sdks:java:harness:compileJava' is 55c1ba444de22ad92ffdd61cd925c48a
Task ':sdks:java:harness:compileJava' is not up-to-date because:
No history is available.
Loaded cache entry for task ':sdks:java:harness:compileJava' with cache key 55c1ba444de22ad92ffdd61cd925c48a
:sdks:java:harness:compileJava (Thread[included builds,5,main]) completed. Took 0.08 secs.
Resolve mutations for :sdks:java:harness:classes (Thread[included builds,5,main]) started.
Resolve mutations for :sdks:java:harness:classes (Thread[included builds,5,main]) completed. Took 0.0 secs.
:sdks:java:harness:classes (Thread[included builds,5,main]) started.
> Task :sdks:java:harness:classes UP-TO-DATE
Skipping task ':sdks:java:harness:classes' as it has no actions.
:sdks:java:harness:classes (Thread[included builds,5,main]) completed. Took 0.0 secs.
Resolve mutations for :sdks:java:harness:jar (Thread[Execution worker Thread 2,5,main]) started.
Resolve mutations for :sdks:java:harness:jar (Thread[Execution worker Thread 2,5,main]) completed. Took 0.0 secs.
:sdks:java:harness:jar (Thread[Execution worker Thread 2,5,main]) started.
> Task :sdks:java:harness:jar
Caching disabled for task ':sdks:java:harness:jar' because:
Not worth caching
Task ':sdks:java:harness:jar' is not up-to-date because:
No history is available.
file or directory '<https://ci-beam.apache.org/job/beam_PerformanceTests_InfluxDbIO_IT/ws/src/sdks/java/harness/build/resources/main',> not found
:sdks:java:harness:jar (Thread[Execution worker Thread 2,5,main]) completed. Took 0.06 secs.
work action resolve beam-sdks-java-harness-unshaded.jar (project :sdks:java:harness) (Thread[Execution worker Thread 2,5,main]) started.
work action null (Thread[Execution worker Thread 2,5,main]) completed. Took 0.0 secs.
Resolve mutations for :runners:java-fn-execution:compileJava (Thread[Execution worker Thread 2,5,main]) started.
Resolve mutations for :runners:java-fn-execution:compileJava (Thread[Execution worker Thread 2,5,main]) completed. Took 0.0 secs.
:runners:java-fn-execution:compileJava (Thread[Execution worker Thread 2,5,main]) started.
> Task :runners:java-fn-execution:compileJava FROM-CACHE
Custom actions are attached to task ':runners:java-fn-execution:compileJava'.
Build cache key for task ':runners:java-fn-execution:compileJava' is fe71cd3c0e12fd6a8bc12d21975a91d1
Task ':runners:java-fn-execution:compileJava' is not up-to-date because:
No history is available.
Loaded cache entry for task ':runners:java-fn-execution:compileJava' with cache key fe71cd3c0e12fd6a8bc12d21975a91d1
:runners:java-fn-execution:compileJava (Thread[Execution worker Thread 2,5,main]) completed. Took 0.083 secs.
Resolve mutations for :runners:java-fn-execution:classes (Thread[Execution worker Thread 2,5,main]) started.
Resolve mutations for :runners:java-fn-execution:classes (Thread[Execution worker Thread 2,5,main]) completed. Took 0.0 secs.
:runners:java-fn-execution:classes (Thread[Execution worker Thread 2,5,main]) started.
> Task :runners:java-fn-execution:classes UP-TO-DATE
Skipping task ':runners:java-fn-execution:classes' as it has no actions.
:runners:java-fn-execution:classes (Thread[Execution worker Thread 2,5,main]) completed. Took 0.0 secs.
Resolve mutations for :runners:java-fn-execution:jar (Thread[Execution worker Thread 2,5,main]) started.
Resolve mutations for :runners:java-fn-execution:jar (Thread[Execution worker Thread 2,5,main]) completed. Took 0.0 secs.
:runners:java-fn-execution:jar (Thread[Execution worker Thread 7,5,main]) started.
> Task :runners:java-fn-execution:jar
Caching disabled for task ':runners:java-fn-execution:jar' because:
Not worth caching
Task ':runners:java-fn-execution:jar' is not up-to-date because:
No history is available.
file or directory '<https://ci-beam.apache.org/job/beam_PerformanceTests_InfluxDbIO_IT/ws/src/runners/java-fn-execution/build/resources/main',> not found
:runners:java-fn-execution:jar (Thread[Execution worker Thread 7,5,main]) completed. Took 0.04 secs.
work action resolve beam-runners-java-fn-execution.jar (project :runners:java-fn-execution) (Thread[Execution worker Thread 6,5,main]) started.
work action null (Thread[Execution worker Thread 6,5,main]) completed. Took 0.0 secs.
Resolve mutations for :runners:direct-java:compileJava (Thread[included builds,5,main]) started.
Resolve mutations for :runners:direct-java:compileJava (Thread[included builds,5,main]) completed. Took 0.0 secs.
:runners:direct-java:compileJava (Thread[Execution worker Thread 7,5,main]) started.
> Task :runners:direct-java:compileJava FROM-CACHE
Custom actions are attached to task ':runners:direct-java:compileJava'.
Build cache key for task ':runners:direct-java:compileJava' is a3733318a34234f0c4ccc15aa6e7c1a8
Task ':runners:direct-java:compileJava' is not up-to-date because:
No history is available.
Loaded cache entry for task ':runners:direct-java:compileJava' with cache key a3733318a34234f0c4ccc15aa6e7c1a8
:runners:direct-java:compileJava (Thread[Execution worker Thread 7,5,main]) completed. Took 0.091 secs.
Resolve mutations for :runners:direct-java:classes (Thread[Execution worker Thread 7,5,main]) started.
Resolve mutations for :runners:direct-java:classes (Thread[Execution worker Thread 7,5,main]) completed. Took 0.0 secs.
:runners:direct-java:classes (Thread[Execution worker Thread 3,5,main]) started.
> Task :runners:direct-java:classes UP-TO-DATE
Skipping task ':runners:direct-java:classes' as it has no actions.
:runners:direct-java:classes (Thread[Execution worker Thread 3,5,main]) completed. Took 0.0 secs.
Resolve mutations for :runners:direct-java:shadowJar (Thread[Execution worker Thread 4,5,main]) started.
Resolve mutations for :runners:direct-java:shadowJar (Thread[Execution worker Thread 4,5,main]) completed. Took 0.0 secs.
:runners:direct-java:shadowJar (Thread[Execution worker Thread 7,5,main]) started.
> Task :runners:core-java:compileTestJava FROM-CACHE
Custom actions are attached to task ':runners:core-java:compileTestJava'.
Build cache key for task ':runners:core-java:compileTestJava' is 2c2711a187e4b603d11a41b926619f03
Task ':runners:core-java:compileTestJava' is not up-to-date because:
No history is available.
Loaded cache entry for task ':runners:core-java:compileTestJava' with cache key 2c2711a187e4b603d11a41b926619f03
:runners:core-java:compileTestJava (Thread[Execution worker,5,main]) completed. Took 0.339 secs.
Resolve mutations for :runners:core-java:testClasses (Thread[Execution worker Thread 3,5,main]) started.
Resolve mutations for :runners:core-java:testClasses (Thread[Execution worker Thread 3,5,main]) completed. Took 0.0 secs.
:runners:core-java:testClasses (Thread[Execution worker Thread 5,5,main]) started.
> Task :runners:core-java:testClasses UP-TO-DATE
Skipping task ':runners:core-java:testClasses' as it has no actions.
:runners:core-java:testClasses (Thread[Execution worker Thread 5,5,main]) completed. Took 0.0 secs.
Resolve mutations for :runners:core-java:testJar (Thread[Execution worker,5,main]) started.
Resolve mutations for :runners:core-java:testJar (Thread[Execution worker,5,main]) completed. Took 0.0 secs.
:runners:core-java:testJar (Thread[Execution worker Thread 3,5,main]) started.
> Task :runners:core-java:testJar
Caching disabled for task ':runners:core-java:testJar' because:
Not worth caching
Task ':runners:core-java:testJar' is not up-to-date because:
No history is available.
file or directory '<https://ci-beam.apache.org/job/beam_PerformanceTests_InfluxDbIO_IT/ws/src/runners/core-java/build/resources/test',> not found
:runners:core-java:testJar (Thread[Execution worker Thread 3,5,main]) completed. Took 0.034 secs.
work action resolve beam-runners-core-java-tests.jar (project :runners:core-java) (Thread[Execution worker Thread 3,5,main]) started.
work action null (Thread[Execution worker Thread 3,5,main]) completed. Took 0.0 secs.
> Task :runners:direct-java:shadowJar FROM-CACHE
Custom actions are attached to task ':runners:direct-java:shadowJar'.
Build cache key for task ':runners:direct-java:shadowJar' is 11d762368b5e9134d317b0738adf48a4
Task ':runners:direct-java:shadowJar' is not up-to-date because:
No history is available.
Loaded cache entry for task ':runners:direct-java:shadowJar' with cache key 11d762368b5e9134d317b0738adf48a4
:runners:direct-java:shadowJar (Thread[Execution worker Thread 7,5,main]) completed. Took 0.299 secs.
work action resolve beam-runners-direct-java.jar (project :runners:direct-java) (Thread[Execution worker Thread 5,5,main]) started.
work action null (Thread[Execution worker Thread 5,5,main]) completed. Took 0.0 secs.
work action resolve beam-runners-direct-java.jar (project :runners:direct-java) (Thread[Execution worker Thread 5,5,main]) started.
work action null (Thread[Execution worker Thread 5,5,main]) completed. Took 0.0 secs.
Resolve mutations for :runners:direct-java:compileTestJava (Thread[included builds,5,main]) started.
Resolve mutations for :runners:direct-java:compileTestJava (Thread[included builds,5,main]) completed. Took 0.0 secs.
:runners:direct-java:compileTestJava (Thread[Execution worker Thread 7,5,main]) started.
> Task :runners:direct-java:compileTestJava FROM-CACHE
Custom actions are attached to task ':runners:direct-java:compileTestJava'.
Build cache key for task ':runners:direct-java:compileTestJava' is 6f9b73dbbacf6a9ce65dff8e087aa583
Task ':runners:direct-java:compileTestJava' is not up-to-date because:
No history is available.
Loaded cache entry for task ':runners:direct-java:compileTestJava' with cache key 6f9b73dbbacf6a9ce65dff8e087aa583
:runners:direct-java:compileTestJava (Thread[Execution worker Thread 7,5,main]) completed. Took 0.101 secs.
Resolve mutations for :runners:direct-java:testClasses (Thread[Execution worker Thread 7,5,main]) started.
Resolve mutations for :runners:direct-java:testClasses (Thread[Execution worker Thread 7,5,main]) completed. Took 0.0 secs.
:runners:direct-java:testClasses (Thread[Execution worker Thread 7,5,main]) started.
> Task :runners:direct-java:testClasses UP-TO-DATE
Skipping task ':runners:direct-java:testClasses' as it has no actions.
:runners:direct-java:testClasses (Thread[Execution worker Thread 7,5,main]) completed. Took 0.0 secs.
Resolve mutations for :runners:direct-java:shadowTestJar (Thread[Execution worker Thread 2,5,main]) started.
Resolve mutations for :runners:direct-java:shadowTestJar (Thread[Execution worker Thread 2,5,main]) completed. Took 0.0 secs.
:runners:direct-java:shadowTestJar (Thread[Execution worker Thread 5,5,main]) started.
> Task :runners:direct-java:shadowTestJar FROM-CACHE
Build cache key for task ':runners:direct-java:shadowTestJar' is bfe27741881843f362850380fed3b3fe
Task ':runners:direct-java:shadowTestJar' is not up-to-date because:
No history is available.
Loaded cache entry for task ':runners:direct-java:shadowTestJar' with cache key bfe27741881843f362850380fed3b3fe
:runners:direct-java:shadowTestJar (Thread[Execution worker Thread 5,5,main]) completed. Took 0.2 secs.
work action resolve beam-runners-direct-java-tests.jar (project :runners:direct-java) (Thread[Execution worker Thread 5,5,main]) started.
work action null (Thread[Execution worker Thread 5,5,main]) completed. Took 0.0 secs.
Resolve mutations for :sdks:java:io:influxdb:integrationTest (Thread[Execution worker Thread 6,5,main]) started.
Resolve mutations for :sdks:java:io:influxdb:integrationTest (Thread[Execution worker Thread 6,5,main]) completed. Took 0.0 secs.
:sdks:java:io:influxdb:integrationTest (Thread[Execution worker Thread 7,5,main]) started.
producer locations for task group 0 (Thread[Execution worker Thread 6,5,main]) started.
producer locations for task group 0 (Thread[Execution worker Thread 6,5,main]) completed. Took 0.0 secs.
Gradle Test Executor 241 started executing tests.
> Task :sdks:java:io:influxdb:integrationTest
Custom actions are attached to task ':sdks:java:io:influxdb:integrationTest'.
Build cache key for task ':sdks:java:io:influxdb:integrationTest' is 8fd386cc3de9837efa4d8f303672676e
Task ':sdks:java:io:influxdb:integrationTest' is not up-to-date because:
Task.upToDateWhen is false.
Starting process 'Gradle Test Executor 241'. Working directory: <https://ci-beam.apache.org/job/beam_PerformanceTests_InfluxDbIO_IT/ws/src/sdks/java/io/influxdb> Command: /usr/lib/jvm/java-8-openjdk-amd64/bin/java -DbeamTestPipelineOptions=["--influxDBURL=http://34.172.108.100:8086","--influxDBUserName=superadmin","--influxDBPassword=supersecretpassword","--databaseName=db1"] -Djava.security.manager=worker.org.gradle.process.internal.worker.child.BootstrapSecurityManager -Dorg.gradle.internal.worker.tmpdir=<https://ci-beam.apache.org/job/beam_PerformanceTests_InfluxDbIO_IT/ws/src/sdks/java/io/influxdb/build/tmp/integrationTest/work> -Dorg.gradle.native=false -Xmx2g -Dfile.encoding=UTF-8 -Duser.country=US -Duser.language=en -Duser.variant -ea -cp /home/jenkins/.gradle/caches/7.5.1/workerMain/gradle-worker.jar worker.org.gradle.process.internal.worker.GradleWorkerMain 'Gradle Test Executor 241'
Successfully started process 'Gradle Test Executor 241'
org.apache.beam.sdk.io.influxdb.InfluxDbIOIT > testWriteAndReadWithMultipleMetric FAILED
org.influxdb.InfluxDBIOException: java.net.SocketTimeoutException: connect timed out
at org.influxdb.impl.InfluxDBImpl.execute(InfluxDBImpl.java:836)
at org.influxdb.impl.InfluxDBImpl.executeQuery(InfluxDBImpl.java:819)
at org.influxdb.impl.InfluxDBImpl.query(InfluxDBImpl.java:554)
at org.apache.beam.sdk.io.influxdb.InfluxDbIOIT.initTest(InfluxDbIOIT.java:99)
Caused by:
java.net.SocketTimeoutException: connect timed out
at java.net.PlainSocketImpl.socketConnect(Native Method)
at java.net.AbstractPlainSocketImpl.doConnect(AbstractPlainSocketImpl.java:350)
at java.net.AbstractPlainSocketImpl.connectToAddress(AbstractPlainSocketImpl.java:206)
at java.net.AbstractPlainSocketImpl.connect(AbstractPlainSocketImpl.java:188)
at java.net.SocksSocketImpl.connect(SocksSocketImpl.java:392)
at java.net.Socket.connect(Socket.java:607)
at okhttp3.internal.platform.Platform.connectSocket(Platform.kt:119)
at okhttp3.internal.connection.RealConnection.connectSocket(RealConnection.kt:283)
at okhttp3.internal.connection.RealConnection.connect(RealConnection.kt:195)
at okhttp3.internal.connection.ExchangeFinder.findConnection(ExchangeFinder.kt:249)
at okhttp3.internal.connection.ExchangeFinder.findHealthyConnection(ExchangeFinder.kt:108)
at okhttp3.internal.connection.ExchangeFinder.find(ExchangeFinder.kt:76)
at okhttp3.internal.connection.RealCall.initExchange$okhttp(RealCall.kt:245)
at okhttp3.internal.connection.ConnectInterceptor.intercept(ConnectInterceptor.kt:32)
at okhttp3.internal.http.RealInterceptorChain.proceed(RealInterceptorChain.kt:100)
at okhttp3.internal.cache.CacheInterceptor.intercept(CacheInterceptor.kt:82)
at okhttp3.internal.http.RealInterceptorChain.proceed(RealInterceptorChain.kt:100)
at okhttp3.internal.http.BridgeInterceptor.intercept(BridgeInterceptor.kt:83)
at okhttp3.internal.http.RealInterceptorChain.proceed(RealInterceptorChain.kt:100)
at okhttp3.internal.http.RetryAndFollowUpInterceptor.intercept(RetryAndFollowUpInterceptor.kt:76)
at okhttp3.internal.http.RealInterceptorChain.proceed(RealInterceptorChain.kt:100)
at org.influxdb.impl.BasicAuthInterceptor.intercept(BasicAuthInterceptor.java:22)
at okhttp3.internal.http.RealInterceptorChain.proceed(RealInterceptorChain.kt:100)
at org.influxdb.impl.GzipRequestInterceptor.intercept(GzipRequestInterceptor.java:42)
at okhttp3.internal.http.RealInterceptorChain.proceed(RealInterceptorChain.kt:100)
at okhttp3.logging.HttpLoggingInterceptor.intercept(HttpLoggingInterceptor.kt:152)
at okhttp3.internal.http.RealInterceptorChain.proceed(RealInterceptorChain.kt:100)
at okhttp3.internal.connection.RealCall.getResponseWithInterceptorChain$okhttp(RealCall.kt:197)
at okhttp3.internal.connection.RealCall.execute(RealCall.kt:148)
at retrofit2.OkHttpCall.execute(OkHttpCall.java:190)
at org.influxdb.impl.InfluxDBImpl.execute(InfluxDBImpl.java:824)
... 3 more
Gradle Test Executor 241 finished executing tests.
> Task :sdks:java:io:influxdb:integrationTest FAILED
6 tests completed, 1 failed
Finished generating test XML results (0.001 secs) into: <https://ci-beam.apache.org/job/beam_PerformanceTests_InfluxDbIO_IT/ws/src/sdks/java/io/influxdb/build/test-results/integrationTest>
Generating HTML test report...
Finished generating test html results (0.002 secs) into: <https://ci-beam.apache.org/job/beam_PerformanceTests_InfluxDbIO_IT/ws/src/sdks/java/io/influxdb/build/reports/tests/integrationTest>
:sdks:java:io:influxdb:integrationTest (Thread[Execution worker Thread 7,5,main]) completed. Took 24.542 secs.
FAILURE: Build failed with an exception.
* What went wrong:
Execution failed for task ':sdks:java:io:influxdb:integrationTest'.
> There were failing tests. See the report at: file://<https://ci-beam.apache.org/job/beam_PerformanceTests_InfluxDbIO_IT/ws/src/sdks/java/io/influxdb/build/reports/tests/integrationTest/index.html>
* Try:
> Run with --stacktrace option to get the stack trace.
> Run with --debug option to get more log output.
* Get more help at https://help.gradle.org
Deprecated Gradle features were used in this build, making it incompatible with Gradle 8.0.
You can use '--warning-mode all' to show the individual deprecation warnings and determine if they come from your own scripts or plugins.
See https://docs.gradle.org/7.5.1/userguide/command_line_interface.html#sec:command_line_warnings
BUILD FAILED in 32s
77 actionable tasks: 42 executed, 33 from cache, 2 up-to-date
Publishing build scan...
https://gradle.com/s/i57f6ibmael4u
Build step 'Invoke Gradle script' changed build result to FAILURE
Build step 'Invoke Gradle script' marked build as failure
---------------------------------------------------------------------
To unsubscribe, e-mail: builds-unsubscribe@beam.apache.org
For additional commands, e-mail: builds-help@beam.apache.org
Build failed in Jenkins: beam_PerformanceTests_InfluxDbIO_IT #2331
Posted by Apache Jenkins Server <je...@builds.apache.org>.
See <https://ci-beam.apache.org/job/beam_PerformanceTests_InfluxDbIO_IT/2331/display/redirect?page=changes>
Changes:
[noreply] updated the pydoc for running a custom model on Beam (#23218)
------------------------------------------
[...truncated 182.96 KB...]
:sdks:java:core:shadowTestJar (Thread[Execution worker Thread 4,5,main]) completed. Took 0.107 secs.
work action resolve beam-sdks-java-core-tests.jar (project :sdks:java:core) (Thread[Execution worker Thread 4,5,main]) started.
work action null (Thread[Execution worker Thread 4,5,main]) completed. Took 0.0 secs.
Resolve mutations for :runners:core-java:compileTestJava (Thread[Execution worker Thread 4,5,main]) started.
Resolve mutations for :runners:core-java:compileTestJava (Thread[Execution worker Thread 4,5,main]) completed. Took 0.0 secs.
:runners:core-java:compileTestJava (Thread[Execution worker Thread 4,5,main]) started.
> Task :sdks:java:harness:compileJava FROM-CACHE
Custom actions are attached to task ':sdks:java:harness:compileJava'.
Build cache key for task ':sdks:java:harness:compileJava' is 55c1ba444de22ad92ffdd61cd925c48a
Task ':sdks:java:harness:compileJava' is not up-to-date because:
No history is available.
Loaded cache entry for task ':sdks:java:harness:compileJava' with cache key 55c1ba444de22ad92ffdd61cd925c48a
:sdks:java:harness:compileJava (Thread[included builds,5,main]) completed. Took 0.076 secs.
Resolve mutations for :sdks:java:harness:classes (Thread[included builds,5,main]) started.
Resolve mutations for :sdks:java:harness:classes (Thread[included builds,5,main]) completed. Took 0.0 secs.
:sdks:java:harness:classes (Thread[Execution worker Thread 3,5,main]) started.
> Task :sdks:java:harness:classes UP-TO-DATE
Skipping task ':sdks:java:harness:classes' as it has no actions.
:sdks:java:harness:classes (Thread[Execution worker Thread 3,5,main]) completed. Took 0.0 secs.
Resolve mutations for :sdks:java:harness:jar (Thread[Execution worker Thread 5,5,main]) started.
Resolve mutations for :sdks:java:harness:jar (Thread[Execution worker Thread 5,5,main]) completed. Took 0.0 secs.
:sdks:java:harness:jar (Thread[Execution worker,5,main]) started.
> Task :sdks:java:harness:jar
Caching disabled for task ':sdks:java:harness:jar' because:
Not worth caching
Task ':sdks:java:harness:jar' is not up-to-date because:
No history is available.
file or directory '<https://ci-beam.apache.org/job/beam_PerformanceTests_InfluxDbIO_IT/ws/src/sdks/java/harness/build/resources/main',> not found
:sdks:java:harness:jar (Thread[Execution worker,5,main]) completed. Took 0.057 secs.
work action resolve beam-sdks-java-harness-unshaded.jar (project :sdks:java:harness) (Thread[Execution worker,5,main]) started.
work action null (Thread[Execution worker,5,main]) completed. Took 0.0 secs.
Resolve mutations for :runners:java-fn-execution:compileJava (Thread[Execution worker Thread 2,5,main]) started.
Resolve mutations for :runners:java-fn-execution:compileJava (Thread[Execution worker Thread 2,5,main]) completed. Took 0.0 secs.
:runners:java-fn-execution:compileJava (Thread[Execution worker Thread 2,5,main]) started.
> Task :runners:java-fn-execution:compileJava FROM-CACHE
Custom actions are attached to task ':runners:java-fn-execution:compileJava'.
Build cache key for task ':runners:java-fn-execution:compileJava' is fe71cd3c0e12fd6a8bc12d21975a91d1
Task ':runners:java-fn-execution:compileJava' is not up-to-date because:
No history is available.
Loaded cache entry for task ':runners:java-fn-execution:compileJava' with cache key fe71cd3c0e12fd6a8bc12d21975a91d1
:runners:java-fn-execution:compileJava (Thread[Execution worker Thread 2,5,main]) completed. Took 0.084 secs.
Resolve mutations for :runners:java-fn-execution:classes (Thread[Execution worker Thread 2,5,main]) started.
Resolve mutations for :runners:java-fn-execution:classes (Thread[Execution worker Thread 2,5,main]) completed. Took 0.0 secs.
:runners:java-fn-execution:classes (Thread[Execution worker Thread 2,5,main]) started.
> Task :runners:java-fn-execution:classes UP-TO-DATE
Skipping task ':runners:java-fn-execution:classes' as it has no actions.
:runners:java-fn-execution:classes (Thread[Execution worker Thread 2,5,main]) completed. Took 0.0 secs.
Resolve mutations for :runners:java-fn-execution:jar (Thread[Execution worker Thread 2,5,main]) started.
Resolve mutations for :runners:java-fn-execution:jar (Thread[Execution worker Thread 2,5,main]) completed. Took 0.0 secs.
:runners:java-fn-execution:jar (Thread[Execution worker Thread 6,5,main]) started.
> Task :runners:java-fn-execution:jar
Caching disabled for task ':runners:java-fn-execution:jar' because:
Not worth caching
Task ':runners:java-fn-execution:jar' is not up-to-date because:
No history is available.
file or directory '<https://ci-beam.apache.org/job/beam_PerformanceTests_InfluxDbIO_IT/ws/src/runners/java-fn-execution/build/resources/main',> not found
:runners:java-fn-execution:jar (Thread[Execution worker Thread 6,5,main]) completed. Took 0.055 secs.
work action resolve beam-runners-java-fn-execution.jar (project :runners:java-fn-execution) (Thread[Execution worker Thread 6,5,main]) started.
work action null (Thread[Execution worker Thread 6,5,main]) completed. Took 0.0 secs.
Resolve mutations for :runners:direct-java:compileJava (Thread[Execution worker Thread 6,5,main]) started.
Resolve mutations for :runners:direct-java:compileJava (Thread[Execution worker Thread 6,5,main]) completed. Took 0.0 secs.
:runners:direct-java:compileJava (Thread[Execution worker Thread 6,5,main]) started.
> Task :runners:core-java:compileTestJava FROM-CACHE
Custom actions are attached to task ':runners:core-java:compileTestJava'.
Build cache key for task ':runners:core-java:compileTestJava' is 2c2711a187e4b603d11a41b926619f03
Task ':runners:core-java:compileTestJava' is not up-to-date because:
No history is available.
Loaded cache entry for task ':runners:core-java:compileTestJava' with cache key 2c2711a187e4b603d11a41b926619f03
:runners:core-java:compileTestJava (Thread[Execution worker Thread 4,5,main]) completed. Took 0.33 secs.
Resolve mutations for :runners:core-java:testClasses (Thread[Execution worker Thread 4,5,main]) started.
Resolve mutations for :runners:core-java:testClasses (Thread[Execution worker Thread 4,5,main]) completed. Took 0.0 secs.
:runners:core-java:testClasses (Thread[Execution worker Thread 4,5,main]) started.
> Task :runners:core-java:testClasses UP-TO-DATE
Skipping task ':runners:core-java:testClasses' as it has no actions.
:runners:core-java:testClasses (Thread[Execution worker Thread 4,5,main]) completed. Took 0.0 secs.
Resolve mutations for :runners:core-java:testJar (Thread[Execution worker Thread 4,5,main]) started.
Resolve mutations for :runners:core-java:testJar (Thread[Execution worker Thread 4,5,main]) completed. Took 0.0 secs.
:runners:core-java:testJar (Thread[Execution worker Thread 4,5,main]) started.
> Task :runners:direct-java:compileJava FROM-CACHE
Custom actions are attached to task ':runners:direct-java:compileJava'.
Build cache key for task ':runners:direct-java:compileJava' is a3733318a34234f0c4ccc15aa6e7c1a8
Task ':runners:direct-java:compileJava' is not up-to-date because:
No history is available.
Loaded cache entry for task ':runners:direct-java:compileJava' with cache key a3733318a34234f0c4ccc15aa6e7c1a8
:runners:direct-java:compileJava (Thread[Execution worker Thread 6,5,main]) completed. Took 0.084 secs.
Resolve mutations for :runners:direct-java:classes (Thread[Execution worker Thread 7,5,main]) started.
Resolve mutations for :runners:direct-java:classes (Thread[Execution worker Thread 7,5,main]) completed. Took 0.0 secs.
:runners:direct-java:classes (Thread[Execution worker Thread 7,5,main]) started.
> Task :runners:direct-java:classes UP-TO-DATE
Skipping task ':runners:direct-java:classes' as it has no actions.
:runners:direct-java:classes (Thread[Execution worker Thread 7,5,main]) completed. Took 0.0 secs.
Resolve mutations for :runners:direct-java:shadowJar (Thread[Execution worker,5,main]) started.
Resolve mutations for :runners:direct-java:shadowJar (Thread[Execution worker,5,main]) completed. Took 0.0 secs.
:runners:direct-java:shadowJar (Thread[Execution worker Thread 6,5,main]) started.
> Task :runners:core-java:testJar
Caching disabled for task ':runners:core-java:testJar' because:
Not worth caching
Task ':runners:core-java:testJar' is not up-to-date because:
No history is available.
file or directory '<https://ci-beam.apache.org/job/beam_PerformanceTests_InfluxDbIO_IT/ws/src/runners/core-java/build/resources/test',> not found
:runners:core-java:testJar (Thread[Execution worker Thread 4,5,main]) completed. Took 0.033 secs.
work action resolve beam-runners-core-java-tests.jar (project :runners:core-java) (Thread[Execution worker Thread 4,5,main]) started.
work action null (Thread[Execution worker Thread 4,5,main]) completed. Took 0.0 secs.
> Task :runners:direct-java:shadowJar FROM-CACHE
Custom actions are attached to task ':runners:direct-java:shadowJar'.
Build cache key for task ':runners:direct-java:shadowJar' is 11d762368b5e9134d317b0738adf48a4
Task ':runners:direct-java:shadowJar' is not up-to-date because:
No history is available.
Loaded cache entry for task ':runners:direct-java:shadowJar' with cache key 11d762368b5e9134d317b0738adf48a4
:runners:direct-java:shadowJar (Thread[Execution worker Thread 6,5,main]) completed. Took 0.295 secs.
work action resolve beam-runners-direct-java.jar (project :runners:direct-java) (Thread[Execution worker Thread 7,5,main]) started.
work action null (Thread[Execution worker Thread 7,5,main]) completed. Took 0.0 secs.
work action resolve beam-runners-direct-java.jar (project :runners:direct-java) (Thread[Execution worker Thread 7,5,main]) started.
work action null (Thread[Execution worker Thread 7,5,main]) completed. Took 0.0 secs.
Resolve mutations for :runners:direct-java:compileTestJava (Thread[Execution worker Thread 7,5,main]) started.
Resolve mutations for :runners:direct-java:compileTestJava (Thread[Execution worker Thread 7,5,main]) completed. Took 0.0 secs.
:runners:direct-java:compileTestJava (Thread[Execution worker Thread 6,5,main]) started.
> Task :runners:direct-java:compileTestJava FROM-CACHE
Custom actions are attached to task ':runners:direct-java:compileTestJava'.
Build cache key for task ':runners:direct-java:compileTestJava' is 6f9b73dbbacf6a9ce65dff8e087aa583
Task ':runners:direct-java:compileTestJava' is not up-to-date because:
No history is available.
Loaded cache entry for task ':runners:direct-java:compileTestJava' with cache key 6f9b73dbbacf6a9ce65dff8e087aa583
:runners:direct-java:compileTestJava (Thread[Execution worker Thread 6,5,main]) completed. Took 0.096 secs.
Resolve mutations for :runners:direct-java:testClasses (Thread[Execution worker Thread 6,5,main]) started.
Resolve mutations for :runners:direct-java:testClasses (Thread[Execution worker Thread 6,5,main]) completed. Took 0.0 secs.
:runners:direct-java:testClasses (Thread[Execution worker,5,main]) started.
> Task :runners:direct-java:testClasses UP-TO-DATE
Skipping task ':runners:direct-java:testClasses' as it has no actions.
:runners:direct-java:testClasses (Thread[Execution worker,5,main]) completed. Took 0.0 secs.
Resolve mutations for :runners:direct-java:shadowTestJar (Thread[Execution worker Thread 5,5,main]) started.
Resolve mutations for :runners:direct-java:shadowTestJar (Thread[Execution worker Thread 5,5,main]) completed. Took 0.0 secs.
:runners:direct-java:shadowTestJar (Thread[Execution worker Thread 2,5,main]) started.
> Task :runners:direct-java:shadowTestJar FROM-CACHE
Build cache key for task ':runners:direct-java:shadowTestJar' is bfe27741881843f362850380fed3b3fe
Task ':runners:direct-java:shadowTestJar' is not up-to-date because:
No history is available.
Loaded cache entry for task ':runners:direct-java:shadowTestJar' with cache key bfe27741881843f362850380fed3b3fe
:runners:direct-java:shadowTestJar (Thread[Execution worker Thread 2,5,main]) completed. Took 0.201 secs.
work action resolve beam-runners-direct-java-tests.jar (project :runners:direct-java) (Thread[Execution worker Thread 2,5,main]) started.
work action null (Thread[Execution worker Thread 2,5,main]) completed. Took 0.0 secs.
Resolve mutations for :sdks:java:io:influxdb:integrationTest (Thread[Execution worker Thread 2,5,main]) started.
Resolve mutations for :sdks:java:io:influxdb:integrationTest (Thread[Execution worker Thread 2,5,main]) completed. Took 0.0 secs.
:sdks:java:io:influxdb:integrationTest (Thread[Execution worker,5,main]) started.
producer locations for task group 0 (Thread[Execution worker Thread 4,5,main]) started.
producer locations for task group 0 (Thread[Execution worker Thread 4,5,main]) completed. Took 0.0 secs.
Gradle Test Executor 232 started executing tests.
> Task :sdks:java:io:influxdb:integrationTest
Custom actions are attached to task ':sdks:java:io:influxdb:integrationTest'.
Build cache key for task ':sdks:java:io:influxdb:integrationTest' is 8fd386cc3de9837efa4d8f303672676e
Task ':sdks:java:io:influxdb:integrationTest' is not up-to-date because:
Task.upToDateWhen is false.
Starting process 'Gradle Test Executor 232'. Working directory: <https://ci-beam.apache.org/job/beam_PerformanceTests_InfluxDbIO_IT/ws/src/sdks/java/io/influxdb> Command: /usr/lib/jvm/java-8-openjdk-amd64/bin/java -DbeamTestPipelineOptions=["--influxDBURL=http://34.170.74.202:8086","--influxDBUserName=superadmin","--influxDBPassword=supersecretpassword","--databaseName=db1"] -Djava.security.manager=worker.org.gradle.process.internal.worker.child.BootstrapSecurityManager -Dorg.gradle.internal.worker.tmpdir=<https://ci-beam.apache.org/job/beam_PerformanceTests_InfluxDbIO_IT/ws/src/sdks/java/io/influxdb/build/tmp/integrationTest/work> -Dorg.gradle.native=false -Xmx2g -Dfile.encoding=UTF-8 -Duser.country=US -Duser.language=en -Duser.variant -ea -cp /home/jenkins/.gradle/caches/7.5.1/workerMain/gradle-worker.jar worker.org.gradle.process.internal.worker.GradleWorkerMain 'Gradle Test Executor 232'
Successfully started process 'Gradle Test Executor 232'
org.apache.beam.sdk.io.influxdb.InfluxDbIOIT > testWriteAndReadWithMultipleMetric FAILED
org.influxdb.InfluxDBIOException: java.net.SocketTimeoutException: connect timed out
at org.influxdb.impl.InfluxDBImpl.execute(InfluxDBImpl.java:836)
at org.influxdb.impl.InfluxDBImpl.executeQuery(InfluxDBImpl.java:819)
at org.influxdb.impl.InfluxDBImpl.query(InfluxDBImpl.java:554)
at org.apache.beam.sdk.io.influxdb.InfluxDbIOIT.initTest(InfluxDbIOIT.java:99)
Caused by:
java.net.SocketTimeoutException: connect timed out
at java.net.PlainSocketImpl.socketConnect(Native Method)
at java.net.AbstractPlainSocketImpl.doConnect(AbstractPlainSocketImpl.java:350)
at java.net.AbstractPlainSocketImpl.connectToAddress(AbstractPlainSocketImpl.java:206)
at java.net.AbstractPlainSocketImpl.connect(AbstractPlainSocketImpl.java:188)
at java.net.SocksSocketImpl.connect(SocksSocketImpl.java:392)
at java.net.Socket.connect(Socket.java:607)
at okhttp3.internal.platform.Platform.connectSocket(Platform.kt:119)
at okhttp3.internal.connection.RealConnection.connectSocket(RealConnection.kt:283)
at okhttp3.internal.connection.RealConnection.connect(RealConnection.kt:195)
at okhttp3.internal.connection.ExchangeFinder.findConnection(ExchangeFinder.kt:249)
at okhttp3.internal.connection.ExchangeFinder.findHealthyConnection(ExchangeFinder.kt:108)
at okhttp3.internal.connection.ExchangeFinder.find(ExchangeFinder.kt:76)
at okhttp3.internal.connection.RealCall.initExchange$okhttp(RealCall.kt:245)
at okhttp3.internal.connection.ConnectInterceptor.intercept(ConnectInterceptor.kt:32)
at okhttp3.internal.http.RealInterceptorChain.proceed(RealInterceptorChain.kt:100)
at okhttp3.internal.cache.CacheInterceptor.intercept(CacheInterceptor.kt:82)
at okhttp3.internal.http.RealInterceptorChain.proceed(RealInterceptorChain.kt:100)
at okhttp3.internal.http.BridgeInterceptor.intercept(BridgeInterceptor.kt:83)
at okhttp3.internal.http.RealInterceptorChain.proceed(RealInterceptorChain.kt:100)
at okhttp3.internal.http.RetryAndFollowUpInterceptor.intercept(RetryAndFollowUpInterceptor.kt:76)
at okhttp3.internal.http.RealInterceptorChain.proceed(RealInterceptorChain.kt:100)
at org.influxdb.impl.BasicAuthInterceptor.intercept(BasicAuthInterceptor.java:22)
at okhttp3.internal.http.RealInterceptorChain.proceed(RealInterceptorChain.kt:100)
at org.influxdb.impl.GzipRequestInterceptor.intercept(GzipRequestInterceptor.java:42)
at okhttp3.internal.http.RealInterceptorChain.proceed(RealInterceptorChain.kt:100)
at okhttp3.logging.HttpLoggingInterceptor.intercept(HttpLoggingInterceptor.kt:152)
at okhttp3.internal.http.RealInterceptorChain.proceed(RealInterceptorChain.kt:100)
at okhttp3.internal.connection.RealCall.getResponseWithInterceptorChain$okhttp(RealCall.kt:197)
at okhttp3.internal.connection.RealCall.execute(RealCall.kt:148)
at retrofit2.OkHttpCall.execute(OkHttpCall.java:190)
at org.influxdb.impl.InfluxDBImpl.execute(InfluxDBImpl.java:824)
... 3 more
Gradle Test Executor 232 finished executing tests.
> Task :sdks:java:io:influxdb:integrationTest FAILED
6 tests completed, 1 failed
Finished generating test XML results (0.001 secs) into: <https://ci-beam.apache.org/job/beam_PerformanceTests_InfluxDbIO_IT/ws/src/sdks/java/io/influxdb/build/test-results/integrationTest>
Generating HTML test report...
Finished generating test html results (0.002 secs) into: <https://ci-beam.apache.org/job/beam_PerformanceTests_InfluxDbIO_IT/ws/src/sdks/java/io/influxdb/build/reports/tests/integrationTest>
:sdks:java:io:influxdb:integrationTest (Thread[Execution worker,5,main]) completed. Took 19.717 secs.
FAILURE: Build failed with an exception.
* What went wrong:
Execution failed for task ':sdks:java:io:influxdb:integrationTest'.
> There were failing tests. See the report at: file://<https://ci-beam.apache.org/job/beam_PerformanceTests_InfluxDbIO_IT/ws/src/sdks/java/io/influxdb/build/reports/tests/integrationTest/index.html>
* Try:
> Run with --stacktrace option to get the stack trace.
> Run with --debug option to get more log output.
* Get more help at https://help.gradle.org
Deprecated Gradle features were used in this build, making it incompatible with Gradle 8.0.
You can use '--warning-mode all' to show the individual deprecation warnings and determine if they come from your own scripts or plugins.
See https://docs.gradle.org/7.5.1/userguide/command_line_interface.html#sec:command_line_warnings
BUILD FAILED in 27s
77 actionable tasks: 42 executed, 33 from cache, 2 up-to-date
Publishing build scan...
https://gradle.com/s/2nstwdkxfzr54
Build step 'Invoke Gradle script' changed build result to FAILURE
Build step 'Invoke Gradle script' marked build as failure
---------------------------------------------------------------------
To unsubscribe, e-mail: builds-unsubscribe@beam.apache.org
For additional commands, e-mail: builds-help@beam.apache.org
Build failed in Jenkins: beam_PerformanceTests_InfluxDbIO_IT #2330
Posted by Apache Jenkins Server <je...@builds.apache.org>.
See <https://ci-beam.apache.org/job/beam_PerformanceTests_InfluxDbIO_IT/2330/display/redirect>
Changes:
------------------------------------------
[...truncated 187.77 KB...]
Loaded cache entry for task ':runners:java-fn-execution:compileJava' with cache key fe71cd3c0e12fd6a8bc12d21975a91d1
:runners:java-fn-execution:compileJava (Thread[Execution worker Thread 5,5,main]) completed. Took 0.092 secs.
Resolve mutations for :runners:java-fn-execution:classes (Thread[Execution worker Thread 5,5,main]) started.
Resolve mutations for :runners:java-fn-execution:classes (Thread[Execution worker Thread 5,5,main]) completed. Took 0.0 secs.
:runners:java-fn-execution:classes (Thread[Execution worker Thread 5,5,main]) started.
> Task :runners:java-fn-execution:classes UP-TO-DATE
Skipping task ':runners:java-fn-execution:classes' as it has no actions.
:runners:java-fn-execution:classes (Thread[Execution worker Thread 5,5,main]) completed. Took 0.0 secs.
Resolve mutations for :runners:java-fn-execution:jar (Thread[Execution worker Thread 5,5,main]) started.
Resolve mutations for :runners:java-fn-execution:jar (Thread[Execution worker Thread 5,5,main]) completed. Took 0.0 secs.
:runners:java-fn-execution:jar (Thread[Execution worker Thread 2,5,main]) started.
> Task :runners:java-fn-execution:jar
Caching disabled for task ':runners:java-fn-execution:jar' because:
Not worth caching
Task ':runners:java-fn-execution:jar' is not up-to-date because:
No history is available.
file or directory '<https://ci-beam.apache.org/job/beam_PerformanceTests_InfluxDbIO_IT/ws/src/runners/java-fn-execution/build/resources/main',> not found
:runners:java-fn-execution:jar (Thread[Execution worker Thread 2,5,main]) completed. Took 0.039 secs.
work action resolve beam-runners-java-fn-execution.jar (project :runners:java-fn-execution) (Thread[Execution worker Thread 4,5,main]) started.
work action null (Thread[Execution worker Thread 4,5,main]) completed. Took 0.0 secs.
Resolve mutations for :runners:direct-java:compileJava (Thread[Execution worker Thread 4,5,main]) started.
Resolve mutations for :runners:direct-java:compileJava (Thread[Execution worker Thread 4,5,main]) completed. Took 0.0 secs.
:runners:direct-java:compileJava (Thread[Execution worker Thread 2,5,main]) started.
> Task :runners:core-java:compileTestJava FROM-CACHE
Custom actions are attached to task ':runners:core-java:compileTestJava'.
Build cache key for task ':runners:core-java:compileTestJava' is 2c2711a187e4b603d11a41b926619f03
Task ':runners:core-java:compileTestJava' is not up-to-date because:
No history is available.
Loaded cache entry for task ':runners:core-java:compileTestJava' with cache key 2c2711a187e4b603d11a41b926619f03
:runners:core-java:compileTestJava (Thread[Execution worker Thread 7,5,main]) completed. Took 0.311 secs.
Resolve mutations for :runners:core-java:testClasses (Thread[Execution worker Thread 7,5,main]) started.
Resolve mutations for :runners:core-java:testClasses (Thread[Execution worker Thread 7,5,main]) completed. Took 0.0 secs.
:runners:core-java:testClasses (Thread[Execution worker Thread 7,5,main]) started.
> Task :runners:core-java:testClasses UP-TO-DATE
Skipping task ':runners:core-java:testClasses' as it has no actions.
:runners:core-java:testClasses (Thread[Execution worker Thread 7,5,main]) completed. Took 0.0 secs.
Resolve mutations for :runners:core-java:testJar (Thread[Execution worker Thread 6,5,main]) started.
Resolve mutations for :runners:core-java:testJar (Thread[Execution worker Thread 6,5,main]) completed. Took 0.0 secs.
:runners:core-java:testJar (Thread[included builds,5,main]) started.
> Task :runners:core-java:testJar
Caching disabled for task ':runners:core-java:testJar' because:
Not worth caching
Task ':runners:core-java:testJar' is not up-to-date because:
No history is available.
file or directory '<https://ci-beam.apache.org/job/beam_PerformanceTests_InfluxDbIO_IT/ws/src/runners/core-java/build/resources/test',> not found
:runners:core-java:testJar (Thread[included builds,5,main]) completed. Took 0.034 secs.
work action resolve beam-runners-core-java-tests.jar (project :runners:core-java) (Thread[Execution worker Thread 7,5,main]) started.
work action null (Thread[Execution worker Thread 7,5,main]) completed. Took 0.0 secs.
> Task :runners:direct-java:compileJava FROM-CACHE
Custom actions are attached to task ':runners:direct-java:compileJava'.
Build cache key for task ':runners:direct-java:compileJava' is a3733318a34234f0c4ccc15aa6e7c1a8
Task ':runners:direct-java:compileJava' is not up-to-date because:
No history is available.
Loaded cache entry for task ':runners:direct-java:compileJava' with cache key a3733318a34234f0c4ccc15aa6e7c1a8
:runners:direct-java:compileJava (Thread[Execution worker Thread 2,5,main]) completed. Took 0.084 secs.
Resolve mutations for :runners:direct-java:classes (Thread[Execution worker Thread 7,5,main]) started.
Resolve mutations for :runners:direct-java:classes (Thread[Execution worker Thread 7,5,main]) completed. Took 0.0 secs.
:runners:direct-java:classes (Thread[Execution worker Thread 4,5,main]) started.
> Task :runners:direct-java:classes UP-TO-DATE
Skipping task ':runners:direct-java:classes' as it has no actions.
:runners:direct-java:classes (Thread[Execution worker Thread 4,5,main]) completed. Took 0.0 secs.
Resolve mutations for :runners:direct-java:shadowJar (Thread[Execution worker Thread 6,5,main]) started.
Resolve mutations for :runners:direct-java:shadowJar (Thread[Execution worker Thread 6,5,main]) completed. Took 0.0 secs.
:runners:direct-java:shadowJar (Thread[Execution worker Thread 7,5,main]) started.
> Task :runners:direct-java:shadowJar FROM-CACHE
Custom actions are attached to task ':runners:direct-java:shadowJar'.
Build cache key for task ':runners:direct-java:shadowJar' is 11d762368b5e9134d317b0738adf48a4
Task ':runners:direct-java:shadowJar' is not up-to-date because:
No history is available.
Loaded cache entry for task ':runners:direct-java:shadowJar' with cache key 11d762368b5e9134d317b0738adf48a4
:runners:direct-java:shadowJar (Thread[Execution worker Thread 7,5,main]) completed. Took 0.292 secs.
work action resolve beam-runners-direct-java.jar (project :runners:direct-java) (Thread[Execution worker Thread 7,5,main]) started.
work action null (Thread[Execution worker Thread 7,5,main]) completed. Took 0.0 secs.
work action resolve beam-runners-direct-java.jar (project :runners:direct-java) (Thread[Execution worker Thread 7,5,main]) started.
work action null (Thread[Execution worker Thread 7,5,main]) completed. Took 0.0 secs.
Resolve mutations for :runners:direct-java:compileTestJava (Thread[Execution worker Thread 5,5,main]) started.
Resolve mutations for :runners:direct-java:compileTestJava (Thread[Execution worker Thread 5,5,main]) completed. Took 0.0 secs.
:runners:direct-java:compileTestJava (Thread[Execution worker Thread 4,5,main]) started.
> Task :runners:direct-java:compileTestJava FROM-CACHE
Custom actions are attached to task ':runners:direct-java:compileTestJava'.
Build cache key for task ':runners:direct-java:compileTestJava' is 6f9b73dbbacf6a9ce65dff8e087aa583
Task ':runners:direct-java:compileTestJava' is not up-to-date because:
No history is available.
Loaded cache entry for task ':runners:direct-java:compileTestJava' with cache key 6f9b73dbbacf6a9ce65dff8e087aa583
:runners:direct-java:compileTestJava (Thread[Execution worker Thread 4,5,main]) completed. Took 0.099 secs.
Resolve mutations for :runners:direct-java:testClasses (Thread[Execution worker Thread 7,5,main]) started.
Resolve mutations for :runners:direct-java:testClasses (Thread[Execution worker Thread 7,5,main]) completed. Took 0.0 secs.
:runners:direct-java:testClasses (Thread[Execution worker Thread 7,5,main]) started.
> Task :runners:direct-java:testClasses UP-TO-DATE
Skipping task ':runners:direct-java:testClasses' as it has no actions.
:runners:direct-java:testClasses (Thread[Execution worker Thread 7,5,main]) completed. Took 0.0 secs.
Resolve mutations for :runners:direct-java:shadowTestJar (Thread[Execution worker Thread 2,5,main]) started.
Resolve mutations for :runners:direct-java:shadowTestJar (Thread[Execution worker Thread 2,5,main]) completed. Took 0.0 secs.
:runners:direct-java:shadowTestJar (Thread[Execution worker Thread 4,5,main]) started.
> Task :runners:direct-java:shadowTestJar FROM-CACHE
Build cache key for task ':runners:direct-java:shadowTestJar' is bfe27741881843f362850380fed3b3fe
Task ':runners:direct-java:shadowTestJar' is not up-to-date because:
No history is available.
Loaded cache entry for task ':runners:direct-java:shadowTestJar' with cache key bfe27741881843f362850380fed3b3fe
:runners:direct-java:shadowTestJar (Thread[Execution worker Thread 4,5,main]) completed. Took 0.199 secs.
work action resolve beam-runners-direct-java-tests.jar (project :runners:direct-java) (Thread[Execution worker Thread 4,5,main]) started.
work action null (Thread[Execution worker Thread 4,5,main]) completed. Took 0.0 secs.
Resolve mutations for :sdks:java:io:influxdb:integrationTest (Thread[Execution worker Thread 4,5,main]) started.
Resolve mutations for :sdks:java:io:influxdb:integrationTest (Thread[Execution worker Thread 4,5,main]) completed. Took 0.0 secs.
:sdks:java:io:influxdb:integrationTest (Thread[Execution worker Thread 7,5,main]) started.
producer locations for task group 0 (Thread[Execution worker Thread 5,5,main]) started.
producer locations for task group 0 (Thread[Execution worker Thread 5,5,main]) completed. Took 0.0 secs.
Gradle Test Executor 223 started executing tests.
> Task :sdks:java:io:influxdb:integrationTest
Custom actions are attached to task ':sdks:java:io:influxdb:integrationTest'.
Build cache key for task ':sdks:java:io:influxdb:integrationTest' is 8fd386cc3de9837efa4d8f303672676e
Task ':sdks:java:io:influxdb:integrationTest' is not up-to-date because:
Task.upToDateWhen is false.
Starting process 'Gradle Test Executor 223'. Working directory: <https://ci-beam.apache.org/job/beam_PerformanceTests_InfluxDbIO_IT/ws/src/sdks/java/io/influxdb> Command: /usr/lib/jvm/java-8-openjdk-amd64/bin/java -DbeamTestPipelineOptions=["--influxDBURL=http://35.223.249.18:8086","--influxDBUserName=superadmin","--influxDBPassword=supersecretpassword","--databaseName=db1"] -Djava.security.manager=worker.org.gradle.process.internal.worker.child.BootstrapSecurityManager -Dorg.gradle.internal.worker.tmpdir=<https://ci-beam.apache.org/job/beam_PerformanceTests_InfluxDbIO_IT/ws/src/sdks/java/io/influxdb/build/tmp/integrationTest/work> -Dorg.gradle.native=false -Xmx2g -Dfile.encoding=UTF-8 -Duser.country=US -Duser.language=en -Duser.variant -ea -cp /home/jenkins/.gradle/caches/7.5.1/workerMain/gradle-worker.jar worker.org.gradle.process.internal.worker.GradleWorkerMain 'Gradle Test Executor 223'
Successfully started process 'Gradle Test Executor 223'
org.apache.beam.sdk.io.influxdb.InfluxDbIOIT > testWriteAndReadWithMultipleMetric FAILED
org.influxdb.InfluxDBIOException: java.net.SocketTimeoutException: connect timed out
at org.influxdb.impl.InfluxDBImpl.execute(InfluxDBImpl.java:836)
at org.influxdb.impl.InfluxDBImpl.executeQuery(InfluxDBImpl.java:819)
at org.influxdb.impl.InfluxDBImpl.query(InfluxDBImpl.java:554)
at org.apache.beam.sdk.io.influxdb.InfluxDbIOIT.initTest(InfluxDbIOIT.java:99)
Caused by:
java.net.SocketTimeoutException: connect timed out
at java.net.PlainSocketImpl.socketConnect(Native Method)
at java.net.AbstractPlainSocketImpl.doConnect(AbstractPlainSocketImpl.java:350)
at java.net.AbstractPlainSocketImpl.connectToAddress(AbstractPlainSocketImpl.java:206)
at java.net.AbstractPlainSocketImpl.connect(AbstractPlainSocketImpl.java:188)
at java.net.SocksSocketImpl.connect(SocksSocketImpl.java:392)
at java.net.Socket.connect(Socket.java:607)
at okhttp3.internal.platform.Platform.connectSocket(Platform.kt:119)
at okhttp3.internal.connection.RealConnection.connectSocket(RealConnection.kt:283)
at okhttp3.internal.connection.RealConnection.connect(RealConnection.kt:195)
at okhttp3.internal.connection.ExchangeFinder.findConnection(ExchangeFinder.kt:249)
at okhttp3.internal.connection.ExchangeFinder.findHealthyConnection(ExchangeFinder.kt:108)
at okhttp3.internal.connection.ExchangeFinder.find(ExchangeFinder.kt:76)
at okhttp3.internal.connection.RealCall.initExchange$okhttp(RealCall.kt:245)
at okhttp3.internal.connection.ConnectInterceptor.intercept(ConnectInterceptor.kt:32)
at okhttp3.internal.http.RealInterceptorChain.proceed(RealInterceptorChain.kt:100)
at okhttp3.internal.cache.CacheInterceptor.intercept(CacheInterceptor.kt:82)
at okhttp3.internal.http.RealInterceptorChain.proceed(RealInterceptorChain.kt:100)
at okhttp3.internal.http.BridgeInterceptor.intercept(BridgeInterceptor.kt:83)
at okhttp3.internal.http.RealInterceptorChain.proceed(RealInterceptorChain.kt:100)
at okhttp3.internal.http.RetryAndFollowUpInterceptor.intercept(RetryAndFollowUpInterceptor.kt:76)
at okhttp3.internal.http.RealInterceptorChain.proceed(RealInterceptorChain.kt:100)
at org.influxdb.impl.BasicAuthInterceptor.intercept(BasicAuthInterceptor.java:22)
at okhttp3.internal.http.RealInterceptorChain.proceed(RealInterceptorChain.kt:100)
at org.influxdb.impl.GzipRequestInterceptor.intercept(GzipRequestInterceptor.java:42)
at okhttp3.internal.http.RealInterceptorChain.proceed(RealInterceptorChain.kt:100)
at okhttp3.logging.HttpLoggingInterceptor.intercept(HttpLoggingInterceptor.kt:152)
at okhttp3.internal.http.RealInterceptorChain.proceed(RealInterceptorChain.kt:100)
at okhttp3.internal.connection.RealCall.getResponseWithInterceptorChain$okhttp(RealCall.kt:197)
at okhttp3.internal.connection.RealCall.execute(RealCall.kt:148)
at retrofit2.OkHttpCall.execute(OkHttpCall.java:190)
at org.influxdb.impl.InfluxDBImpl.execute(InfluxDBImpl.java:824)
... 3 more
org.influxdb.InfluxDBIOException: java.net.SocketTimeoutException: connect timed out
at org.influxdb.impl.InfluxDBImpl.execute(InfluxDBImpl.java:836)
at org.influxdb.impl.InfluxDBImpl.executeQuery(InfluxDBImpl.java:819)
at org.influxdb.impl.InfluxDBImpl.query(InfluxDBImpl.java:554)
at org.apache.beam.sdk.io.influxdb.InfluxDbIOIT.clear(InfluxDbIOIT.java:88)
Caused by:
java.net.SocketTimeoutException: connect timed out
at java.net.PlainSocketImpl.socketConnect(Native Method)
at java.net.AbstractPlainSocketImpl.doConnect(AbstractPlainSocketImpl.java:350)
at java.net.AbstractPlainSocketImpl.connectToAddress(AbstractPlainSocketImpl.java:206)
at java.net.AbstractPlainSocketImpl.connect(AbstractPlainSocketImpl.java:188)
at java.net.SocksSocketImpl.connect(SocksSocketImpl.java:392)
at java.net.Socket.connect(Socket.java:607)
at okhttp3.internal.platform.Platform.connectSocket(Platform.kt:119)
at okhttp3.internal.connection.RealConnection.connectSocket(RealConnection.kt:283)
at okhttp3.internal.connection.RealConnection.connect(RealConnection.kt:195)
at okhttp3.internal.connection.ExchangeFinder.findConnection(ExchangeFinder.kt:249)
at okhttp3.internal.connection.ExchangeFinder.findHealthyConnection(ExchangeFinder.kt:108)
at okhttp3.internal.connection.ExchangeFinder.find(ExchangeFinder.kt:76)
at okhttp3.internal.connection.RealCall.initExchange$okhttp(RealCall.kt:245)
at okhttp3.internal.connection.ConnectInterceptor.intercept(ConnectInterceptor.kt:32)
at okhttp3.internal.http.RealInterceptorChain.proceed(RealInterceptorChain.kt:100)
at okhttp3.internal.cache.CacheInterceptor.intercept(CacheInterceptor.kt:82)
at okhttp3.internal.http.RealInterceptorChain.proceed(RealInterceptorChain.kt:100)
at okhttp3.internal.http.BridgeInterceptor.intercept(BridgeInterceptor.kt:83)
at okhttp3.internal.http.RealInterceptorChain.proceed(RealInterceptorChain.kt:100)
at okhttp3.internal.http.RetryAndFollowUpInterceptor.intercept(RetryAndFollowUpInterceptor.kt:76)
at okhttp3.internal.http.RealInterceptorChain.proceed(RealInterceptorChain.kt:100)
at org.influxdb.impl.BasicAuthInterceptor.intercept(BasicAuthInterceptor.java:22)
at okhttp3.internal.http.RealInterceptorChain.proceed(RealInterceptorChain.kt:100)
at org.influxdb.impl.GzipRequestInterceptor.intercept(GzipRequestInterceptor.java:42)
at okhttp3.internal.http.RealInterceptorChain.proceed(RealInterceptorChain.kt:100)
at okhttp3.logging.HttpLoggingInterceptor.intercept(HttpLoggingInterceptor.kt:152)
at okhttp3.internal.http.RealInterceptorChain.proceed(RealInterceptorChain.kt:100)
at okhttp3.internal.connection.RealCall.getResponseWithInterceptorChain$okhttp(RealCall.kt:197)
at okhttp3.internal.connection.RealCall.execute(RealCall.kt:148)
at retrofit2.OkHttpCall.execute(OkHttpCall.java:190)
at org.influxdb.impl.InfluxDBImpl.execute(InfluxDBImpl.java:824)
... 3 more
Gradle Test Executor 223 finished executing tests.
> Task :sdks:java:io:influxdb:integrationTest
6 tests completed, 1 failed
Finished generating test XML results (0.001 secs) into: <https://ci-beam.apache.org/job/beam_PerformanceTests_InfluxDbIO_IT/ws/src/sdks/java/io/influxdb/build/test-results/integrationTest>
Generating HTML test report...
Finished generating test html results (0.002 secs) into: <https://ci-beam.apache.org/job/beam_PerformanceTests_InfluxDbIO_IT/ws/src/sdks/java/io/influxdb/build/reports/tests/integrationTest>
> Task :sdks:java:io:influxdb:integrationTest FAILED
:sdks:java:io:influxdb:integrationTest (Thread[Execution worker Thread 7,5,main]) completed. Took 34.093 secs.
FAILURE: Build failed with an exception.
* What went wrong:
Execution failed for task ':sdks:java:io:influxdb:integrationTest'.
> There were failing tests. See the report at: file://<https://ci-beam.apache.org/job/beam_PerformanceTests_InfluxDbIO_IT/ws/src/sdks/java/io/influxdb/build/reports/tests/integrationTest/index.html>
* Try:
> Run with --stacktrace option to get the stack trace.
> Run with --debug option to get more log output.
* Get more help at https://help.gradle.org
Deprecated Gradle features were used in this build, making it incompatible with Gradle 8.0.
You can use '--warning-mode all' to show the individual deprecation warnings and determine if they come from your own scripts or plugins.
See https://docs.gradle.org/7.5.1/userguide/command_line_interface.html#sec:command_line_warnings
BUILD FAILED in 41s
77 actionable tasks: 42 executed, 33 from cache, 2 up-to-date
Publishing build scan...
https://gradle.com/s/meeq5cdrlnw6s
Build step 'Invoke Gradle script' changed build result to FAILURE
Build step 'Invoke Gradle script' marked build as failure
---------------------------------------------------------------------
To unsubscribe, e-mail: builds-unsubscribe@beam.apache.org
For additional commands, e-mail: builds-help@beam.apache.org
Build failed in Jenkins: beam_PerformanceTests_InfluxDbIO_IT #2329
Posted by Apache Jenkins Server <je...@builds.apache.org>.
See <https://ci-beam.apache.org/job/beam_PerformanceTests_InfluxDbIO_IT/2329/display/redirect>
Changes:
------------------------------------------
[...truncated 187.55 KB...]
Task ':runners:java-fn-execution:compileJava' is not up-to-date because:
No history is available.
Loaded cache entry for task ':runners:java-fn-execution:compileJava' with cache key fe71cd3c0e12fd6a8bc12d21975a91d1
:runners:java-fn-execution:compileJava (Thread[Execution worker Thread 5,5,main]) completed. Took 0.085 secs.
Resolve mutations for :runners:java-fn-execution:classes (Thread[Execution worker Thread 5,5,main]) started.
Resolve mutations for :runners:java-fn-execution:classes (Thread[Execution worker Thread 5,5,main]) completed. Took 0.0 secs.
:runners:java-fn-execution:classes (Thread[Execution worker Thread 5,5,main]) started.
> Task :runners:java-fn-execution:classes UP-TO-DATE
Skipping task ':runners:java-fn-execution:classes' as it has no actions.
:runners:java-fn-execution:classes (Thread[Execution worker Thread 5,5,main]) completed. Took 0.0 secs.
Resolve mutations for :runners:java-fn-execution:jar (Thread[Execution worker Thread 5,5,main]) started.
Resolve mutations for :runners:java-fn-execution:jar (Thread[Execution worker Thread 5,5,main]) completed. Took 0.0 secs.
:runners:java-fn-execution:jar (Thread[Execution worker Thread 3,5,main]) started.
> Task :runners:java-fn-execution:jar
Caching disabled for task ':runners:java-fn-execution:jar' because:
Not worth caching
Task ':runners:java-fn-execution:jar' is not up-to-date because:
No history is available.
file or directory '<https://ci-beam.apache.org/job/beam_PerformanceTests_InfluxDbIO_IT/ws/src/runners/java-fn-execution/build/resources/main',> not found
:runners:java-fn-execution:jar (Thread[Execution worker Thread 3,5,main]) completed. Took 0.04 secs.
work action resolve beam-runners-java-fn-execution.jar (project :runners:java-fn-execution) (Thread[Execution worker Thread 3,5,main]) started.
work action null (Thread[Execution worker Thread 3,5,main]) completed. Took 0.0 secs.
Resolve mutations for :runners:direct-java:compileJava (Thread[Execution worker Thread 4,5,main]) started.
Resolve mutations for :runners:direct-java:compileJava (Thread[Execution worker Thread 4,5,main]) completed. Took 0.0 secs.
:runners:direct-java:compileJava (Thread[included builds,5,main]) started.
> Task :runners:core-java:compileTestJava FROM-CACHE
Custom actions are attached to task ':runners:core-java:compileTestJava'.
Build cache key for task ':runners:core-java:compileTestJava' is 2c2711a187e4b603d11a41b926619f03
Task ':runners:core-java:compileTestJava' is not up-to-date because:
No history is available.
Loaded cache entry for task ':runners:core-java:compileTestJava' with cache key 2c2711a187e4b603d11a41b926619f03
:runners:core-java:compileTestJava (Thread[Execution worker Thread 7,5,main]) completed. Took 0.33 secs.
Resolve mutations for :runners:core-java:testClasses (Thread[Execution worker Thread 7,5,main]) started.
Resolve mutations for :runners:core-java:testClasses (Thread[Execution worker Thread 7,5,main]) completed. Took 0.0 secs.
:runners:core-java:testClasses (Thread[Execution worker,5,main]) started.
> Task :runners:core-java:testClasses UP-TO-DATE
Skipping task ':runners:core-java:testClasses' as it has no actions.
:runners:core-java:testClasses (Thread[Execution worker,5,main]) completed. Took 0.0 secs.
Resolve mutations for :runners:core-java:testJar (Thread[Execution worker Thread 6,5,main]) started.
Resolve mutations for :runners:core-java:testJar (Thread[Execution worker Thread 6,5,main]) completed. Took 0.0 secs.
:runners:core-java:testJar (Thread[Execution worker Thread 6,5,main]) started.
> Task :runners:direct-java:compileJava FROM-CACHE
Custom actions are attached to task ':runners:direct-java:compileJava'.
Build cache key for task ':runners:direct-java:compileJava' is a3733318a34234f0c4ccc15aa6e7c1a8
Task ':runners:direct-java:compileJava' is not up-to-date because:
No history is available.
Loaded cache entry for task ':runners:direct-java:compileJava' with cache key a3733318a34234f0c4ccc15aa6e7c1a8
:runners:direct-java:compileJava (Thread[included builds,5,main]) completed. Took 0.095 secs.
Resolve mutations for :runners:direct-java:classes (Thread[included builds,5,main]) started.
Resolve mutations for :runners:direct-java:classes (Thread[included builds,5,main]) completed. Took 0.0 secs.
:runners:direct-java:classes (Thread[included builds,5,main]) started.
> Task :runners:direct-java:classes UP-TO-DATE
Skipping task ':runners:direct-java:classes' as it has no actions.
:runners:direct-java:classes (Thread[included builds,5,main]) completed. Took 0.0 secs.
Resolve mutations for :runners:direct-java:shadowJar (Thread[included builds,5,main]) started.
Resolve mutations for :runners:direct-java:shadowJar (Thread[included builds,5,main]) completed. Took 0.0 secs.
:runners:direct-java:shadowJar (Thread[Execution worker,5,main]) started.
> Task :runners:core-java:testJar
Caching disabled for task ':runners:core-java:testJar' because:
Not worth caching
Task ':runners:core-java:testJar' is not up-to-date because:
No history is available.
file or directory '<https://ci-beam.apache.org/job/beam_PerformanceTests_InfluxDbIO_IT/ws/src/runners/core-java/build/resources/test',> not found
:runners:core-java:testJar (Thread[Execution worker Thread 6,5,main]) completed. Took 0.035 secs.
work action resolve beam-runners-core-java-tests.jar (project :runners:core-java) (Thread[Execution worker Thread 6,5,main]) started.
work action null (Thread[Execution worker Thread 6,5,main]) completed. Took 0.0 secs.
> Task :runners:direct-java:shadowJar FROM-CACHE
Custom actions are attached to task ':runners:direct-java:shadowJar'.
Build cache key for task ':runners:direct-java:shadowJar' is 11d762368b5e9134d317b0738adf48a4
Task ':runners:direct-java:shadowJar' is not up-to-date because:
No history is available.
Loaded cache entry for task ':runners:direct-java:shadowJar' with cache key 11d762368b5e9134d317b0738adf48a4
:runners:direct-java:shadowJar (Thread[Execution worker,5,main]) completed. Took 0.292 secs.
work action resolve beam-runners-direct-java.jar (project :runners:direct-java) (Thread[Execution worker,5,main]) started.
work action null (Thread[Execution worker,5,main]) completed. Took 0.0 secs.
work action resolve beam-runners-direct-java.jar (project :runners:direct-java) (Thread[Execution worker,5,main]) started.
work action null (Thread[Execution worker,5,main]) completed. Took 0.0 secs.
Resolve mutations for :runners:direct-java:compileTestJava (Thread[Execution worker,5,main]) started.
Resolve mutations for :runners:direct-java:compileTestJava (Thread[Execution worker,5,main]) completed. Took 0.0 secs.
:runners:direct-java:compileTestJava (Thread[Execution worker Thread 4,5,main]) started.
> Task :runners:direct-java:compileTestJava FROM-CACHE
Custom actions are attached to task ':runners:direct-java:compileTestJava'.
Build cache key for task ':runners:direct-java:compileTestJava' is 6f9b73dbbacf6a9ce65dff8e087aa583
Task ':runners:direct-java:compileTestJava' is not up-to-date because:
No history is available.
Loaded cache entry for task ':runners:direct-java:compileTestJava' with cache key 6f9b73dbbacf6a9ce65dff8e087aa583
:runners:direct-java:compileTestJava (Thread[Execution worker Thread 4,5,main]) completed. Took 0.103 secs.
Resolve mutations for :runners:direct-java:testClasses (Thread[Execution worker Thread 4,5,main]) started.
Resolve mutations for :runners:direct-java:testClasses (Thread[Execution worker Thread 4,5,main]) completed. Took 0.0 secs.
:runners:direct-java:testClasses (Thread[Execution worker Thread 4,5,main]) started.
> Task :runners:direct-java:testClasses UP-TO-DATE
Skipping task ':runners:direct-java:testClasses' as it has no actions.
:runners:direct-java:testClasses (Thread[Execution worker Thread 4,5,main]) completed. Took 0.0 secs.
Resolve mutations for :runners:direct-java:shadowTestJar (Thread[Execution worker Thread 4,5,main]) started.
Resolve mutations for :runners:direct-java:shadowTestJar (Thread[Execution worker Thread 4,5,main]) completed. Took 0.0 secs.
:runners:direct-java:shadowTestJar (Thread[Execution worker Thread 7,5,main]) started.
> Task :runners:direct-java:shadowTestJar FROM-CACHE
Build cache key for task ':runners:direct-java:shadowTestJar' is bfe27741881843f362850380fed3b3fe
Task ':runners:direct-java:shadowTestJar' is not up-to-date because:
No history is available.
Loaded cache entry for task ':runners:direct-java:shadowTestJar' with cache key bfe27741881843f362850380fed3b3fe
:runners:direct-java:shadowTestJar (Thread[Execution worker Thread 7,5,main]) completed. Took 0.2 secs.
work action resolve beam-runners-direct-java-tests.jar (project :runners:direct-java) (Thread[Execution worker Thread 7,5,main]) started.
work action null (Thread[Execution worker Thread 7,5,main]) completed. Took 0.0 secs.
Resolve mutations for :sdks:java:io:influxdb:integrationTest (Thread[Execution worker Thread 7,5,main]) started.
Resolve mutations for :sdks:java:io:influxdb:integrationTest (Thread[Execution worker Thread 7,5,main]) completed. Took 0.0 secs.
:sdks:java:io:influxdb:integrationTest (Thread[Execution worker Thread 6,5,main]) started.
producer locations for task group 0 (Thread[Execution worker Thread 7,5,main]) started.
producer locations for task group 0 (Thread[Execution worker Thread 7,5,main]) completed. Took 0.0 secs.
Gradle Test Executor 214 started executing tests.
> Task :sdks:java:io:influxdb:integrationTest
Custom actions are attached to task ':sdks:java:io:influxdb:integrationTest'.
Build cache key for task ':sdks:java:io:influxdb:integrationTest' is 8fd386cc3de9837efa4d8f303672676e
Task ':sdks:java:io:influxdb:integrationTest' is not up-to-date because:
Task.upToDateWhen is false.
Starting process 'Gradle Test Executor 214'. Working directory: <https://ci-beam.apache.org/job/beam_PerformanceTests_InfluxDbIO_IT/ws/src/sdks/java/io/influxdb> Command: /usr/lib/jvm/java-8-openjdk-amd64/bin/java -DbeamTestPipelineOptions=["--influxDBURL=http://34.170.44.47:8086","--influxDBUserName=superadmin","--influxDBPassword=supersecretpassword","--databaseName=db1"] -Djava.security.manager=worker.org.gradle.process.internal.worker.child.BootstrapSecurityManager -Dorg.gradle.internal.worker.tmpdir=<https://ci-beam.apache.org/job/beam_PerformanceTests_InfluxDbIO_IT/ws/src/sdks/java/io/influxdb/build/tmp/integrationTest/work> -Dorg.gradle.native=false -Xmx2g -Dfile.encoding=UTF-8 -Duser.country=US -Duser.language=en -Duser.variant -ea -cp /home/jenkins/.gradle/caches/7.5.1/workerMain/gradle-worker.jar worker.org.gradle.process.internal.worker.GradleWorkerMain 'Gradle Test Executor 214'
Successfully started process 'Gradle Test Executor 214'
org.apache.beam.sdk.io.influxdb.InfluxDbIOIT > testWriteAndReadWithMultipleMetric FAILED
org.influxdb.InfluxDBIOException: java.net.SocketTimeoutException: connect timed out
at org.influxdb.impl.InfluxDBImpl.execute(InfluxDBImpl.java:836)
at org.influxdb.impl.InfluxDBImpl.executeQuery(InfluxDBImpl.java:819)
at org.influxdb.impl.InfluxDBImpl.query(InfluxDBImpl.java:554)
at org.apache.beam.sdk.io.influxdb.InfluxDbIOIT.initTest(InfluxDbIOIT.java:99)
Caused by:
java.net.SocketTimeoutException: connect timed out
at java.net.PlainSocketImpl.socketConnect(Native Method)
at java.net.AbstractPlainSocketImpl.doConnect(AbstractPlainSocketImpl.java:350)
at java.net.AbstractPlainSocketImpl.connectToAddress(AbstractPlainSocketImpl.java:206)
at java.net.AbstractPlainSocketImpl.connect(AbstractPlainSocketImpl.java:188)
at java.net.SocksSocketImpl.connect(SocksSocketImpl.java:392)
at java.net.Socket.connect(Socket.java:607)
at okhttp3.internal.platform.Platform.connectSocket(Platform.kt:119)
at okhttp3.internal.connection.RealConnection.connectSocket(RealConnection.kt:283)
at okhttp3.internal.connection.RealConnection.connect(RealConnection.kt:195)
at okhttp3.internal.connection.ExchangeFinder.findConnection(ExchangeFinder.kt:249)
at okhttp3.internal.connection.ExchangeFinder.findHealthyConnection(ExchangeFinder.kt:108)
at okhttp3.internal.connection.ExchangeFinder.find(ExchangeFinder.kt:76)
at okhttp3.internal.connection.RealCall.initExchange$okhttp(RealCall.kt:245)
at okhttp3.internal.connection.ConnectInterceptor.intercept(ConnectInterceptor.kt:32)
at okhttp3.internal.http.RealInterceptorChain.proceed(RealInterceptorChain.kt:100)
at okhttp3.internal.cache.CacheInterceptor.intercept(CacheInterceptor.kt:82)
at okhttp3.internal.http.RealInterceptorChain.proceed(RealInterceptorChain.kt:100)
at okhttp3.internal.http.BridgeInterceptor.intercept(BridgeInterceptor.kt:83)
at okhttp3.internal.http.RealInterceptorChain.proceed(RealInterceptorChain.kt:100)
at okhttp3.internal.http.RetryAndFollowUpInterceptor.intercept(RetryAndFollowUpInterceptor.kt:76)
at okhttp3.internal.http.RealInterceptorChain.proceed(RealInterceptorChain.kt:100)
at org.influxdb.impl.BasicAuthInterceptor.intercept(BasicAuthInterceptor.java:22)
at okhttp3.internal.http.RealInterceptorChain.proceed(RealInterceptorChain.kt:100)
at org.influxdb.impl.GzipRequestInterceptor.intercept(GzipRequestInterceptor.java:42)
at okhttp3.internal.http.RealInterceptorChain.proceed(RealInterceptorChain.kt:100)
at okhttp3.logging.HttpLoggingInterceptor.intercept(HttpLoggingInterceptor.kt:152)
at okhttp3.internal.http.RealInterceptorChain.proceed(RealInterceptorChain.kt:100)
at okhttp3.internal.connection.RealCall.getResponseWithInterceptorChain$okhttp(RealCall.kt:197)
at okhttp3.internal.connection.RealCall.execute(RealCall.kt:148)
at retrofit2.OkHttpCall.execute(OkHttpCall.java:190)
at org.influxdb.impl.InfluxDBImpl.execute(InfluxDBImpl.java:824)
... 3 more
org.influxdb.InfluxDBIOException: java.net.SocketTimeoutException: connect timed out
at org.influxdb.impl.InfluxDBImpl.execute(InfluxDBImpl.java:836)
at org.influxdb.impl.InfluxDBImpl.executeQuery(InfluxDBImpl.java:819)
at org.influxdb.impl.InfluxDBImpl.query(InfluxDBImpl.java:554)
at org.apache.beam.sdk.io.influxdb.InfluxDbIOIT.clear(InfluxDbIOIT.java:88)
Caused by:
java.net.SocketTimeoutException: connect timed out
at java.net.PlainSocketImpl.socketConnect(Native Method)
at java.net.AbstractPlainSocketImpl.doConnect(AbstractPlainSocketImpl.java:350)
at java.net.AbstractPlainSocketImpl.connectToAddress(AbstractPlainSocketImpl.java:206)
at java.net.AbstractPlainSocketImpl.connect(AbstractPlainSocketImpl.java:188)
at java.net.SocksSocketImpl.connect(SocksSocketImpl.java:392)
at java.net.Socket.connect(Socket.java:607)
at okhttp3.internal.platform.Platform.connectSocket(Platform.kt:119)
at okhttp3.internal.connection.RealConnection.connectSocket(RealConnection.kt:283)
at okhttp3.internal.connection.RealConnection.connect(RealConnection.kt:195)
at okhttp3.internal.connection.ExchangeFinder.findConnection(ExchangeFinder.kt:249)
at okhttp3.internal.connection.ExchangeFinder.findHealthyConnection(ExchangeFinder.kt:108)
at okhttp3.internal.connection.ExchangeFinder.find(ExchangeFinder.kt:76)
at okhttp3.internal.connection.RealCall.initExchange$okhttp(RealCall.kt:245)
at okhttp3.internal.connection.ConnectInterceptor.intercept(ConnectInterceptor.kt:32)
at okhttp3.internal.http.RealInterceptorChain.proceed(RealInterceptorChain.kt:100)
at okhttp3.internal.cache.CacheInterceptor.intercept(CacheInterceptor.kt:82)
at okhttp3.internal.http.RealInterceptorChain.proceed(RealInterceptorChain.kt:100)
at okhttp3.internal.http.BridgeInterceptor.intercept(BridgeInterceptor.kt:83)
at okhttp3.internal.http.RealInterceptorChain.proceed(RealInterceptorChain.kt:100)
at okhttp3.internal.http.RetryAndFollowUpInterceptor.intercept(RetryAndFollowUpInterceptor.kt:76)
at okhttp3.internal.http.RealInterceptorChain.proceed(RealInterceptorChain.kt:100)
at org.influxdb.impl.BasicAuthInterceptor.intercept(BasicAuthInterceptor.java:22)
at okhttp3.internal.http.RealInterceptorChain.proceed(RealInterceptorChain.kt:100)
at org.influxdb.impl.GzipRequestInterceptor.intercept(GzipRequestInterceptor.java:42)
at okhttp3.internal.http.RealInterceptorChain.proceed(RealInterceptorChain.kt:100)
at okhttp3.logging.HttpLoggingInterceptor.intercept(HttpLoggingInterceptor.kt:152)
at okhttp3.internal.http.RealInterceptorChain.proceed(RealInterceptorChain.kt:100)
at okhttp3.internal.connection.RealCall.getResponseWithInterceptorChain$okhttp(RealCall.kt:197)
at okhttp3.internal.connection.RealCall.execute(RealCall.kt:148)
at retrofit2.OkHttpCall.execute(OkHttpCall.java:190)
at org.influxdb.impl.InfluxDBImpl.execute(InfluxDBImpl.java:824)
... 3 more
Gradle Test Executor 214 finished executing tests.
> Task :sdks:java:io:influxdb:integrationTest FAILED
6 tests completed, 1 failed
Finished generating test XML results (0.001 secs) into: <https://ci-beam.apache.org/job/beam_PerformanceTests_InfluxDbIO_IT/ws/src/sdks/java/io/influxdb/build/test-results/integrationTest>
Generating HTML test report...
Finished generating test html results (0.003 secs) into: <https://ci-beam.apache.org/job/beam_PerformanceTests_InfluxDbIO_IT/ws/src/sdks/java/io/influxdb/build/reports/tests/integrationTest>
:sdks:java:io:influxdb:integrationTest (Thread[Execution worker Thread 6,5,main]) completed. Took 26.859 secs.
FAILURE: Build failed with an exception.
* What went wrong:
Execution failed for task ':sdks:java:io:influxdb:integrationTest'.
> There were failing tests. See the report at: file://<https://ci-beam.apache.org/job/beam_PerformanceTests_InfluxDbIO_IT/ws/src/sdks/java/io/influxdb/build/reports/tests/integrationTest/index.html>
* Try:
> Run with --stacktrace option to get the stack trace.
> Run with --debug option to get more log output.
* Get more help at https://help.gradle.org
Deprecated Gradle features were used in this build, making it incompatible with Gradle 8.0.
You can use '--warning-mode all' to show the individual deprecation warnings and determine if they come from your own scripts or plugins.
See https://docs.gradle.org/7.5.1/userguide/command_line_interface.html#sec:command_line_warnings
BUILD FAILED in 34s
77 actionable tasks: 42 executed, 33 from cache, 2 up-to-date
Publishing build scan...
https://gradle.com/s/vgy2feez4amg4
Build step 'Invoke Gradle script' changed build result to FAILURE
Build step 'Invoke Gradle script' marked build as failure
---------------------------------------------------------------------
To unsubscribe, e-mail: builds-unsubscribe@beam.apache.org
For additional commands, e-mail: builds-help@beam.apache.org