You are viewing a plain text version of this content. The canonical link for it is here.
Posted to builds@hbase.apache.org by Apache Jenkins Server <je...@builds.apache.org> on 2014/08/26 19:48:46 UTC
Build failed in Jenkins: HBase-TRUNK #5432
See <https://builds.apache.org/job/HBase-TRUNK/5432/changes>
Changes:
[apurtell] HBASE-11814 TestAssignmentManager.testCloseFailed() and testOpenCloseRacing() is flaky (Virag Kothari)
------------------------------------------
[...truncated 1614 lines...]
Tests run: 1, Failures: 0, Errors: 0, Skipped: 0, Time elapsed: 9.279 sec - in org.apache.hadoop.hbase.client.TestClientScannerRPCTimeout
Running org.apache.hadoop.hbase.client.TestClientOperationInterrupt
Running org.apache.hadoop.hbase.client.TestRpcControllerFactory
Tests run: 1, Failures: 0, Errors: 0, Skipped: 0, Time elapsed: 3.018 sec - in org.apache.hadoop.hbase.client.TestRpcControllerFactory
Running org.apache.hadoop.hbase.client.TestScannersFromClientSide
Tests run: 5, Failures: 0, Errors: 0, Skipped: 0, Time elapsed: 11.812 sec - in org.apache.hadoop.hbase.client.TestScannersFromClientSide
Tests run: 1, Failures: 0, Errors: 0, Skipped: 0, Time elapsed: 30.199 sec - in org.apache.hadoop.hbase.client.TestClientOperationInterrupt
Running org.apache.hadoop.hbase.client.TestFromClientSide
Running org.apache.hadoop.hbase.client.TestRestoreSnapshotFromClientWithRegionReplicas
Running org.apache.hadoop.hbase.client.TestReplicaWithCluster
Tests run: 21, Failures: 0, Errors: 0, Skipped: 2, Time elapsed: 193.126 sec - in org.apache.hadoop.hbase.client.TestHCM
Tests run: 5, Failures: 0, Errors: 0, Skipped: 0, Time elapsed: 167.964 sec - in org.apache.hadoop.hbase.client.TestCloneSnapshotFromClientWithRegionReplicas
Running org.apache.hadoop.hbase.client.TestAdmin
Running org.apache.hadoop.hbase.client.TestHTableMultiplexer
Tests run: 1, Failures: 0, Errors: 0, Skipped: 0, Time elapsed: 9.564 sec - in org.apache.hadoop.hbase.client.TestHTableMultiplexer
Tests run: 4, Failures: 0, Errors: 1, Skipped: 0, Time elapsed: 51.432 sec <<< FAILURE! - in org.apache.hadoop.hbase.client.TestReplicaWithCluster
testReplicaAndReplication(org.apache.hadoop.hbase.client.TestReplicaWithCluster) Time elapsed: 30.32 sec <<< ERROR!
java.lang.Exception: test timed out after 30000 milliseconds
at java.lang.Thread.sleep(Native Method)
at org.apache.hadoop.hbase.client.HBaseAdmin.createTable(HBaseAdmin.java:539)
at org.apache.hadoop.hbase.client.TestReplicaWithCluster.testReplicaAndReplication(TestReplicaWithCluster.java:248)
Running org.apache.hadoop.hbase.client.TestScannerTimeout
Running org.apache.hadoop.hbase.client.TestReplicasClient
Tests run: 4, Failures: 0, Errors: 0, Skipped: 0, Time elapsed: 45.492 sec - in org.apache.hadoop.hbase.client.TestScannerTimeout
Running org.apache.hadoop.hbase.client.TestTableSnapshotScanner
Tests run: 5, Failures: 0, Errors: 0, Skipped: 0, Time elapsed: 186.354 sec - in org.apache.hadoop.hbase.client.TestRestoreSnapshotFromClientWithRegionReplicas
Tests run: 79, Failures: 0, Errors: 0, Skipped: 4, Time elapsed: 214.958 sec - in org.apache.hadoop.hbase.client.TestFromClientSide
Tests run: 12, Failures: 0, Errors: 0, Skipped: 0, Time elapsed: 112.401 sec - in org.apache.hadoop.hbase.client.TestReplicasClient
Running org.apache.hadoop.hbase.client.TestFromClientSide3
Running org.apache.hadoop.hbase.client.TestRestoreSnapshotFromClient
Running org.apache.hadoop.hbase.client.TestSnapshotMetadata
Tests run: 3, Failures: 0, Errors: 0, Skipped: 0, Time elapsed: 114.444 sec - in org.apache.hadoop.hbase.client.TestTableSnapshotScanner
Tests run: 4, Failures: 0, Errors: 0, Skipped: 0, Time elapsed: 44.798 sec - in org.apache.hadoop.hbase.client.TestSnapshotMetadata
Running org.apache.hadoop.hbase.TestMultiVersions
Tests run: 3, Failures: 0, Errors: 0, Skipped: 0, Time elapsed: 15.762 sec - in org.apache.hadoop.hbase.TestMultiVersions
Tests run: 6, Failures: 0, Errors: 0, Skipped: 0, Time elapsed: 97.641 sec - in org.apache.hadoop.hbase.client.TestFromClientSide3
Running org.apache.hadoop.hbase.TestHColumnDescriptorDefaultVersions
Running org.apache.hadoop.hbase.procedure.TestZKProcedure
Running org.apache.hadoop.hbase.procedure.TestZKProcedureControllers
Tests run: 4, Failures: 0, Errors: 0, Skipped: 0, Time elapsed: 5.612 sec - in org.apache.hadoop.hbase.procedure.TestZKProcedureControllers
Tests run: 4, Failures: 0, Errors: 0, Skipped: 0, Time elapsed: 7.151 sec - in org.apache.hadoop.hbase.procedure.TestZKProcedure
Tests run: 3, Failures: 0, Errors: 0, Skipped: 0, Time elapsed: 23.303 sec - in org.apache.hadoop.hbase.TestHColumnDescriptorDefaultVersions
Running org.apache.hadoop.hbase.constraint.TestConstraint
Running org.apache.hadoop.hbase.TestNamespace
Tests run: 5, Failures: 0, Errors: 0, Skipped: 0, Time elapsed: 13.331 sec - in org.apache.hadoop.hbase.constraint.TestConstraint
Tests run: 9, Failures: 0, Errors: 0, Skipped: 1, Time elapsed: 15.339 sec - in org.apache.hadoop.hbase.TestNamespace
Running org.apache.hadoop.hbase.rest.TestDeleteRow
Tests run: 5, Failures: 0, Errors: 0, Skipped: 0, Time elapsed: 151.165 sec - in org.apache.hadoop.hbase.client.TestRestoreSnapshotFromClient
Tests run: 2, Failures: 0, Errors: 0, Skipped: 0, Time elapsed: 13.274 sec - in org.apache.hadoop.hbase.rest.TestDeleteRow
Running org.apache.hadoop.hbase.rest.TestScannersWithLabels
Tests run: 2, Failures: 0, Errors: 0, Skipped: 0, Time elapsed: 8.255 sec - in org.apache.hadoop.hbase.rest.TestScannersWithLabels
Running org.apache.hadoop.hbase.rest.TestSchemaResource
Running org.apache.hadoop.hbase.rest.TestTableResource
Tests run: 8, Failures: 0, Errors: 0, Skipped: 0, Time elapsed: 8.829 sec - in org.apache.hadoop.hbase.rest.TestTableResource
Tests run: 2, Failures: 0, Errors: 0, Skipped: 0, Time elapsed: 11.478 sec - in org.apache.hadoop.hbase.rest.TestSchemaResource
Running org.apache.hadoop.hbase.rest.TestTableScan
Running org.apache.hadoop.hbase.rest.TestGetAndPutResource
Running org.apache.hadoop.hbase.rest.TestStatusResource
Running org.apache.hadoop.hbase.rest.TestResourceFilter
Tests run: 2, Failures: 0, Errors: 0, Skipped: 0, Time elapsed: 6.691 sec - in org.apache.hadoop.hbase.rest.TestStatusResource
Tests run: 1, Failures: 0, Errors: 0, Skipped: 0, Time elapsed: 2.421 sec - in org.apache.hadoop.hbase.rest.TestResourceFilter
Tests run: 10, Failures: 0, Errors: 0, Skipped: 0, Time elapsed: 33.602 sec - in org.apache.hadoop.hbase.rest.TestTableScan
Tests run: 18, Failures: 0, Errors: 0, Skipped: 0, Time elapsed: 49.626 sec - in org.apache.hadoop.hbase.rest.TestGetAndPutResource
Running org.apache.hadoop.hbase.rest.client.TestRemoteTable
Tests run: 9, Failures: 0, Errors: 0, Skipped: 0, Time elapsed: 31.304 sec - in org.apache.hadoop.hbase.rest.client.TestRemoteTable
Running org.apache.hadoop.hbase.rest.TestVersionResource
Running org.apache.hadoop.hbase.rest.TestMultiRowResource
Running org.apache.hadoop.hbase.rest.TestScannersWithFilters
Tests run: 7, Failures: 0, Errors: 0, Skipped: 0, Time elapsed: 9.39 sec - in org.apache.hadoop.hbase.rest.TestVersionResource
Tests run: 3, Failures: 0, Errors: 0, Skipped: 0, Time elapsed: 8.311 sec - in org.apache.hadoop.hbase.rest.TestMultiRowResource
Tests run: 10, Failures: 0, Errors: 0, Skipped: 0, Time elapsed: 18.534 sec - in org.apache.hadoop.hbase.rest.TestScannersWithFilters
Running org.apache.hadoop.hbase.rest.TestGzipFilter
Running org.apache.hadoop.hbase.TestZooKeeper
Tests run: 2, Failures: 0, Errors: 0, Skipped: 0, Time elapsed: 8.298 sec - in org.apache.hadoop.hbase.rest.TestGzipFilter
Running org.apache.hadoop.hbase.rest.TestScannerResource
Running org.apache.hadoop.hbase.snapshot.TestFlushSnapshotFromClient
Running org.apache.hadoop.hbase.snapshot.TestExportSnapshot
Tests run: 5, Failures: 0, Errors: 0, Skipped: 0, Time elapsed: 15.393 sec - in org.apache.hadoop.hbase.rest.TestScannerResource
Tests run: 46, Failures: 0, Errors: 0, Skipped: 0, Time elapsed: 612.726 sec - in org.apache.hadoop.hbase.client.TestAdmin
Running org.apache.hadoop.hbase.snapshot.TestRestoreFlushSnapshotFromClient
Running org.apache.hadoop.hbase.snapshot.TestSecureExportSnapshot
Tests run: 9, Failures: 0, Errors: 0, Skipped: 0, Time elapsed: 101.224 sec - in org.apache.hadoop.hbase.snapshot.TestFlushSnapshotFromClient
Running org.apache.hadoop.hbase.snapshot.TestSnapshotDescriptionUtils
Tests run: 2, Failures: 0, Errors: 0, Skipped: 0, Time elapsed: 0.863 sec - in org.apache.hadoop.hbase.snapshot.TestSnapshotDescriptionUtils
Running org.apache.hadoop.hbase.TestIOFencing
Tests run: 5, Failures: 0, Errors: 0, Skipped: 0, Time elapsed: 124.652 sec - in org.apache.hadoop.hbase.snapshot.TestRestoreFlushSnapshotFromClient
Running org.apache.hadoop.hbase.coprocessor.TestRegionObserverScannerOpenHook
Tests run: 11, Failures: 0, Errors: 0, Skipped: 0, Time elapsed: 281.229 sec - in org.apache.hadoop.hbase.TestZooKeeper
Tests run: 3, Failures: 0, Errors: 0, Skipped: 0, Time elapsed: 40.195 sec - in org.apache.hadoop.hbase.coprocessor.TestRegionObserverScannerOpenHook
Running org.apache.hadoop.hbase.coprocessor.TestOpenTableInCoprocessor
Running org.apache.hadoop.hbase.coprocessor.TestMasterCoprocessorExceptionWithAbort
Tests run: 2, Failures: 0, Errors: 0, Skipped: 0, Time elapsed: 12.966 sec - in org.apache.hadoop.hbase.coprocessor.TestOpenTableInCoprocessor
Tests run: 1, Failures: 0, Errors: 0, Skipped: 0, Time elapsed: 18.732 sec - in org.apache.hadoop.hbase.coprocessor.TestMasterCoprocessorExceptionWithAbort
Running org.apache.hadoop.hbase.coprocessor.TestRegionObserverInterface
Running org.apache.hadoop.hbase.coprocessor.TestMasterCoprocessorExceptionWithRemove
Tests run: 1, Failures: 0, Errors: 0, Skipped: 0, Time elapsed: 6.037 sec - in org.apache.hadoop.hbase.coprocessor.TestMasterCoprocessorExceptionWithRemove
Running org.apache.hadoop.hbase.coprocessor.TestAggregateProtocol
Tests run: 12, Failures: 0, Errors: 0, Skipped: 0, Time elapsed: 63.199 sec - in org.apache.hadoop.hbase.coprocessor.TestRegionObserverInterface
Tests run: 44, Failures: 0, Errors: 0, Skipped: 0, Time elapsed: 20.074 sec - in org.apache.hadoop.hbase.coprocessor.TestAggregateProtocol
Tests run: 2, Failures: 0, Errors: 0, Skipped: 0, Time elapsed: 300.588 sec - in org.apache.hadoop.hbase.TestIOFencing
Running org.apache.hadoop.hbase.coprocessor.TestRegionServerObserver
Running org.apache.hadoop.hbase.coprocessor.TestBatchCoprocessorEndpoint
Running org.apache.hadoop.hbase.coprocessor.TestHTableWrapper
Tests run: 4, Failures: 0, Errors: 0, Skipped: 0, Time elapsed: 4.551 sec - in org.apache.hadoop.hbase.coprocessor.TestBatchCoprocessorEndpoint
Tests run: 1, Failures: 0, Errors: 0, Skipped: 0, Time elapsed: 5.1 sec - in org.apache.hadoop.hbase.coprocessor.TestHTableWrapper
Tests run: 1, Failures: 0, Errors: 0, Skipped: 0, Time elapsed: 42.815 sec - in org.apache.hadoop.hbase.coprocessor.TestRegionServerObserver
Running org.apache.hadoop.hbase.coprocessor.TestRegionServerCoprocessorExceptionWithAbort
Running org.apache.hadoop.hbase.coprocessor.TestClassLoading
Running org.apache.hadoop.hbase.coprocessor.TestDoubleColumnInterpreter
Tests run: 38, Failures: 0, Errors: 0, Skipped: 0, Time elapsed: 19.883 sec - in org.apache.hadoop.hbase.coprocessor.TestDoubleColumnInterpreter
Tests run: 2, Failures: 0, Errors: 0, Skipped: 0, Time elapsed: 68.249 sec - in org.apache.hadoop.hbase.coprocessor.TestRegionServerCoprocessorExceptionWithAbort
Tests run: 8, Failures: 0, Errors: 0, Skipped: 0, Time elapsed: 38.141 sec - in org.apache.hadoop.hbase.coprocessor.TestClassLoading
Running org.apache.hadoop.hbase.coprocessor.TestRegionObserverBypass
Running org.apache.hadoop.hbase.coprocessor.TestRowProcessorEndpoint
Running org.apache.hadoop.hbase.coprocessor.TestCoprocessorStop
Tests run: 2, Failures: 0, Errors: 0, Skipped: 0, Time elapsed: 6.965 sec - in org.apache.hadoop.hbase.coprocessor.TestRegionObserverBypass
Tests run: 4, Failures: 0, Errors: 0, Skipped: 0, Time elapsed: 15.234 sec - in org.apache.hadoop.hbase.coprocessor.TestRowProcessorEndpoint
Tests run: 1, Failures: 0, Errors: 0, Skipped: 0, Time elapsed: 17.14 sec - in org.apache.hadoop.hbase.coprocessor.TestCoprocessorStop
Tests run: 9, Failures: 0, Errors: 0, Skipped: 0, Time elapsed: 585.965 sec - in org.apache.hadoop.hbase.snapshot.TestExportSnapshot
Running org.apache.hadoop.hbase.coprocessor.TestRegionServerCoprocessorExceptionWithRemove
Running org.apache.hadoop.hbase.coprocessor.TestBigDecimalColumnInterpreter
Running org.apache.hadoop.hbase.coprocessor.TestMasterObserver
Tests run: 1, Failures: 0, Errors: 0, Skipped: 0, Time elapsed: 17.05 sec - in org.apache.hadoop.hbase.coprocessor.TestRegionServerCoprocessorExceptionWithRemove
Running org.apache.hadoop.hbase.coprocessor.TestCoprocessorEndpoint
Tests run: 38, Failures: 0, Errors: 0, Skipped: 0, Time elapsed: 12.109 sec - in org.apache.hadoop.hbase.coprocessor.TestBigDecimalColumnInterpreter
Tests run: 6, Failures: 0, Errors: 0, Skipped: 0, Time elapsed: 4.591 sec - in org.apache.hadoop.hbase.coprocessor.TestCoprocessorEndpoint
Running org.apache.hadoop.hbase.TestGlobalMemStoreSize
Tests run: 6, Failures: 0, Errors: 0, Skipped: 0, Time elapsed: 22.276 sec - in org.apache.hadoop.hbase.coprocessor.TestMasterObserver
Running org.apache.hadoop.hbase.TestMetaTableLocator
Running org.apache.hadoop.hbase.coprocessor.TestWALObserver
Tests run: 6, Failures: 0, Errors: 0, Skipped: 0, Time elapsed: 5.534 sec - in org.apache.hadoop.hbase.TestMetaTableLocator
Running org.apache.hadoop.hbase.TestJMXListener
Tests run: 3, Failures: 0, Errors: 0, Skipped: 0, Time elapsed: 15.014 sec - in org.apache.hadoop.hbase.coprocessor.TestWALObserver
Tests run: 1, Failures: 0, Errors: 0, Skipped: 0, Time elapsed: 34.724 sec - in org.apache.hadoop.hbase.TestGlobalMemStoreSize
Running org.apache.hadoop.hbase.zookeeper.TestZKTableStateManager
Tests run: 1, Failures: 0, Errors: 0, Skipped: 0, Time elapsed: 2.157 sec - in org.apache.hadoop.hbase.zookeeper.TestZKTableStateManager
Running org.apache.hadoop.hbase.zookeeper.TestZKMulti
Tests run: 6, Failures: 0, Errors: 0, Skipped: 0, Time elapsed: 0.986 sec - in org.apache.hadoop.hbase.zookeeper.TestZKMulti
Running org.apache.hadoop.hbase.zookeeper.lock.TestZKInterProcessReadWriteLock
Running org.apache.hadoop.hbase.zookeeper.TestZKLeaderManager
Tests run: 1, Failures: 0, Errors: 0, Skipped: 0, Time elapsed: 0.518 sec - in org.apache.hadoop.hbase.zookeeper.TestZKLeaderManager
Tests run: 2, Failures: 0, Errors: 0, Skipped: 0, Time elapsed: 16.789 sec - in org.apache.hadoop.hbase.TestJMXListener
Running org.apache.hadoop.hbase.zookeeper.TestZooKeeperACL
Tests run: 6, Failures: 0, Errors: 0, Skipped: 0, Time elapsed: 0.864 sec - in org.apache.hadoop.hbase.zookeeper.TestZooKeeperACL
Running org.apache.hadoop.hbase.zookeeper.TestRecoverableZooKeeper
Tests run: 1, Failures: 0, Errors: 0, Skipped: 0, Time elapsed: 1.644 sec - in org.apache.hadoop.hbase.zookeeper.TestRecoverableZooKeeper
Running org.apache.hadoop.hbase.zookeeper.TestZooKeeperNodeTracker
Running org.apache.hadoop.hbase.zookeeper.TestHQuorumPeer
Running org.apache.hadoop.hbase.TestClusterBootOrder
Tests run: 3, Failures: 0, Errors: 0, Skipped: 0, Time elapsed: 2.946 sec - in org.apache.hadoop.hbase.zookeeper.TestZooKeeperNodeTracker
Tests run: 9, Failures: 0, Errors: 0, Skipped: 0, Time elapsed: 607.536 sec - in org.apache.hadoop.hbase.snapshot.TestSecureExportSnapshot
Tests run: 3, Failures: 0, Errors: 0, Skipped: 0, Time elapsed: 3.377 sec - in org.apache.hadoop.hbase.zookeeper.TestHQuorumPeer
Killed
Killed
Results :
Failed tests:
TestPerTableCFReplication.testPerTableCFReplication:293->ensureRowNotReplicated:379 expected:<0> but was:<1>
Tests in error:
TestEndToEndSplitTransaction.blockUntilRegionSplit:448->blockUntilRegionIsInMeta:471 NullPointer
TestReplicaWithCluster.testReplicaAndReplication:248 ? test timed out after 3...
Tests run: 1992, Failures: 1, Errors: 2, Skipped: 19
[INFO] ------------------------------------------------------------------------
[INFO] Reactor Summary:
[INFO]
[INFO] HBase ............................................. SUCCESS [6.521s]
[INFO] HBase - Common .................................... SUCCESS [2:09.208s]
[INFO] HBase - Protocol .................................. SUCCESS [20.246s]
[INFO] HBase - Client .................................... SUCCESS [1:26.592s]
[INFO] HBase - Hadoop Compatibility ...................... SUCCESS [11.636s]
[INFO] HBase - Hadoop Two Compatibility .................. SUCCESS [14.453s]
[INFO] HBase - Prefix Tree ............................... SUCCESS [21.453s]
[INFO] HBase - Server .................................... FAILURE [2:28:11.517s]
[INFO] HBase - Testing Util .............................. SKIPPED
[INFO] HBase - Thrift .................................... SKIPPED
[INFO] HBase - Shell ..................................... SKIPPED
[INFO] HBase - Integration Tests ......................... SKIPPED
[INFO] HBase - Examples .................................. SKIPPED
[INFO] HBase - Assembly .................................. SKIPPED
[INFO] ------------------------------------------------------------------------
[INFO] BUILD FAILURE
[INFO] ------------------------------------------------------------------------
[INFO] Total time: 2:33:03.864s
[INFO] Finished at: Tue Aug 26 17:37:40 UTC 2014
[INFO] Final Memory: 40M/500M
[INFO] ------------------------------------------------------------------------
[ERROR] Failed to execute goal org.apache.maven.plugins:maven-surefire-plugin:2.17:test (secondPartTestsExecution) on project hbase-server: ExecutionException: java.lang.RuntimeException: The forked VM terminated without properly saying goodbye. VM crash or System.exit called?
[ERROR] Command was /bin/sh -c cd <https://builds.apache.org/job/HBase-TRUNK/ws/hbase-server> && /home/jenkins/tools/java/jdk1.7.0_25-32/jre/bin/java -enableassertions -XX:MaxDirectMemorySize=1G -Xmx1900m -XX:MaxPermSize=256m -Djava.security.egd=file:/dev/./urandom -Djava.net.preferIPv4Stack=true -Djava.awt.headless=true -jar <https://builds.apache.org/job/HBase-TRUNK/ws/hbase-server/target/surefire/surefirebooter7761608909954768576.jar> <https://builds.apache.org/job/HBase-TRUNK/ws/hbase-server/target/surefire/surefire2187547332505139475tmp> <https://builds.apache.org/job/HBase-TRUNK/ws/hbase-server/target/surefire/surefire_10967402471204100880692tmp>
[ERROR] -> [Help 1]
[ERROR]
[ERROR] To see the full stack trace of the errors, re-run Maven with the -e switch.
[ERROR] Re-run Maven using the -X switch to enable full debug logging.
[ERROR]
[ERROR] For more information about the errors and possible solutions, please read the following articles:
[ERROR] [Help 1] http://cwiki.apache.org/confluence/display/MAVEN/MojoFailureException
[ERROR]
[ERROR] After correcting the problems, you can resume the build with the command
[ERROR] mvn <goals> -rf :hbase-server
Build step 'Invoke top-level Maven targets' marked build as failure
Performing Post build task...
Match found for :.* : True
Logical operation result is TRUE
Running script : ZOMBIE_TESTS_COUNT=`jps | grep surefirebooter | wc -l`
if [[ $ZOMBIE_TESTS_COUNT != 0 ]] ; then
#It seems sometimes the tests are not dying immediately. Let's give them 10s
echo "Suspicious java process found - waiting 10s to see if there are just slow to stop"
sleep 10
ZOMBIE_TESTS_COUNT=`jps | grep surefirebooter | wc -l`
if [[ $ZOMBIE_TESTS_COUNT != 0 ]] ; then
echo "There are $ZOMBIE_TESTS_COUNT zombie tests, they should have been killed by surefire but survived"
echo "************ BEGIN zombies jstack extract"
ZB_STACK=`jps | grep surefirebooter | cut -d ' ' -f 1 | xargs -n 1 jstack | grep ".test" | grep "\.java"`
jps | grep surefirebooter | cut -d ' ' -f 1 | xargs -n 1 jstack
echo "************ END zombies jstack extract"
JIRA_COMMENT="$JIRA_COMMENT
{color:red}-1 core zombie tests{color}. There are ${ZOMBIE_TESTS_COUNT} zombie test(s): ${ZB_STACK}"
BAD=1
jps | grep surefirebooter | cut -d ' ' -f 1 | xargs kill -9
else
echo "We're ok: there is no zombie test, but some tests took some time to stop"
fi
else
echo "We're ok: there is no zombie test"
fi
[HBase-TRUNK] $ /bin/bash -xe /tmp/hudson1073713795311150640.sh
++ jps
++ grep surefirebooter
++ wc -l
+ ZOMBIE_TESTS_COUNT=0
+ [[ 0 != 0 ]]
+ echo 'We'\''re ok: there is no zombie test'
We're ok: there is no zombie test
POST BUILD TASK : SUCCESS
END OF POST BUILD TASK : 0
Archiving artifacts
Sending artifact delta relative to HBase-TRUNK #5421
Archived 1769 artifacts
Archive block size is 32768
Received 76 blocks and 509868282 bytes
Compression is 0.5%
Took 5 min 26 sec
Recording test results
Updating HBASE-11814
Jenkins build is back to normal : HBase-TRUNK #5442
Posted by Apache Jenkins Server <je...@builds.apache.org>.
See <https://builds.apache.org/job/HBase-TRUNK/5442/changes>
Build failed in Jenkins: HBase-TRUNK #5441
Posted by Apache Jenkins Server <je...@builds.apache.org>.
See <https://builds.apache.org/job/HBase-TRUNK/5441/changes>
Changes:
[jmhsieh] HBASE-11849 remove classes with audience.private for internals that we don't use.
------------------------------------------
[...truncated 978 lines...]
Tests run: 1, Failures: 0, Errors: 0, Skipped: 0, Time elapsed: 1.179 sec - in org.apache.hadoop.hbase.mapreduce.TestGroupingTableMapper
Running org.apache.hadoop.hbase.mapreduce.TestSimpleTotalOrderPartitioner
Tests run: 1, Failures: 0, Errors: 0, Skipped: 0, Time elapsed: 0.248 sec - in org.apache.hadoop.hbase.mapreduce.TestSimpleTotalOrderPartitioner
Killed
Running org.apache.hadoop.hbase.mapreduce.hadoopbackport.TestJarFinder
Tests run: 4, Failures: 0, Errors: 0, Skipped: 0, Time elapsed: 3.096 sec - in org.apache.hadoop.hbase.mapreduce.hadoopbackport.TestJarFinder
Running org.apache.hadoop.hbase.mapreduce.TestTableSplit
Tests run: 3, Failures: 0, Errors: 0, Skipped: 0, Time elapsed: 1.063 sec - in org.apache.hadoop.hbase.mapreduce.TestTableSplit
Running org.apache.hadoop.hbase.TestSerialization
Tests run: 9, Failures: 0, Errors: 0, Skipped: 0, Time elapsed: 3.489 sec - in org.apache.hadoop.hbase.TestSerialization
Running org.apache.hadoop.hbase.util.TestCompressionTest
Tests run: 2, Failures: 0, Errors: 0, Skipped: 0, Time elapsed: 1.205 sec - in org.apache.hadoop.hbase.util.TestCompressionTest
Running org.apache.hadoop.hbase.util.TestSortedCopyOnWriteSet
Tests run: 2, Failures: 0, Errors: 0, Skipped: 0, Time elapsed: 0.758 sec - in org.apache.hadoop.hbase.util.TestSortedCopyOnWriteSet
Running org.apache.hadoop.hbase.util.TestRegionSizeCalculator
Tests run: 3, Failures: 0, Errors: 0, Skipped: 0, Time elapsed: 1.668 sec - in org.apache.hadoop.hbase.util.TestRegionSizeCalculator
Running org.apache.hadoop.hbase.util.TestRootPath
Tests run: 1, Failures: 0, Errors: 0, Skipped: 0, Time elapsed: 0.512 sec - in org.apache.hadoop.hbase.util.TestRootPath
Running org.apache.hadoop.hbase.util.TestIncrementingEnvironmentEdge
Tests run: 1, Failures: 0, Errors: 0, Skipped: 0, Time elapsed: 0.681 sec - in org.apache.hadoop.hbase.util.TestIncrementingEnvironmentEdge
Running org.apache.hadoop.hbase.util.TestTableName
Tests run: 4, Failures: 0, Errors: 0, Skipped: 0, Time elapsed: 1.104 sec - in org.apache.hadoop.hbase.util.TestTableName
Running org.apache.hadoop.hbase.util.TestByteBloomFilter
Tests run: 5, Failures: 0, Errors: 0, Skipped: 0, Time elapsed: 2.8 sec - in org.apache.hadoop.hbase.util.TestByteBloomFilter
Running org.apache.hadoop.hbase.util.TestHBaseFsckComparator
Tests run: 6, Failures: 0, Errors: 0, Skipped: 0, Time elapsed: 0.999 sec - in org.apache.hadoop.hbase.util.TestHBaseFsckComparator
Running org.apache.hadoop.hbase.util.TestRegionSplitCalculator
Tests run: 15, Failures: 0, Errors: 0, Skipped: 0, Time elapsed: 1.893 sec - in org.apache.hadoop.hbase.util.TestRegionSplitCalculator
Running org.apache.hadoop.hbase.util.TestPoolMap$TestRoundRobinPoolType
Tests run: 3, Failures: 0, Errors: 0, Skipped: 0, Time elapsed: 1.009 sec - in org.apache.hadoop.hbase.util.TestPoolMap$TestRoundRobinPoolType
Running org.apache.hadoop.hbase.util.TestPoolMap$TestThreadLocalPoolType
Tests run: 3, Failures: 0, Errors: 0, Skipped: 0, Time elapsed: 0.393 sec - in org.apache.hadoop.hbase.util.TestPoolMap$TestThreadLocalPoolType
Running org.apache.hadoop.hbase.util.TestPoolMap$TestReusablePoolType
Tests run: 3, Failures: 0, Errors: 0, Skipped: 0, Time elapsed: 0.293 sec - in org.apache.hadoop.hbase.util.TestPoolMap$TestReusablePoolType
Running org.apache.hadoop.hbase.util.TestHFileArchiveUtil
Tests run: 4, Failures: 0, Errors: 0, Skipped: 0, Time elapsed: 2.567 sec - in org.apache.hadoop.hbase.util.TestHFileArchiveUtil
Running org.apache.hadoop.hbase.util.TestBoundedPriorityBlockingQueue
Tests run: 7, Failures: 0, Errors: 0, Skipped: 0, Time elapsed: 2.454 sec - in org.apache.hadoop.hbase.util.TestBoundedPriorityBlockingQueue
Running org.apache.hadoop.hbase.util.TestByteBufferUtils
Tests run: 12, Failures: 0, Errors: 0, Skipped: 0, Time elapsed: 2.743 sec - in org.apache.hadoop.hbase.util.TestByteBufferUtils
Running org.apache.hadoop.hbase.filter.TestNullComparator
Tests run: 3, Failures: 0, Errors: 0, Skipped: 0, Time elapsed: 0.983 sec - in org.apache.hadoop.hbase.filter.TestNullComparator
Running org.apache.hadoop.hbase.filter.TestFilter
Tests run: 21, Failures: 0, Errors: 0, Skipped: 0, Time elapsed: 13.79 sec - in org.apache.hadoop.hbase.filter.TestFilter
Running org.apache.hadoop.hbase.filter.TestInclusiveStopFilter
Tests run: 2, Failures: 0, Errors: 0, Skipped: 0, Time elapsed: 0.717 sec - in org.apache.hadoop.hbase.filter.TestInclusiveStopFilter
Running org.apache.hadoop.hbase.filter.TestDependentColumnFilter
Tests run: 4, Failures: 0, Errors: 0, Skipped: 0, Time elapsed: 4.922 sec - in org.apache.hadoop.hbase.filter.TestDependentColumnFilter
Running org.apache.hadoop.hbase.filter.TestParseFilter
Tests run: 34, Failures: 0, Errors: 0, Skipped: 0, Time elapsed: 4.945 sec - in org.apache.hadoop.hbase.filter.TestParseFilter
Running org.apache.hadoop.hbase.filter.TestComparatorSerialization
Tests run: 6, Failures: 0, Errors: 0, Skipped: 0, Time elapsed: 2.958 sec - in org.apache.hadoop.hbase.filter.TestComparatorSerialization
Running org.apache.hadoop.hbase.filter.TestMultipleColumnPrefixFilter
Tests run: 3, Failures: 0, Errors: 0, Skipped: 0, Time elapsed: 11.577 sec - in org.apache.hadoop.hbase.filter.TestMultipleColumnPrefixFilter
Running org.apache.hadoop.hbase.filter.TestColumnPaginationFilter
Tests run: 1, Failures: 0, Errors: 0, Skipped: 0, Time elapsed: 1.891 sec - in org.apache.hadoop.hbase.filter.TestColumnPaginationFilter
Running org.apache.hadoop.hbase.filter.TestRandomRowFilter
Tests run: 2, Failures: 0, Errors: 0, Skipped: 0, Time elapsed: 1.571 sec - in org.apache.hadoop.hbase.filter.TestRandomRowFilter
Running org.apache.hadoop.hbase.filter.TestSingleColumnValueFilter
Tests run: 2, Failures: 0, Errors: 0, Skipped: 0, Time elapsed: 2.05 sec - in org.apache.hadoop.hbase.filter.TestSingleColumnValueFilter
Running org.apache.hadoop.hbase.filter.TestPageFilter
Tests run: 2, Failures: 0, Errors: 0, Skipped: 0, Time elapsed: 0.944 sec - in org.apache.hadoop.hbase.filter.TestPageFilter
Running org.apache.hadoop.hbase.filter.TestFilterSerialization
Tests run: 25, Failures: 0, Errors: 0, Skipped: 0, Time elapsed: 4.998 sec - in org.apache.hadoop.hbase.filter.TestFilterSerialization
Running org.apache.hadoop.hbase.filter.TestInvocationRecordFilter
Tests run: 1, Failures: 0, Errors: 0, Skipped: 0, Time elapsed: 3.638 sec - in org.apache.hadoop.hbase.filter.TestInvocationRecordFilter
Running org.apache.hadoop.hbase.filter.TestFilterList
Tests run: 7, Failures: 0, Errors: 0, Skipped: 0, Time elapsed: 2.654 sec - in org.apache.hadoop.hbase.filter.TestFilterList
Running org.apache.hadoop.hbase.filter.TestFirstKeyValueMatchingQualifiersFilter
Tests run: 1, Failures: 0, Errors: 0, Skipped: 0, Time elapsed: 0.616 sec - in org.apache.hadoop.hbase.filter.TestFirstKeyValueMatchingQualifiersFilter
Running org.apache.hadoop.hbase.filter.TestFuzzyRowFilter
Tests run: 2, Failures: 0, Errors: 0, Skipped: 0, Time elapsed: 0.783 sec - in org.apache.hadoop.hbase.filter.TestFuzzyRowFilter
Running org.apache.hadoop.hbase.filter.TestPrefixFilter
Tests run: 3, Failures: 0, Errors: 0, Skipped: 0, Time elapsed: 0.68 sec - in org.apache.hadoop.hbase.filter.TestPrefixFilter
Running org.apache.hadoop.hbase.filter.TestSingleColumnValueExcludeFilter
Tests run: 1, Failures: 0, Errors: 0, Skipped: 0, Time elapsed: 0.598 sec - in org.apache.hadoop.hbase.filter.TestSingleColumnValueExcludeFilter
Running org.apache.hadoop.hbase.filter.TestBitComparator
Tests run: 6, Failures: 0, Errors: 0, Skipped: 0, Time elapsed: 1.317 sec - in org.apache.hadoop.hbase.filter.TestBitComparator
Running org.apache.hadoop.hbase.filter.TestColumnPrefixFilter
Tests run: 2, Failures: 0, Errors: 0, Skipped: 0, Time elapsed: 10.002 sec - in org.apache.hadoop.hbase.filter.TestColumnPrefixFilter
Running org.apache.hadoop.hbase.TestServerName
Tests run: 6, Failures: 0, Errors: 0, Skipped: 0, Time elapsed: 1.294 sec - in org.apache.hadoop.hbase.TestServerName
Running org.apache.hadoop.hbase.TestPerformanceEvaluation
Tests run: 4, Failures: 0, Errors: 0, Skipped: 1, Time elapsed: 1.231 sec - in org.apache.hadoop.hbase.TestPerformanceEvaluation
Running org.apache.hadoop.hbase.TestServerLoad
Tests run: 2, Failures: 0, Errors: 0, Skipped: 0, Time elapsed: 0.738 sec - in org.apache.hadoop.hbase.TestServerLoad
Running org.apache.hadoop.hbase.client.TestPutDeleteEtcCellIteration
Tests run: 6, Failures: 0, Errors: 0, Skipped: 0, Time elapsed: 1.283 sec - in org.apache.hadoop.hbase.client.TestPutDeleteEtcCellIteration
Running org.apache.hadoop.hbase.client.TestConnectionUtils
Tests run: 1, Failures: 0, Errors: 0, Skipped: 0, Time elapsed: 0.822 sec - in org.apache.hadoop.hbase.client.TestConnectionUtils
Running org.apache.hadoop.hbase.client.TestIntraRowPagination
Tests run: 1, Failures: 0, Errors: 0, Skipped: 0, Time elapsed: 3.966 sec - in org.apache.hadoop.hbase.client.TestIntraRowPagination
Running org.apache.hadoop.hbase.client.TestResult
Tests run: 7, Failures: 0, Errors: 0, Skipped: 0, Time elapsed: 1.455 sec - in org.apache.hadoop.hbase.client.TestResult
Running org.apache.hadoop.hbase.client.TestHBaseAdminNoCluster
Tests run: 1, Failures: 0, Errors: 0, Skipped: 0, Time elapsed: 4.174 sec - in org.apache.hadoop.hbase.client.TestHBaseAdminNoCluster
Running org.apache.hadoop.hbase.protobuf.TestProtobufUtil
Tests run: 7, Failures: 0, Errors: 0, Skipped: 0, Time elapsed: 3.138 sec - in org.apache.hadoop.hbase.protobuf.TestProtobufUtil
Running org.apache.hadoop.hbase.protobuf.TestReplicationProtobuf
Tests run: 1, Failures: 0, Errors: 0, Skipped: 0, Time elapsed: 0.898 sec - in org.apache.hadoop.hbase.protobuf.TestReplicationProtobuf
Running org.apache.hadoop.hbase.procedure.TestProcedureMember
Tests run: 8, Failures: 0, Errors: 0, Skipped: 0, Time elapsed: 2.022 sec - in org.apache.hadoop.hbase.procedure.TestProcedureMember
Running org.apache.hadoop.hbase.procedure.TestProcedureManager
Tests run: 1, Failures: 0, Errors: 0, Skipped: 0, Time elapsed: 1.64 sec - in org.apache.hadoop.hbase.procedure.TestProcedureManager
Running org.apache.hadoop.hbase.procedure.TestProcedure
Tests run: 4, Failures: 0, Errors: 0, Skipped: 0, Time elapsed: 1.994 sec - in org.apache.hadoop.hbase.procedure.TestProcedure
Running org.apache.hadoop.hbase.procedure.TestProcedureCoordinator
Tests run: 7, Failures: 0, Errors: 0, Skipped: 0, Time elapsed: 1.727 sec - in org.apache.hadoop.hbase.procedure.TestProcedureCoordinator
Running org.apache.hadoop.hbase.constraint.TestConstraints
Tests run: 6, Failures: 0, Errors: 0, Skipped: 0, Time elapsed: 2.778 sec - in org.apache.hadoop.hbase.constraint.TestConstraints
Running org.apache.hadoop.hbase.rest.TestGZIPResponseWrapper
Tests run: 4, Failures: 0, Errors: 0, Skipped: 0, Time elapsed: 1.071 sec - in org.apache.hadoop.hbase.rest.TestGZIPResponseWrapper
Running org.apache.hadoop.hbase.rest.client.TestRemoteAdminRetries
Tests run: 7, Failures: 0, Errors: 0, Skipped: 0, Time elapsed: 2.786 sec - in org.apache.hadoop.hbase.rest.client.TestRemoteAdminRetries
Running org.apache.hadoop.hbase.rest.client.TestRemoteHTableRetries
Tests run: 7, Failures: 0, Errors: 0, Skipped: 0, Time elapsed: 2.579 sec - in org.apache.hadoop.hbase.rest.client.TestRemoteHTableRetries
Running org.apache.hadoop.hbase.rest.model.TestVersionModel
Tests run: 6, Failures: 0, Errors: 0, Skipped: 0, Time elapsed: 1.55 sec - in org.apache.hadoop.hbase.rest.model.TestVersionModel
Running org.apache.hadoop.hbase.rest.model.TestStorageClusterVersionModel
Tests run: 6, Failures: 0, Errors: 0, Skipped: 0, Time elapsed: 1.088 sec - in org.apache.hadoop.hbase.rest.model.TestStorageClusterVersionModel
Running org.apache.hadoop.hbase.rest.model.TestColumnSchemaModel
Tests run: 6, Failures: 0, Errors: 0, Skipped: 0, Time elapsed: 1.311 sec - in org.apache.hadoop.hbase.rest.model.TestColumnSchemaModel
Running org.apache.hadoop.hbase.rest.model.TestCellModel
Tests run: 6, Failures: 0, Errors: 0, Skipped: 0, Time elapsed: 1.119 sec - in org.apache.hadoop.hbase.rest.model.TestCellModel
Running org.apache.hadoop.hbase.rest.model.TestTableListModel
Tests run: 6, Failures: 0, Errors: 0, Skipped: 0, Time elapsed: 1.395 sec - in org.apache.hadoop.hbase.rest.model.TestTableListModel
Running org.apache.hadoop.hbase.rest.model.TestStorageClusterStatusModel
Tests run: 6, Failures: 0, Errors: 0, Skipped: 0, Time elapsed: 1.46 sec - in org.apache.hadoop.hbase.rest.model.TestStorageClusterStatusModel
Running org.apache.hadoop.hbase.rest.model.TestScannerModel
Tests run: 6, Failures: 0, Errors: 0, Skipped: 0, Time elapsed: 1.385 sec - in org.apache.hadoop.hbase.rest.model.TestScannerModel
Running org.apache.hadoop.hbase.rest.model.TestTableSchemaModel
Tests run: 6, Failures: 0, Errors: 0, Skipped: 0, Time elapsed: 1.3 sec - in org.apache.hadoop.hbase.rest.model.TestTableSchemaModel
Running org.apache.hadoop.hbase.rest.model.TestTableInfoModel
Tests run: 6, Failures: 0, Errors: 0, Skipped: 0, Time elapsed: 1.483 sec - in org.apache.hadoop.hbase.rest.model.TestTableInfoModel
Running org.apache.hadoop.hbase.rest.model.TestTableRegionModel
Tests run: 8, Failures: 0, Errors: 0, Skipped: 0, Time elapsed: 1.532 sec - in org.apache.hadoop.hbase.rest.model.TestTableRegionModel
Running org.apache.hadoop.hbase.rest.model.TestRowModel
Tests run: 6, Failures: 0, Errors: 0, Skipped: 0, Time elapsed: 1.238 sec - in org.apache.hadoop.hbase.rest.model.TestRowModel
Running org.apache.hadoop.hbase.rest.model.TestCellSetModel
Tests run: 6, Failures: 0, Errors: 0, Skipped: 0, Time elapsed: 1.234 sec - in org.apache.hadoop.hbase.rest.model.TestCellSetModel
Running org.apache.hadoop.hbase.TestHTableDescriptor
Tests run: 11, Failures: 0, Errors: 0, Skipped: 0, Time elapsed: 3.213 sec - in org.apache.hadoop.hbase.TestHTableDescriptor
Running org.apache.hadoop.hbase.snapshot.TestRestoreSnapshotHelper
Tests run: 1, Failures: 0, Errors: 0, Skipped: 0, Time elapsed: 4.911 sec - in org.apache.hadoop.hbase.snapshot.TestRestoreSnapshotHelper
Running org.apache.hadoop.hbase.coprocessor.TestRegionObserverStacking
Tests run: 1, Failures: 0, Errors: 0, Skipped: 0, Time elapsed: 3.143 sec - in org.apache.hadoop.hbase.coprocessor.TestRegionObserverStacking
Running org.apache.hadoop.hbase.coprocessor.TestCoprocessorInterface
Tests run: 2, Failures: 0, Errors: 0, Skipped: 0, Time elapsed: 18.334 sec - in org.apache.hadoop.hbase.coprocessor.TestCoprocessorInterface
Running org.apache.hadoop.hbase.executor.TestExecutorService
Tests run: 1, Failures: 0, Errors: 0, Skipped: 0, Time elapsed: 3.207 sec - in org.apache.hadoop.hbase.executor.TestExecutorService
Running org.apache.hadoop.hbase.zookeeper.TestZooKeeperMainServer
Tests run: 2, Failures: 0, Errors: 0, Skipped: 0, Time elapsed: 2.174 sec - in org.apache.hadoop.hbase.zookeeper.TestZooKeeperMainServer
Running org.apache.hadoop.hbase.zookeeper.TestZKConfig
Tests run: 1, Failures: 0, Errors: 0, Skipped: 0, Time elapsed: 0.985 sec - in org.apache.hadoop.hbase.zookeeper.TestZKConfig
Running org.apache.hadoop.hbase.metrics.TestMetricsHistogram
Tests run: 3, Failures: 0, Errors: 0, Skipped: 0, Time elapsed: 1.741 sec - in org.apache.hadoop.hbase.metrics.TestMetricsHistogram
Running org.apache.hadoop.hbase.TestHColumnDescriptor
Tests run: 3, Failures: 0, Errors: 0, Skipped: 0, Time elapsed: 2.743 sec - in org.apache.hadoop.hbase.TestHColumnDescriptor
Running org.apache.hadoop.hbase.monitoring.TestMemoryBoundedLogMessageBuffer
Tests run: 2, Failures: 0, Errors: 0, Skipped: 0, Time elapsed: 0.825 sec - in org.apache.hadoop.hbase.monitoring.TestMemoryBoundedLogMessageBuffer
Running org.apache.hadoop.hbase.monitoring.TestTaskMonitor
Tests run: 3, Failures: 0, Errors: 0, Skipped: 0, Time elapsed: 1.585 sec - in org.apache.hadoop.hbase.monitoring.TestTaskMonitor
Results :
Tests run: 912, Failures: 0, Errors: 0, Skipped: 7
[INFO] ------------------------------------------------------------------------
[INFO] Reactor Summary:
[INFO]
[INFO] HBase ............................................. SUCCESS [16.632s]
[INFO] HBase - Common .................................... SUCCESS [3:02.449s]
[INFO] HBase - Protocol .................................. SUCCESS [29.864s]
[INFO] HBase - Client .................................... SUCCESS [1:42.996s]
[INFO] HBase - Hadoop Compatibility ...................... SUCCESS [14.543s]
[INFO] HBase - Hadoop Two Compatibility .................. SUCCESS [17.970s]
[INFO] HBase - Prefix Tree ............................... SUCCESS [35.435s]
[INFO] HBase - Server .................................... FAILURE [33:14.632s]
[INFO] HBase - Testing Util .............................. SKIPPED
[INFO] HBase - Thrift .................................... SKIPPED
[INFO] HBase - Shell ..................................... SKIPPED
[INFO] HBase - Integration Tests ......................... SKIPPED
[INFO] HBase - Examples .................................. SKIPPED
[INFO] HBase - Assembly .................................. SKIPPED
[INFO] ------------------------------------------------------------------------
[INFO] BUILD FAILURE
[INFO] ------------------------------------------------------------------------
[INFO] Total time: 39:59.780s
[INFO] Finished at: Thu Aug 28 19:44:49 UTC 2014
[INFO] Final Memory: 64M/986M
[INFO] ------------------------------------------------------------------------
[ERROR] Failed to execute goal org.apache.maven.plugins:maven-surefire-plugin:2.17:test (default-test) on project hbase-server: ExecutionException: java.lang.RuntimeException: The forked VM terminated without properly saying goodbye. VM crash or System.exit called?
[ERROR] Command was /bin/sh -c cd <https://builds.apache.org/job/HBase-TRUNK/ws/hbase-server> && /home/jenkins/tools/java/jdk1.7.0_25-32/jre/bin/java -enableassertions -XX:MaxDirectMemorySize=1G -Xmx1900m -XX:MaxPermSize=256m -Djava.security.egd=file:/dev/./urandom -Djava.net.preferIPv4Stack=true -Djava.awt.headless=true -jar <https://builds.apache.org/job/HBase-TRUNK/ws/hbase-server/target/surefire/surefirebooter6431965562794824981.jar> <https://builds.apache.org/job/HBase-TRUNK/ws/hbase-server/target/surefire/surefire266882997064694890tmp> <https://builds.apache.org/job/HBase-TRUNK/ws/hbase-server/target/surefire/surefire_4008026114009614238792tmp>
[ERROR] -> [Help 1]
[ERROR]
[ERROR] To see the full stack trace of the errors, re-run Maven with the -e switch.
[ERROR] Re-run Maven using the -X switch to enable full debug logging.
[ERROR]
[ERROR] For more information about the errors and possible solutions, please read the following articles:
[ERROR] [Help 1] http://cwiki.apache.org/confluence/display/MAVEN/MojoFailureException
[ERROR]
[ERROR] After correcting the problems, you can resume the build with the command
[ERROR] mvn <goals> -rf :hbase-server
Build step 'Invoke top-level Maven targets' marked build as failure
Performing Post build task...
Match found for :.* : True
Logical operation result is TRUE
Running script : ZOMBIE_TESTS_COUNT=`jps | grep surefirebooter | wc -l`
if [[ $ZOMBIE_TESTS_COUNT != 0 ]] ; then
#It seems sometimes the tests are not dying immediately. Let's give them 10s
echo "Suspicious java process found - waiting 10s to see if there are just slow to stop"
sleep 10
ZOMBIE_TESTS_COUNT=`jps | grep surefirebooter | wc -l`
if [[ $ZOMBIE_TESTS_COUNT != 0 ]] ; then
echo "There are $ZOMBIE_TESTS_COUNT zombie tests, they should have been killed by surefire but survived"
echo "************ BEGIN zombies jstack extract"
ZB_STACK=`jps | grep surefirebooter | cut -d ' ' -f 1 | xargs -n 1 jstack | grep ".test" | grep "\.java"`
jps | grep surefirebooter | cut -d ' ' -f 1 | xargs -n 1 jstack
echo "************ END zombies jstack extract"
JIRA_COMMENT="$JIRA_COMMENT
{color:red}-1 core zombie tests{color}. There are ${ZOMBIE_TESTS_COUNT} zombie test(s): ${ZB_STACK}"
BAD=1
jps | grep surefirebooter | cut -d ' ' -f 1 | xargs kill -9
else
echo "We're ok: there is no zombie test, but some tests took some time to stop"
fi
else
echo "We're ok: there is no zombie test"
fi
[HBase-TRUNK] $ /bin/bash -xe /tmp/hudson6242602098510959234.sh
++ jps
++ grep surefirebooter
++ wc -l
+ ZOMBIE_TESTS_COUNT=0
+ [[ 0 != 0 ]]
+ echo 'We'\''re ok: there is no zombie test'
We're ok: there is no zombie test
POST BUILD TASK : SUCCESS
END OF POST BUILD TASK : 0
Archiving artifacts
Sending artifact delta relative to HBase-TRUNK #5421
Archived 889 artifacts
Archive block size is 32768
Received 8 blocks and 33331026 bytes
Compression is 0.8%
Took 1 min 3 sec
Recording test results
Updating HBASE-11849
Build failed in Jenkins: HBase-TRUNK #5440
Posted by Apache Jenkins Server <je...@builds.apache.org>.
See <https://builds.apache.org/job/HBase-TRUNK/5440/changes>
Changes:
[anoopsamjohn] HBASE-9875 Removing the empty file NamespaceJanitor
------------------------------------------
[...truncated 978 lines...]
Running org.apache.hadoop.hbase.mapreduce.TestSimpleTotalOrderPartitioner
Tests run: 1, Failures: 0, Errors: 0, Skipped: 0, Time elapsed: 0.348 sec - in org.apache.hadoop.hbase.mapreduce.TestSimpleTotalOrderPartitioner
Running org.apache.hadoop.hbase.mapreduce.TestTableMapReduceUtil
Tests run: 4, Failures: 0, Errors: 0, Skipped: 0, Time elapsed: 7.159 sec - in org.apache.hadoop.hbase.mapreduce.TestTableMapReduceUtil
Running org.apache.hadoop.hbase.mapreduce.hadoopbackport.TestJarFinder
Tests run: 4, Failures: 0, Errors: 0, Skipped: 0, Time elapsed: 3.268 sec - in org.apache.hadoop.hbase.mapreduce.hadoopbackport.TestJarFinder
Running org.apache.hadoop.hbase.mapreduce.TestTableSplit
Tests run: 3, Failures: 0, Errors: 0, Skipped: 0, Time elapsed: 1.193 sec - in org.apache.hadoop.hbase.mapreduce.TestTableSplit
Running org.apache.hadoop.hbase.TestSerialization
Tests run: 9, Failures: 0, Errors: 0, Skipped: 0, Time elapsed: 3.286 sec - in org.apache.hadoop.hbase.TestSerialization
Running org.apache.hadoop.hbase.util.TestCompressionTest
Tests run: 2, Failures: 0, Errors: 0, Skipped: 0, Time elapsed: 1.082 sec - in org.apache.hadoop.hbase.util.TestCompressionTest
Running org.apache.hadoop.hbase.util.TestSortedCopyOnWriteSet
Tests run: 2, Failures: 0, Errors: 0, Skipped: 0, Time elapsed: 0.898 sec - in org.apache.hadoop.hbase.util.TestSortedCopyOnWriteSet
Running org.apache.hadoop.hbase.util.TestRegionSizeCalculator
Tests run: 3, Failures: 0, Errors: 0, Skipped: 0, Time elapsed: 1.94 sec - in org.apache.hadoop.hbase.util.TestRegionSizeCalculator
Running org.apache.hadoop.hbase.util.TestRootPath
Tests run: 1, Failures: 0, Errors: 0, Skipped: 0, Time elapsed: 0.549 sec - in org.apache.hadoop.hbase.util.TestRootPath
Running org.apache.hadoop.hbase.util.TestIncrementingEnvironmentEdge
Tests run: 1, Failures: 0, Errors: 0, Skipped: 0, Time elapsed: 0.747 sec - in org.apache.hadoop.hbase.util.TestIncrementingEnvironmentEdge
Running org.apache.hadoop.hbase.util.TestTableName
Tests run: 4, Failures: 0, Errors: 0, Skipped: 0, Time elapsed: 0.873 sec - in org.apache.hadoop.hbase.util.TestTableName
Running org.apache.hadoop.hbase.util.TestByteBloomFilter
Tests run: 5, Failures: 0, Errors: 0, Skipped: 0, Time elapsed: 3.126 sec - in org.apache.hadoop.hbase.util.TestByteBloomFilter
Running org.apache.hadoop.hbase.util.TestHBaseFsckComparator
Tests run: 6, Failures: 0, Errors: 0, Skipped: 0, Time elapsed: 1.016 sec - in org.apache.hadoop.hbase.util.TestHBaseFsckComparator
Running org.apache.hadoop.hbase.util.TestRegionSplitCalculator
Tests run: 15, Failures: 0, Errors: 0, Skipped: 0, Time elapsed: 2.174 sec - in org.apache.hadoop.hbase.util.TestRegionSplitCalculator
Running org.apache.hadoop.hbase.util.TestPoolMap$TestRoundRobinPoolType
Tests run: 3, Failures: 0, Errors: 0, Skipped: 0, Time elapsed: 0.922 sec - in org.apache.hadoop.hbase.util.TestPoolMap$TestRoundRobinPoolType
Running org.apache.hadoop.hbase.util.TestPoolMap$TestThreadLocalPoolType
Tests run: 3, Failures: 0, Errors: 0, Skipped: 0, Time elapsed: 0.321 sec - in org.apache.hadoop.hbase.util.TestPoolMap$TestThreadLocalPoolType
Running org.apache.hadoop.hbase.util.TestPoolMap$TestReusablePoolType
Tests run: 3, Failures: 0, Errors: 0, Skipped: 0, Time elapsed: 0.358 sec - in org.apache.hadoop.hbase.util.TestPoolMap$TestReusablePoolType
Running org.apache.hadoop.hbase.util.TestHFileArchiveUtil
Tests run: 4, Failures: 0, Errors: 0, Skipped: 0, Time elapsed: 2.566 sec - in org.apache.hadoop.hbase.util.TestHFileArchiveUtil
Running org.apache.hadoop.hbase.util.TestBoundedPriorityBlockingQueue
Tests run: 7, Failures: 0, Errors: 0, Skipped: 0, Time elapsed: 2.344 sec - in org.apache.hadoop.hbase.util.TestBoundedPriorityBlockingQueue
Running org.apache.hadoop.hbase.util.TestByteBufferUtils
Tests run: 12, Failures: 0, Errors: 0, Skipped: 0, Time elapsed: 2.432 sec - in org.apache.hadoop.hbase.util.TestByteBufferUtils
Running org.apache.hadoop.hbase.filter.TestNullComparator
Tests run: 3, Failures: 0, Errors: 0, Skipped: 0, Time elapsed: 0.84 sec - in org.apache.hadoop.hbase.filter.TestNullComparator
Running org.apache.hadoop.hbase.filter.TestFilter
Tests run: 21, Failures: 0, Errors: 0, Skipped: 0, Time elapsed: 11.613 sec - in org.apache.hadoop.hbase.filter.TestFilter
Running org.apache.hadoop.hbase.filter.TestInclusiveStopFilter
Tests run: 2, Failures: 0, Errors: 0, Skipped: 0, Time elapsed: 0.69 sec - in org.apache.hadoop.hbase.filter.TestInclusiveStopFilter
Running org.apache.hadoop.hbase.filter.TestDependentColumnFilter
Tests run: 4, Failures: 0, Errors: 0, Skipped: 0, Time elapsed: 4.791 sec - in org.apache.hadoop.hbase.filter.TestDependentColumnFilter
Running org.apache.hadoop.hbase.filter.TestParseFilter
Tests run: 34, Failures: 0, Errors: 0, Skipped: 0, Time elapsed: 3.973 sec - in org.apache.hadoop.hbase.filter.TestParseFilter
Running org.apache.hadoop.hbase.filter.TestComparatorSerialization
Tests run: 6, Failures: 0, Errors: 0, Skipped: 0, Time elapsed: 2.39 sec - in org.apache.hadoop.hbase.filter.TestComparatorSerialization
Running org.apache.hadoop.hbase.filter.TestMultipleColumnPrefixFilter
Tests run: 3, Failures: 0, Errors: 0, Skipped: 0, Time elapsed: 11.128 sec - in org.apache.hadoop.hbase.filter.TestMultipleColumnPrefixFilter
Running org.apache.hadoop.hbase.filter.TestColumnPaginationFilter
Tests run: 1, Failures: 0, Errors: 0, Skipped: 0, Time elapsed: 2.096 sec - in org.apache.hadoop.hbase.filter.TestColumnPaginationFilter
Running org.apache.hadoop.hbase.filter.TestRandomRowFilter
Tests run: 2, Failures: 0, Errors: 0, Skipped: 0, Time elapsed: 1.334 sec - in org.apache.hadoop.hbase.filter.TestRandomRowFilter
Running org.apache.hadoop.hbase.filter.TestSingleColumnValueFilter
Tests run: 2, Failures: 0, Errors: 0, Skipped: 0, Time elapsed: 1.974 sec - in org.apache.hadoop.hbase.filter.TestSingleColumnValueFilter
Running org.apache.hadoop.hbase.filter.TestPageFilter
Tests run: 2, Failures: 0, Errors: 0, Skipped: 0, Time elapsed: 0.917 sec - in org.apache.hadoop.hbase.filter.TestPageFilter
Running org.apache.hadoop.hbase.filter.TestFilterSerialization
Tests run: 25, Failures: 0, Errors: 0, Skipped: 0, Time elapsed: 4.77 sec - in org.apache.hadoop.hbase.filter.TestFilterSerialization
Running org.apache.hadoop.hbase.filter.TestInvocationRecordFilter
Tests run: 1, Failures: 0, Errors: 0, Skipped: 0, Time elapsed: 3.233 sec - in org.apache.hadoop.hbase.filter.TestInvocationRecordFilter
Running org.apache.hadoop.hbase.filter.TestFilterList
Tests run: 7, Failures: 0, Errors: 0, Skipped: 0, Time elapsed: 2.61 sec - in org.apache.hadoop.hbase.filter.TestFilterList
Running org.apache.hadoop.hbase.filter.TestFirstKeyValueMatchingQualifiersFilter
Tests run: 1, Failures: 0, Errors: 0, Skipped: 0, Time elapsed: 0.636 sec - in org.apache.hadoop.hbase.filter.TestFirstKeyValueMatchingQualifiersFilter
Running org.apache.hadoop.hbase.filter.TestFuzzyRowFilter
Tests run: 2, Failures: 0, Errors: 0, Skipped: 0, Time elapsed: 0.775 sec - in org.apache.hadoop.hbase.filter.TestFuzzyRowFilter
Running org.apache.hadoop.hbase.filter.TestPrefixFilter
Tests run: 3, Failures: 0, Errors: 0, Skipped: 0, Time elapsed: 0.602 sec - in org.apache.hadoop.hbase.filter.TestPrefixFilter
Running org.apache.hadoop.hbase.filter.TestSingleColumnValueExcludeFilter
Tests run: 1, Failures: 0, Errors: 0, Skipped: 0, Time elapsed: 0.556 sec - in org.apache.hadoop.hbase.filter.TestSingleColumnValueExcludeFilter
Running org.apache.hadoop.hbase.filter.TestBitComparator
Tests run: 6, Failures: 0, Errors: 0, Skipped: 0, Time elapsed: 1.104 sec - in org.apache.hadoop.hbase.filter.TestBitComparator
Running org.apache.hadoop.hbase.filter.TestColumnPrefixFilter
Tests run: 2, Failures: 0, Errors: 0, Skipped: 0, Time elapsed: 8.697 sec - in org.apache.hadoop.hbase.filter.TestColumnPrefixFilter
Running org.apache.hadoop.hbase.TestServerName
Tests run: 6, Failures: 0, Errors: 0, Skipped: 0, Time elapsed: 0.919 sec - in org.apache.hadoop.hbase.TestServerName
Running org.apache.hadoop.hbase.TestPerformanceEvaluation
Tests run: 4, Failures: 0, Errors: 0, Skipped: 1, Time elapsed: 1.105 sec - in org.apache.hadoop.hbase.TestPerformanceEvaluation
Running org.apache.hadoop.hbase.TestServerLoad
Tests run: 2, Failures: 0, Errors: 0, Skipped: 0, Time elapsed: 0.783 sec - in org.apache.hadoop.hbase.TestServerLoad
Running org.apache.hadoop.hbase.client.TestPutDeleteEtcCellIteration
Tests run: 6, Failures: 0, Errors: 0, Skipped: 0, Time elapsed: 1.447 sec - in org.apache.hadoop.hbase.client.TestPutDeleteEtcCellIteration
Running org.apache.hadoop.hbase.client.TestConnectionUtils
Tests run: 1, Failures: 0, Errors: 0, Skipped: 0, Time elapsed: 0.726 sec - in org.apache.hadoop.hbase.client.TestConnectionUtils
Running org.apache.hadoop.hbase.client.TestIntraRowPagination
Tests run: 1, Failures: 0, Errors: 0, Skipped: 0, Time elapsed: 3.402 sec - in org.apache.hadoop.hbase.client.TestIntraRowPagination
Running org.apache.hadoop.hbase.client.TestResult
Tests run: 7, Failures: 0, Errors: 0, Skipped: 0, Time elapsed: 1.153 sec - in org.apache.hadoop.hbase.client.TestResult
Running org.apache.hadoop.hbase.client.TestHBaseAdminNoCluster
Tests run: 1, Failures: 0, Errors: 0, Skipped: 0, Time elapsed: 3.934 sec - in org.apache.hadoop.hbase.client.TestHBaseAdminNoCluster
Running org.apache.hadoop.hbase.protobuf.TestProtobufUtil
Tests run: 7, Failures: 0, Errors: 0, Skipped: 0, Time elapsed: 2.905 sec - in org.apache.hadoop.hbase.protobuf.TestProtobufUtil
Running org.apache.hadoop.hbase.protobuf.TestReplicationProtobuf
Tests run: 1, Failures: 0, Errors: 0, Skipped: 0, Time elapsed: 0.683 sec - in org.apache.hadoop.hbase.protobuf.TestReplicationProtobuf
Running org.apache.hadoop.hbase.procedure.TestProcedureMember
Tests run: 8, Failures: 0, Errors: 0, Skipped: 0, Time elapsed: 1.925 sec - in org.apache.hadoop.hbase.procedure.TestProcedureMember
Running org.apache.hadoop.hbase.procedure.TestProcedureManager
Tests run: 1, Failures: 0, Errors: 0, Skipped: 0, Time elapsed: 1.51 sec - in org.apache.hadoop.hbase.procedure.TestProcedureManager
Running org.apache.hadoop.hbase.procedure.TestProcedure
Tests run: 4, Failures: 0, Errors: 0, Skipped: 0, Time elapsed: 1.736 sec - in org.apache.hadoop.hbase.procedure.TestProcedure
Running org.apache.hadoop.hbase.procedure.TestProcedureCoordinator
Tests run: 7, Failures: 0, Errors: 0, Skipped: 0, Time elapsed: 1.484 sec - in org.apache.hadoop.hbase.procedure.TestProcedureCoordinator
Running org.apache.hadoop.hbase.constraint.TestConstraints
Tests run: 6, Failures: 0, Errors: 0, Skipped: 0, Time elapsed: 2.327 sec - in org.apache.hadoop.hbase.constraint.TestConstraints
Running org.apache.hadoop.hbase.rest.TestGZIPResponseWrapper
Tests run: 4, Failures: 0, Errors: 0, Skipped: 0, Time elapsed: 1.071 sec - in org.apache.hadoop.hbase.rest.TestGZIPResponseWrapper
Running org.apache.hadoop.hbase.rest.client.TestRemoteAdminRetries
Tests run: 7, Failures: 0, Errors: 0, Skipped: 0, Time elapsed: 2.427 sec - in org.apache.hadoop.hbase.rest.client.TestRemoteAdminRetries
Running org.apache.hadoop.hbase.rest.client.TestRemoteHTableRetries
Tests run: 7, Failures: 0, Errors: 0, Skipped: 0, Time elapsed: 2.642 sec - in org.apache.hadoop.hbase.rest.client.TestRemoteHTableRetries
Running org.apache.hadoop.hbase.rest.model.TestVersionModel
Tests run: 6, Failures: 0, Errors: 0, Skipped: 0, Time elapsed: 1.237 sec - in org.apache.hadoop.hbase.rest.model.TestVersionModel
Running org.apache.hadoop.hbase.rest.model.TestStorageClusterVersionModel
Tests run: 6, Failures: 0, Errors: 0, Skipped: 0, Time elapsed: 1.066 sec - in org.apache.hadoop.hbase.rest.model.TestStorageClusterVersionModel
Running org.apache.hadoop.hbase.rest.model.TestColumnSchemaModel
Tests run: 6, Failures: 0, Errors: 0, Skipped: 0, Time elapsed: 1.304 sec - in org.apache.hadoop.hbase.rest.model.TestColumnSchemaModel
Running org.apache.hadoop.hbase.rest.model.TestCellModel
Tests run: 6, Failures: 0, Errors: 0, Skipped: 0, Time elapsed: 1.234 sec - in org.apache.hadoop.hbase.rest.model.TestCellModel
Running org.apache.hadoop.hbase.rest.model.TestTableListModel
Tests run: 6, Failures: 0, Errors: 0, Skipped: 0, Time elapsed: 1.296 sec - in org.apache.hadoop.hbase.rest.model.TestTableListModel
Running org.apache.hadoop.hbase.rest.model.TestStorageClusterStatusModel
Tests run: 6, Failures: 0, Errors: 0, Skipped: 0, Time elapsed: 1.429 sec - in org.apache.hadoop.hbase.rest.model.TestStorageClusterStatusModel
Running org.apache.hadoop.hbase.rest.model.TestScannerModel
Tests run: 6, Failures: 0, Errors: 0, Skipped: 0, Time elapsed: 1.35 sec - in org.apache.hadoop.hbase.rest.model.TestScannerModel
Running org.apache.hadoop.hbase.rest.model.TestTableSchemaModel
Tests run: 6, Failures: 0, Errors: 0, Skipped: 0, Time elapsed: 1.25 sec - in org.apache.hadoop.hbase.rest.model.TestTableSchemaModel
Running org.apache.hadoop.hbase.rest.model.TestTableInfoModel
Tests run: 6, Failures: 0, Errors: 0, Skipped: 0, Time elapsed: 1.294 sec - in org.apache.hadoop.hbase.rest.model.TestTableInfoModel
Running org.apache.hadoop.hbase.rest.model.TestTableRegionModel
Tests run: 8, Failures: 0, Errors: 0, Skipped: 0, Time elapsed: 1.373 sec - in org.apache.hadoop.hbase.rest.model.TestTableRegionModel
Running org.apache.hadoop.hbase.rest.model.TestRowModel
Tests run: 6, Failures: 0, Errors: 0, Skipped: 0, Time elapsed: 1.076 sec - in org.apache.hadoop.hbase.rest.model.TestRowModel
Running org.apache.hadoop.hbase.rest.model.TestCellSetModel
Tests run: 6, Failures: 0, Errors: 0, Skipped: 0, Time elapsed: 1.336 sec - in org.apache.hadoop.hbase.rest.model.TestCellSetModel
Running org.apache.hadoop.hbase.TestHTableDescriptor
Tests run: 11, Failures: 0, Errors: 0, Skipped: 0, Time elapsed: 3.28 sec - in org.apache.hadoop.hbase.TestHTableDescriptor
Running org.apache.hadoop.hbase.snapshot.TestRestoreSnapshotHelper
Tests run: 1, Failures: 0, Errors: 0, Skipped: 0, Time elapsed: 4.69 sec - in org.apache.hadoop.hbase.snapshot.TestRestoreSnapshotHelper
Running org.apache.hadoop.hbase.coprocessor.TestRegionObserverStacking
Tests run: 1, Failures: 0, Errors: 0, Skipped: 0, Time elapsed: 2.961 sec - in org.apache.hadoop.hbase.coprocessor.TestRegionObserverStacking
Running org.apache.hadoop.hbase.coprocessor.TestCoprocessorInterface
Tests run: 2, Failures: 0, Errors: 0, Skipped: 0, Time elapsed: 17.488 sec - in org.apache.hadoop.hbase.coprocessor.TestCoprocessorInterface
Running org.apache.hadoop.hbase.executor.TestExecutorService
Tests run: 1, Failures: 0, Errors: 0, Skipped: 0, Time elapsed: 3.378 sec - in org.apache.hadoop.hbase.executor.TestExecutorService
Running org.apache.hadoop.hbase.zookeeper.TestZooKeeperMainServer
Tests run: 2, Failures: 0, Errors: 0, Skipped: 0, Time elapsed: 2.569 sec - in org.apache.hadoop.hbase.zookeeper.TestZooKeeperMainServer
Running org.apache.hadoop.hbase.zookeeper.TestZKConfig
Tests run: 1, Failures: 0, Errors: 0, Skipped: 0, Time elapsed: 0.783 sec - in org.apache.hadoop.hbase.zookeeper.TestZKConfig
Running org.apache.hadoop.hbase.metrics.TestMetricsHistogram
Tests run: 3, Failures: 0, Errors: 0, Skipped: 0, Time elapsed: 1.701 sec - in org.apache.hadoop.hbase.metrics.TestMetricsHistogram
Running org.apache.hadoop.hbase.TestHColumnDescriptor
Tests run: 3, Failures: 0, Errors: 0, Skipped: 0, Time elapsed: 2.32 sec - in org.apache.hadoop.hbase.TestHColumnDescriptor
Running org.apache.hadoop.hbase.monitoring.TestMemoryBoundedLogMessageBuffer
Tests run: 2, Failures: 0, Errors: 0, Skipped: 0, Time elapsed: 0.793 sec - in org.apache.hadoop.hbase.monitoring.TestMemoryBoundedLogMessageBuffer
Running org.apache.hadoop.hbase.monitoring.TestTaskMonitor
Tests run: 3, Failures: 0, Errors: 0, Skipped: 0, Time elapsed: 1.796 sec - in org.apache.hadoop.hbase.monitoring.TestTaskMonitor
Results :
Tests run: 906, Failures: 0, Errors: 0, Skipped: 7
[INFO] ------------------------------------------------------------------------
[INFO] Reactor Summary:
[INFO]
[INFO] HBase ............................................. SUCCESS [5.911s]
[INFO] HBase - Common .................................... SUCCESS [2:15.858s]
[INFO] HBase - Protocol .................................. SUCCESS [22.928s]
[INFO] HBase - Client .................................... SUCCESS [1:30.628s]
[INFO] HBase - Hadoop Compatibility ...................... SUCCESS [11.430s]
[INFO] HBase - Hadoop Two Compatibility .................. SUCCESS [15.036s]
[INFO] HBase - Prefix Tree ............................... SUCCESS [23.806s]
[INFO] HBase - Server .................................... FAILURE [25:56.888s]
[INFO] HBase - Testing Util .............................. SKIPPED
[INFO] HBase - Thrift .................................... SKIPPED
[INFO] HBase - Shell ..................................... SKIPPED
[INFO] HBase - Integration Tests ......................... SKIPPED
[INFO] HBase - Examples .................................. SKIPPED
[INFO] HBase - Assembly .................................. SKIPPED
[INFO] ------------------------------------------------------------------------
[INFO] BUILD FAILURE
[INFO] ------------------------------------------------------------------------
[INFO] Total time: 31:04.839s
[INFO] Finished at: Thu Aug 28 12:35:38 UTC 2014
[INFO] Final Memory: 67M/1143M
[INFO] ------------------------------------------------------------------------
[ERROR] Failed to execute goal org.apache.maven.plugins:maven-surefire-plugin:2.17:test (default-test) on project hbase-server: ExecutionException: java.lang.RuntimeException: The forked VM terminated without properly saying goodbye. VM crash or System.exit called?
[ERROR] Command was /bin/sh -c cd <https://builds.apache.org/job/HBase-TRUNK/ws/hbase-server> && /home/jenkins/tools/java/jdk1.7.0_25-32/jre/bin/java -enableassertions -XX:MaxDirectMemorySize=1G -Xmx1900m -XX:MaxPermSize=256m -Djava.security.egd=file:/dev/./urandom -Djava.net.preferIPv4Stack=true -Djava.awt.headless=true -jar <https://builds.apache.org/job/HBase-TRUNK/ws/hbase-server/target/surefire/surefirebooter2351632613565200327.jar> <https://builds.apache.org/job/HBase-TRUNK/ws/hbase-server/target/surefire/surefire5700738989331264744tmp> <https://builds.apache.org/job/HBase-TRUNK/ws/hbase-server/target/surefire/surefire_1827135860700058313927tmp>
[ERROR] -> [Help 1]
[ERROR]
[ERROR] To see the full stack trace of the errors, re-run Maven with the -e switch.
[ERROR] Re-run Maven using the -X switch to enable full debug logging.
[ERROR]
[ERROR] For more information about the errors and possible solutions, please read the following articles:
[ERROR] [Help 1] http://cwiki.apache.org/confluence/display/MAVEN/MojoFailureException
[ERROR]
[ERROR] After correcting the problems, you can resume the build with the command
[ERROR] mvn <goals> -rf :hbase-server
Build step 'Invoke top-level Maven targets' marked build as failure
Performing Post build task...
Match found for :.* : True
Logical operation result is TRUE
Running script : ZOMBIE_TESTS_COUNT=`jps | grep surefirebooter | wc -l`
if [[ $ZOMBIE_TESTS_COUNT != 0 ]] ; then
#It seems sometimes the tests are not dying immediately. Let's give them 10s
echo "Suspicious java process found - waiting 10s to see if there are just slow to stop"
sleep 10
ZOMBIE_TESTS_COUNT=`jps | grep surefirebooter | wc -l`
if [[ $ZOMBIE_TESTS_COUNT != 0 ]] ; then
echo "There are $ZOMBIE_TESTS_COUNT zombie tests, they should have been killed by surefire but survived"
echo "************ BEGIN zombies jstack extract"
ZB_STACK=`jps | grep surefirebooter | cut -d ' ' -f 1 | xargs -n 1 jstack | grep ".test" | grep "\.java"`
jps | grep surefirebooter | cut -d ' ' -f 1 | xargs -n 1 jstack
echo "************ END zombies jstack extract"
JIRA_COMMENT="$JIRA_COMMENT
{color:red}-1 core zombie tests{color}. There are ${ZOMBIE_TESTS_COUNT} zombie test(s): ${ZB_STACK}"
BAD=1
jps | grep surefirebooter | cut -d ' ' -f 1 | xargs kill -9
else
echo "We're ok: there is no zombie test, but some tests took some time to stop"
fi
else
echo "We're ok: there is no zombie test"
fi
[HBase-TRUNK] $ /bin/bash -xe /tmp/hudson5935502231338609910.sh
++ jps
++ grep surefirebooter
++ wc -l
+ ZOMBIE_TESTS_COUNT=0
+ [[ 0 != 0 ]]
+ echo 'We'\''re ok: there is no zombie test'
We're ok: there is no zombie test
POST BUILD TASK : SUCCESS
END OF POST BUILD TASK : 0
Archiving artifacts
Sending artifact delta relative to HBase-TRUNK #5421
Archived 889 artifacts
Archive block size is 32768
Received 8 blocks and 33082056 bytes
Compression is 0.8%
Took 1 min 5 sec
Recording test results
Updating HBASE-9875
Build failed in Jenkins: HBase-TRUNK #5439
Posted by Apache Jenkins Server <je...@builds.apache.org>.
See <https://builds.apache.org/job/HBase-TRUNK/5439/changes>
Changes:
[stack] HBASE-4920 We need a mascot, a totem
[stack] HBASE-4920 We need a mascot, a totem
[stack] Add note on orca adding attribution
------------------------------------------
[...truncated 1611 lines...]
Tests run: 9, Failures: 0, Errors: 0, Skipped: 0, Time elapsed: 13.731 sec - in org.apache.hadoop.hbase.rest.client.TestRemoteTable
Running org.apache.hadoop.hbase.rest.TestTableResource
Running org.apache.hadoop.hbase.rest.TestStatusResource
Running org.apache.hadoop.hbase.rest.TestResourceFilter
Tests run: 1, Failures: 0, Errors: 0, Skipped: 0, Time elapsed: 1.078 sec - in org.apache.hadoop.hbase.rest.TestResourceFilter
Tests run: 2, Failures: 0, Errors: 0, Skipped: 0, Time elapsed: 3.181 sec - in org.apache.hadoop.hbase.rest.TestStatusResource
Tests run: 8, Failures: 0, Errors: 0, Skipped: 0, Time elapsed: 3.472 sec - in org.apache.hadoop.hbase.rest.TestTableResource
Running org.apache.hadoop.hbase.rest.TestScannersWithLabels
Running org.apache.hadoop.hbase.rest.TestSchemaResource
Running org.apache.hadoop.hbase.rest.TestGzipFilter
Tests run: 2, Failures: 0, Errors: 0, Skipped: 0, Time elapsed: 2.994 sec - in org.apache.hadoop.hbase.rest.TestScannersWithLabels
Tests run: 2, Failures: 0, Errors: 0, Skipped: 0, Time elapsed: 3.216 sec - in org.apache.hadoop.hbase.rest.TestGzipFilter
Tests run: 2, Failures: 0, Errors: 0, Skipped: 0, Time elapsed: 4.346 sec - in org.apache.hadoop.hbase.rest.TestSchemaResource
Running org.apache.hadoop.hbase.rest.TestTableScan
Running org.apache.hadoop.hbase.rest.TestDeleteRow
Running org.apache.hadoop.hbase.rest.TestGetAndPutResource
Tests run: 2, Failures: 0, Errors: 0, Skipped: 0, Time elapsed: 5.052 sec - in org.apache.hadoop.hbase.rest.TestDeleteRow
Tests run: 10, Failures: 0, Errors: 0, Skipped: 0, Time elapsed: 11.876 sec - in org.apache.hadoop.hbase.rest.TestTableScan
Running org.apache.hadoop.hbase.rest.TestScannersWithFilters
Running org.apache.hadoop.hbase.rest.TestScannerResource
Tests run: 18, Failures: 0, Errors: 0, Skipped: 0, Time elapsed: 19.771 sec - in org.apache.hadoop.hbase.rest.TestGetAndPutResource
Tests run: 10, Failures: 0, Errors: 0, Skipped: 0, Time elapsed: 6.167 sec - in org.apache.hadoop.hbase.rest.TestScannersWithFilters
Tests run: 5, Failures: 0, Errors: 0, Skipped: 0, Time elapsed: 5.748 sec - in org.apache.hadoop.hbase.rest.TestScannerResource
Running org.apache.hadoop.hbase.security.visibility.TestVisibilityLabelsWithDistributedLogReplay
Running org.apache.hadoop.hbase.security.visibility.TestVisibilityLabelsWithSLGStack
Running org.apache.hadoop.hbase.security.visibility.TestVisibilityLabelsWithDeletes
Running org.apache.hadoop.hbase.rest.TestMultiRowResource
Tests run: 1, Failures: 0, Errors: 0, Skipped: 0, Time elapsed: 1.375 sec - in org.apache.hadoop.hbase.security.visibility.TestVisibilityLabelsWithSLGStack
Tests run: 3, Failures: 0, Errors: 0, Skipped: 0, Time elapsed: 3.194 sec - in org.apache.hadoop.hbase.rest.TestMultiRowResource
Running org.apache.hadoop.hbase.security.visibility.TestEnforcingScanLabelGenerator
Tests run: 1, Failures: 0, Errors: 0, Skipped: 0, Time elapsed: 1.801 sec - in org.apache.hadoop.hbase.security.visibility.TestEnforcingScanLabelGenerator
Running org.apache.hadoop.hbase.security.visibility.TestVisibilityWithCheckAuths
Tests run: 21, Failures: 0, Errors: 0, Skipped: 0, Time elapsed: 15.29 sec - in org.apache.hadoop.hbase.security.visibility.TestVisibilityLabelsWithDistributedLogReplay
Tests run: 2, Failures: 0, Errors: 0, Skipped: 0, Time elapsed: 3.04 sec - in org.apache.hadoop.hbase.security.visibility.TestVisibilityWithCheckAuths
Running org.apache.hadoop.hbase.security.visibility.TestVisibilityLabelsOpWithDifferentUsersNoACL
Running org.apache.hadoop.hbase.security.visibility.TestVisibilityLabelsWithDefaultVisLabelService
Tests run: 1, Failures: 0, Errors: 0, Skipped: 0, Time elapsed: 2.495 sec - in org.apache.hadoop.hbase.security.visibility.TestVisibilityLabelsOpWithDifferentUsersNoACL
Running org.apache.hadoop.hbase.security.visibility.TestVisibilityLabelsWithACL
Tests run: 5, Failures: 0, Errors: 0, Skipped: 0, Time elapsed: 4.642 sec - in org.apache.hadoop.hbase.security.visibility.TestVisibilityLabelsWithACL
Running org.apache.hadoop.hbase.security.visibility.TestVisibilityLabelsWithCustomVisLabService
Tests run: 21, Failures: 0, Errors: 0, Skipped: 0, Time elapsed: 13.454 sec - in org.apache.hadoop.hbase.security.visibility.TestVisibilityLabelsWithDefaultVisLabelService
Tests run: 37, Failures: 0, Errors: 0, Skipped: 0, Time elapsed: 41.236 sec - in org.apache.hadoop.hbase.security.visibility.TestVisibilityLabelsWithDeletes
Running org.apache.hadoop.hbase.security.access.TestAccessController
Tests run: 8, Failures: 0, Errors: 0, Skipped: 0, Time elapsed: 224.48 sec - in org.apache.hadoop.hbase.replication.regionserver.TestReplicationHLogReaderManager
Running org.apache.hadoop.hbase.security.access.TestTablePermissions
Tests run: 19, Failures: 0, Errors: 0, Skipped: 0, Time elapsed: 12.98 sec - in org.apache.hadoop.hbase.security.visibility.TestVisibilityLabelsWithCustomVisLabService
Running org.apache.hadoop.hbase.security.access.TestAccessControlFilter
Running org.apache.hadoop.hbase.security.access.TestCellACLs
Tests run: 1, Failures: 0, Errors: 0, Skipped: 0, Time elapsed: 2.316 sec - in org.apache.hadoop.hbase.security.access.TestAccessControlFilter
Tests run: 2, Failures: 0, Errors: 0, Skipped: 0, Time elapsed: 6.623 sec - in org.apache.hadoop.hbase.security.access.TestCellACLs
Running org.apache.hadoop.hbase.security.access.TestNamespaceCommands
Tests run: 3, Failures: 0, Errors: 0, Skipped: 0, Time elapsed: 2.553 sec - in org.apache.hadoop.hbase.security.access.TestNamespaceCommands
Running org.apache.hadoop.hbase.security.access.TestZKPermissionsWatcher
Tests run: 7, Failures: 0, Errors: 0, Skipped: 0, Time elapsed: 13.842 sec - in org.apache.hadoop.hbase.security.access.TestTablePermissions
Running org.apache.hadoop.hbase.security.token.TestZKSecretWatcher
Tests run: 1, Failures: 0, Errors: 0, Skipped: 0, Time elapsed: 3.514 sec - in org.apache.hadoop.hbase.security.access.TestZKPermissionsWatcher
Running org.apache.hadoop.hbase.security.access.TestScanEarlyTermination
Running org.apache.hadoop.hbase.security.token.TestTokenAuthentication
Tests run: 2, Failures: 0, Errors: 0, Skipped: 0, Time elapsed: 0.432 sec - in org.apache.hadoop.hbase.security.token.TestTokenAuthentication
Running org.apache.hadoop.hbase.TestMetaTableAccessorNoCluster
Running org.apache.hadoop.hbase.security.access.TestCellACLWithMultipleVersions
Tests run: 1, Failures: 0, Errors: 0, Skipped: 0, Time elapsed: 3.441 sec - in org.apache.hadoop.hbase.security.access.TestScanEarlyTermination
Tests run: 2, Failures: 0, Errors: 0, Skipped: 0, Time elapsed: 3.607 sec - in org.apache.hadoop.hbase.TestMetaTableAccessorNoCluster
Running org.apache.hadoop.hbase.TestMetaTableLocator
Tests run: 6, Failures: 0, Errors: 0, Skipped: 0, Time elapsed: 1.814 sec - in org.apache.hadoop.hbase.TestMetaTableLocator
Running org.apache.hadoop.hbase.TestHBaseTestingUtility
Tests run: 1, Failures: 0, Errors: 0, Skipped: 0, Time elapsed: 13.25 sec - in org.apache.hadoop.hbase.security.token.TestZKSecretWatcher
Running org.apache.hadoop.hbase.TestZooKeeper
Running org.apache.hadoop.hbase.snapshot.TestSnapshotDescriptionUtils
Tests run: 2, Failures: 0, Errors: 0, Skipped: 0, Time elapsed: 0.237 sec - in org.apache.hadoop.hbase.snapshot.TestSnapshotDescriptionUtils
Tests run: 8, Failures: 0, Errors: 0, Skipped: 0, Time elapsed: 13.333 sec - in org.apache.hadoop.hbase.security.access.TestCellACLWithMultipleVersions
Running org.apache.hadoop.hbase.snapshot.TestFlushSnapshotFromClient
Running org.apache.hadoop.hbase.snapshot.TestSecureExportSnapshot
Tests run: 7, Failures: 0, Errors: 0, Skipped: 0, Time elapsed: 30.715 sec - in org.apache.hadoop.hbase.TestHBaseTestingUtility
Tests run: 44, Failures: 0, Errors: 0, Skipped: 0, Time elapsed: 83.14 sec - in org.apache.hadoop.hbase.security.access.TestAccessController
Tests run: 9, Failures: 0, Errors: 0, Skipped: 0, Time elapsed: 35.753 sec - in org.apache.hadoop.hbase.snapshot.TestFlushSnapshotFromClient
Running org.apache.hadoop.hbase.snapshot.TestExportSnapshot
Running org.apache.hadoop.hbase.snapshot.TestRestoreFlushSnapshotFromClient
Running org.apache.hadoop.hbase.TestInfoServers
Tests run: 3, Failures: 0, Errors: 0, Skipped: 0, Time elapsed: 2.872 sec - in org.apache.hadoop.hbase.TestInfoServers
Running org.apache.hadoop.hbase.procedure.TestZKProcedureControllers
Tests run: 4, Failures: 0, Errors: 0, Skipped: 0, Time elapsed: 1.864 sec - in org.apache.hadoop.hbase.procedure.TestZKProcedureControllers
Running org.apache.hadoop.hbase.procedure.TestZKProcedure
Tests run: 4, Failures: 0, Errors: 0, Skipped: 0, Time elapsed: 2.942 sec - in org.apache.hadoop.hbase.procedure.TestZKProcedure
Running org.apache.hadoop.hbase.io.hfile.TestCacheOnWrite
Tests run: 5, Failures: 0, Errors: 0, Skipped: 0, Time elapsed: 48.02 sec - in org.apache.hadoop.hbase.snapshot.TestRestoreFlushSnapshotFromClient
Running org.apache.hadoop.hbase.io.hfile.TestForceCacheImportantBlocks
Tests run: 2, Failures: 0, Errors: 0, Skipped: 0, Time elapsed: 23.545 sec - in org.apache.hadoop.hbase.io.hfile.TestForceCacheImportantBlocks
Running org.apache.hadoop.hbase.io.hfile.TestHFileBlock
Tests run: 36, Failures: 0, Errors: 0, Skipped: 0, Time elapsed: 78.471 sec - in org.apache.hadoop.hbase.io.hfile.TestCacheOnWrite
Running org.apache.hadoop.hbase.io.hfile.TestHFileBlockIndex
Tests run: 2, Failures: 0, Errors: 0, Skipped: 0, Time elapsed: 1.313 sec - in org.apache.hadoop.hbase.io.hfile.TestHFileBlockIndex
Running org.apache.hadoop.hbase.io.hfile.TestHFileSeek
Tests run: 1, Failures: 0, Errors: 0, Skipped: 0, Time elapsed: 5.269 sec - in org.apache.hadoop.hbase.io.hfile.TestHFileSeek
Running org.apache.hadoop.hbase.io.hfile.TestScannerSelectionUsingTTL
Tests run: 11, Failures: 0, Errors: 0, Skipped: 0, Time elapsed: 205.405 sec - in org.apache.hadoop.hbase.TestZooKeeper
Running org.apache.hadoop.hbase.io.hfile.TestCacheConfig
Tests run: 6, Failures: 0, Errors: 0, Skipped: 0, Time elapsed: 2.291 sec - in org.apache.hadoop.hbase.io.hfile.TestCacheConfig
Running org.apache.hadoop.hbase.io.encoding.TestDataBlockEncoders
Tests run: 28, Failures: 0, Errors: 0, Skipped: 0, Time elapsed: 95.561 sec - in org.apache.hadoop.hbase.io.hfile.TestHFileBlock
Running org.apache.hadoop.hbase.io.encoding.TestEncodedSeekers
Tests run: 6, Failures: 0, Errors: 0, Skipped: 0, Time elapsed: 63.664 sec - in org.apache.hadoop.hbase.io.hfile.TestScannerSelectionUsingTTL
Running org.apache.hadoop.hbase.io.encoding.TestBufferedDataBlockEncoder
Tests run: 1, Failures: 0, Errors: 0, Skipped: 0, Time elapsed: 25.375 sec - in org.apache.hadoop.hbase.io.encoding.TestBufferedDataBlockEncoder
Running org.apache.hadoop.hbase.io.encoding.TestChangingEncoding
Tests run: 9, Failures: 0, Errors: 0, Skipped: 0, Time elapsed: 297.921 sec - in org.apache.hadoop.hbase.snapshot.TestSecureExportSnapshot
Tests run: 3, Failures: 0, Errors: 0, Skipped: 0, Time elapsed: 49.43 sec - in org.apache.hadoop.hbase.io.encoding.TestChangingEncoding
Running org.apache.hadoop.hbase.io.encoding.TestLoadAndSwitchEncodeOnDisk
Running org.apache.hadoop.hbase.io.encoding.TestPrefixTree
Tests run: 1, Failures: 0, Errors: 0, Skipped: 0, Time elapsed: 1.825 sec - in org.apache.hadoop.hbase.io.encoding.TestPrefixTree
Running org.apache.hadoop.hbase.io.TestFileLink
Tests run: 1, Failures: 0, Errors: 0, Skipped: 0, Time elapsed: 23.203 sec - in org.apache.hadoop.hbase.io.encoding.TestLoadAndSwitchEncodeOnDisk
Tests run: 9, Failures: 0, Errors: 0, Skipped: 0, Time elapsed: 298.042 sec - in org.apache.hadoop.hbase.snapshot.TestExportSnapshot
Tests run: 3, Failures: 0, Errors: 0, Skipped: 0, Time elapsed: 15.736 sec - in org.apache.hadoop.hbase.io.TestFileLink
Tests run: 20, Failures: 0, Errors: 0, Skipped: 0, Time elapsed: 127.864 sec - in org.apache.hadoop.hbase.io.encoding.TestEncodedSeekers
Running org.apache.hadoop.hbase.zookeeper.TestZKLeaderManager
Tests run: 1, Failures: 0, Errors: 0, Skipped: 0, Time elapsed: 0.171 sec - in org.apache.hadoop.hbase.zookeeper.TestZKLeaderManager
Running org.apache.hadoop.hbase.zookeeper.TestZooKeeperNodeTracker
Running org.apache.hadoop.hbase.zookeeper.TestRecoverableZooKeeper
Tests run: 3, Failures: 0, Errors: 0, Skipped: 0, Time elapsed: 1.06 sec - in org.apache.hadoop.hbase.zookeeper.TestZooKeeperNodeTracker
Running org.apache.hadoop.hbase.zookeeper.TestZKTableStateManager
Tests run: 1, Failures: 0, Errors: 0, Skipped: 0, Time elapsed: 1.23 sec - in org.apache.hadoop.hbase.zookeeper.TestRecoverableZooKeeper
Tests run: 1, Failures: 0, Errors: 0, Skipped: 0, Time elapsed: 0.95 sec - in org.apache.hadoop.hbase.zookeeper.TestZKTableStateManager
Running org.apache.hadoop.hbase.zookeeper.TestZKMulti
Tests run: 6, Failures: 0, Errors: 0, Skipped: 0, Time elapsed: 0.333 sec - in org.apache.hadoop.hbase.zookeeper.TestZKMulti
Running org.apache.hadoop.hbase.zookeeper.lock.TestZKInterProcessReadWriteLock
Running org.apache.hadoop.hbase.zookeeper.TestHQuorumPeer
Tests run: 3, Failures: 0, Errors: 0, Skipped: 0, Time elapsed: 1.418 sec - in org.apache.hadoop.hbase.zookeeper.TestHQuorumPeer
Running org.apache.hadoop.hbase.zookeeper.TestZooKeeperACL
Running org.apache.hadoop.hbase.TestIOFencing
Tests run: 6, Failures: 0, Errors: 0, Skipped: 0, Time elapsed: 0.278 sec - in org.apache.hadoop.hbase.zookeeper.TestZooKeeperACL
Running org.apache.hadoop.hbase.constraint.TestConstraint
Running org.apache.hadoop.hbase.backup.TestHFileArchiving
Tests run: 5, Failures: 0, Errors: 0, Skipped: 0, Time elapsed: 5.037 sec - in org.apache.hadoop.hbase.constraint.TestConstraint
Running org.apache.hadoop.hbase.backup.example.TestZooKeeperTableArchiveClient
Tests run: 3, Failures: 0, Errors: 0, Skipped: 0, Time elapsed: 3.783 sec - in org.apache.hadoop.hbase.backup.example.TestZooKeeperTableArchiveClient
Tests run: 6, Failures: 0, Errors: 0, Skipped: 0, Time elapsed: 24.458 sec - in org.apache.hadoop.hbase.zookeeper.lock.TestZKInterProcessReadWriteLock
Running org.apache.hadoop.hbase.ipc.TestProtoBufRpc
Tests run: 1, Failures: 0, Errors: 0, Skipped: 0, Time elapsed: 2.052 sec - in org.apache.hadoop.hbase.ipc.TestProtoBufRpc
Running org.apache.hadoop.hbase.ipc.TestDelayedRpc
Running org.apache.hadoop.hbase.TestHColumnDescriptorDefaultVersions
Tests run: 4, Failures: 0, Errors: 0, Skipped: 0, Time elapsed: 3.913 sec - in org.apache.hadoop.hbase.ipc.TestDelayedRpc
Running org.apache.hadoop.hbase.ipc.TestHBaseClient
Tests run: 1, Failures: 0, Errors: 0, Skipped: 0, Time elapsed: 0.44 sec - in org.apache.hadoop.hbase.ipc.TestHBaseClient
Tests run: 3, Failures: 0, Errors: 0, Skipped: 0, Time elapsed: 10.521 sec - in org.apache.hadoop.hbase.TestHColumnDescriptorDefaultVersions
Running org.apache.hadoop.hbase.TestNamespace
Tests run: 9, Failures: 0, Errors: 0, Skipped: 1, Time elapsed: 5.31 sec - in org.apache.hadoop.hbase.TestNamespace
Tests run: 5, Failures: 0, Errors: 0, Skipped: 0, Time elapsed: 39.383 sec - in org.apache.hadoop.hbase.backup.TestHFileArchiving
Tests run: 28, Failures: 0, Errors: 0, Skipped: 0, Time elapsed: 274.048 sec - in org.apache.hadoop.hbase.io.encoding.TestDataBlockEncoders
Tests run: 2, Failures: 0, Errors: 0, Skipped: 0, Time elapsed: 192.294 sec - in org.apache.hadoop.hbase.TestIOFencing
Results :
Failed tests:
TestRegionRebalancing.testRebalanceOnRegionServerNumberChange:131->assertRegionsAreBalanced:221 After 5 attempts, region assignments were not balanced.
Tests run: 2041, Failures: 1, Errors: 0, Skipped: 19
[INFO] ------------------------------------------------------------------------
[INFO] Reactor Summary:
[INFO]
[INFO] HBase ............................................. SUCCESS [2.739s]
[INFO] HBase - Common .................................... SUCCESS [54.338s]
[INFO] HBase - Protocol .................................. SUCCESS [8.992s]
[INFO] HBase - Client .................................... SUCCESS [1:04.236s]
[INFO] HBase - Hadoop Compatibility ...................... SUCCESS [7.118s]
[INFO] HBase - Hadoop Two Compatibility .................. SUCCESS [5.843s]
[INFO] HBase - Prefix Tree ............................... SUCCESS [8.425s]
[INFO] HBase - Server .................................... FAILURE [1:06:21.976s]
[INFO] HBase - Testing Util .............................. SKIPPED
[INFO] HBase - Thrift .................................... SKIPPED
[INFO] HBase - Shell ..................................... SKIPPED
[INFO] HBase - Integration Tests ......................... SKIPPED
[INFO] HBase - Examples .................................. SKIPPED
[INFO] HBase - Assembly .................................. SKIPPED
[INFO] ------------------------------------------------------------------------
[INFO] BUILD FAILURE
[INFO] ------------------------------------------------------------------------
[INFO] Total time: 1:08:54.392s
[INFO] Finished at: Thu Aug 28 04:15:15 UTC 2014
[INFO] Final Memory: 39M/269M
[INFO] ------------------------------------------------------------------------
[ERROR] Failed to execute goal org.apache.maven.plugins:maven-surefire-plugin:2.17:test (secondPartTestsExecution) on project hbase-server: There are test failures.
[ERROR]
[ERROR] Please refer to <https://builds.apache.org/job/HBase-TRUNK/ws/hbase-server/target/surefire-reports> for the individual test results.
[ERROR] -> [Help 1]
[ERROR]
[ERROR] To see the full stack trace of the errors, re-run Maven with the -e switch.
[ERROR] Re-run Maven using the -X switch to enable full debug logging.
[ERROR]
[ERROR] For more information about the errors and possible solutions, please read the following articles:
[ERROR] [Help 1] http://cwiki.apache.org/confluence/display/MAVEN/MojoFailureException
[ERROR]
[ERROR] After correcting the problems, you can resume the build with the command
[ERROR] mvn <goals> -rf :hbase-server
Build step 'Invoke top-level Maven targets' marked build as failure
Performing Post build task...
Match found for :.* : True
Logical operation result is TRUE
Running script : ZOMBIE_TESTS_COUNT=`jps | grep surefirebooter | wc -l`
if [[ $ZOMBIE_TESTS_COUNT != 0 ]] ; then
#It seems sometimes the tests are not dying immediately. Let's give them 10s
echo "Suspicious java process found - waiting 10s to see if there are just slow to stop"
sleep 10
ZOMBIE_TESTS_COUNT=`jps | grep surefirebooter | wc -l`
if [[ $ZOMBIE_TESTS_COUNT != 0 ]] ; then
echo "There are $ZOMBIE_TESTS_COUNT zombie tests, they should have been killed by surefire but survived"
echo "************ BEGIN zombies jstack extract"
ZB_STACK=`jps | grep surefirebooter | cut -d ' ' -f 1 | xargs -n 1 jstack | grep ".test" | grep "\.java"`
jps | grep surefirebooter | cut -d ' ' -f 1 | xargs -n 1 jstack
echo "************ END zombies jstack extract"
JIRA_COMMENT="$JIRA_COMMENT
{color:red}-1 core zombie tests{color}. There are ${ZOMBIE_TESTS_COUNT} zombie test(s): ${ZB_STACK}"
BAD=1
jps | grep surefirebooter | cut -d ' ' -f 1 | xargs kill -9
else
echo "We're ok: there is no zombie test, but some tests took some time to stop"
fi
else
echo "We're ok: there is no zombie test"
fi
[HBase-TRUNK] $ /bin/bash -xe /tmp/hudson6293068868302928121.sh
++ jps
++ grep surefirebooter
++ wc -l
+ ZOMBIE_TESTS_COUNT=1
+ [[ 1 != 0 ]]
+ echo 'Suspicious java process found - waiting 10s to see if there are just slow to stop'
Suspicious java process found - waiting 10s to see if there are just slow to stop
+ sleep 10
++ jps
++ grep surefirebooter
++ wc -l
+ ZOMBIE_TESTS_COUNT=0
+ [[ 0 != 0 ]]
+ echo 'We'\''re ok: there is no zombie test, but some tests took some time to stop'
We're ok: there is no zombie test, but some tests took some time to stop
POST BUILD TASK : SUCCESS
END OF POST BUILD TASK : 0
Archiving artifacts
Sending artifact delta relative to HBase-TRUNK #5421
Archived 1786 artifacts
Archive block size is 32768
Received 76 blocks and 557378022 bytes
Compression is 0.4%
Took 2 min 52 sec
Recording test results
Updating HBASE-4920
Build failed in Jenkins: HBase-TRUNK #5438
Posted by Apache Jenkins Server <je...@builds.apache.org>.
See <https://builds.apache.org/job/HBase-TRUNK/5438/changes>
Changes:
[jxiang] HBASE-11788 HBase is not deleting the cell when a Put with a KeyValue, KeyValue.Type.Delete is submitted
[stack] HBASE-9875 NamespaceJanitor chore is not used
------------------------------------------
[...truncated 1002 lines...]
Tests run: 5, Failures: 0, Errors: 0, Skipped: 0, Time elapsed: 3.403 sec - in org.apache.hadoop.hbase.util.TestByteBloomFilter
Running org.apache.hadoop.hbase.util.TestHBaseFsckComparator
Tests run: 6, Failures: 0, Errors: 0, Skipped: 0, Time elapsed: 1.264 sec - in org.apache.hadoop.hbase.util.TestHBaseFsckComparator
Running org.apache.hadoop.hbase.util.TestRegionSplitCalculator
Tests run: 15, Failures: 0, Errors: 0, Skipped: 0, Time elapsed: 2.188 sec - in org.apache.hadoop.hbase.util.TestRegionSplitCalculator
Running org.apache.hadoop.hbase.util.TestPoolMap$TestRoundRobinPoolType
Tests run: 3, Failures: 0, Errors: 0, Skipped: 0, Time elapsed: 0.914 sec - in org.apache.hadoop.hbase.util.TestPoolMap$TestRoundRobinPoolType
Running org.apache.hadoop.hbase.util.TestPoolMap$TestThreadLocalPoolType
Tests run: 3, Failures: 0, Errors: 0, Skipped: 0, Time elapsed: 0.349 sec - in org.apache.hadoop.hbase.util.TestPoolMap$TestThreadLocalPoolType
Running org.apache.hadoop.hbase.util.TestPoolMap$TestReusablePoolType
Tests run: 3, Failures: 0, Errors: 0, Skipped: 0, Time elapsed: 0.448 sec - in org.apache.hadoop.hbase.util.TestPoolMap$TestReusablePoolType
Running org.apache.hadoop.hbase.util.TestHFileArchiveUtil
Tests run: 4, Failures: 0, Errors: 0, Skipped: 0, Time elapsed: 2.842 sec - in org.apache.hadoop.hbase.util.TestHFileArchiveUtil
Running org.apache.hadoop.hbase.util.TestBoundedPriorityBlockingQueue
Tests run: 7, Failures: 0, Errors: 0, Skipped: 0, Time elapsed: 2.256 sec - in org.apache.hadoop.hbase.util.TestBoundedPriorityBlockingQueue
Running org.apache.hadoop.hbase.util.TestByteBufferUtils
Tests run: 12, Failures: 0, Errors: 0, Skipped: 0, Time elapsed: 2.982 sec - in org.apache.hadoop.hbase.util.TestByteBufferUtils
Running org.apache.hadoop.hbase.filter.TestNullComparator
Tests run: 3, Failures: 0, Errors: 0, Skipped: 0, Time elapsed: 0.947 sec - in org.apache.hadoop.hbase.filter.TestNullComparator
Running org.apache.hadoop.hbase.filter.TestFilter
Tests run: 21, Failures: 0, Errors: 0, Skipped: 0, Time elapsed: 14.351 sec - in org.apache.hadoop.hbase.filter.TestFilter
Running org.apache.hadoop.hbase.filter.TestInclusiveStopFilter
Tests run: 2, Failures: 0, Errors: 0, Skipped: 0, Time elapsed: 0.748 sec - in org.apache.hadoop.hbase.filter.TestInclusiveStopFilter
Running org.apache.hadoop.hbase.filter.TestDependentColumnFilter
Tests run: 4, Failures: 0, Errors: 0, Skipped: 0, Time elapsed: 5.967 sec - in org.apache.hadoop.hbase.filter.TestDependentColumnFilter
Running org.apache.hadoop.hbase.filter.TestParseFilter
Tests run: 34, Failures: 0, Errors: 0, Skipped: 0, Time elapsed: 4.966 sec - in org.apache.hadoop.hbase.filter.TestParseFilter
Running org.apache.hadoop.hbase.filter.TestComparatorSerialization
Tests run: 6, Failures: 0, Errors: 0, Skipped: 0, Time elapsed: 2.95 sec - in org.apache.hadoop.hbase.filter.TestComparatorSerialization
Running org.apache.hadoop.hbase.filter.TestMultipleColumnPrefixFilter
Tests run: 3, Failures: 0, Errors: 0, Skipped: 0, Time elapsed: 13.119 sec - in org.apache.hadoop.hbase.filter.TestMultipleColumnPrefixFilter
Running org.apache.hadoop.hbase.filter.TestColumnPaginationFilter
Tests run: 1, Failures: 0, Errors: 0, Skipped: 0, Time elapsed: 2.123 sec - in org.apache.hadoop.hbase.filter.TestColumnPaginationFilter
Running org.apache.hadoop.hbase.filter.TestRandomRowFilter
Tests run: 2, Failures: 0, Errors: 0, Skipped: 0, Time elapsed: 1.712 sec - in org.apache.hadoop.hbase.filter.TestRandomRowFilter
Running org.apache.hadoop.hbase.filter.TestSingleColumnValueFilter
Tests run: 2, Failures: 0, Errors: 0, Skipped: 0, Time elapsed: 2.083 sec - in org.apache.hadoop.hbase.filter.TestSingleColumnValueFilter
Running org.apache.hadoop.hbase.filter.TestPageFilter
Tests run: 2, Failures: 0, Errors: 0, Skipped: 0, Time elapsed: 0.771 sec - in org.apache.hadoop.hbase.filter.TestPageFilter
Running org.apache.hadoop.hbase.filter.TestFilterSerialization
Tests run: 25, Failures: 0, Errors: 0, Skipped: 0, Time elapsed: 5.63 sec - in org.apache.hadoop.hbase.filter.TestFilterSerialization
Running org.apache.hadoop.hbase.filter.TestInvocationRecordFilter
Tests run: 1, Failures: 0, Errors: 0, Skipped: 0, Time elapsed: 3.821 sec - in org.apache.hadoop.hbase.filter.TestInvocationRecordFilter
Running org.apache.hadoop.hbase.filter.TestFilterList
Tests run: 7, Failures: 0, Errors: 0, Skipped: 0, Time elapsed: 2.57 sec - in org.apache.hadoop.hbase.filter.TestFilterList
Running org.apache.hadoop.hbase.filter.TestFirstKeyValueMatchingQualifiersFilter
Tests run: 1, Failures: 0, Errors: 0, Skipped: 0, Time elapsed: 0.78 sec - in org.apache.hadoop.hbase.filter.TestFirstKeyValueMatchingQualifiersFilter
Running org.apache.hadoop.hbase.filter.TestFuzzyRowFilter
Tests run: 2, Failures: 0, Errors: 0, Skipped: 0, Time elapsed: 0.95 sec - in org.apache.hadoop.hbase.filter.TestFuzzyRowFilter
Running org.apache.hadoop.hbase.filter.TestPrefixFilter
Tests run: 3, Failures: 0, Errors: 0, Skipped: 0, Time elapsed: 0.942 sec - in org.apache.hadoop.hbase.filter.TestPrefixFilter
Running org.apache.hadoop.hbase.filter.TestSingleColumnValueExcludeFilter
Tests run: 1, Failures: 0, Errors: 0, Skipped: 0, Time elapsed: 0.567 sec - in org.apache.hadoop.hbase.filter.TestSingleColumnValueExcludeFilter
Running org.apache.hadoop.hbase.filter.TestBitComparator
Tests run: 6, Failures: 0, Errors: 0, Skipped: 0, Time elapsed: 1.307 sec - in org.apache.hadoop.hbase.filter.TestBitComparator
Running org.apache.hadoop.hbase.filter.TestColumnPrefixFilter
Tests run: 2, Failures: 0, Errors: 0, Skipped: 0, Time elapsed: 8.245 sec - in org.apache.hadoop.hbase.filter.TestColumnPrefixFilter
Running org.apache.hadoop.hbase.TestServerName
Tests run: 6, Failures: 0, Errors: 0, Skipped: 0, Time elapsed: 1.203 sec - in org.apache.hadoop.hbase.TestServerName
Running org.apache.hadoop.hbase.TestPerformanceEvaluation
Tests run: 4, Failures: 0, Errors: 0, Skipped: 1, Time elapsed: 1.071 sec - in org.apache.hadoop.hbase.TestPerformanceEvaluation
Running org.apache.hadoop.hbase.TestServerLoad
Tests run: 2, Failures: 0, Errors: 0, Skipped: 0, Time elapsed: 0.951 sec - in org.apache.hadoop.hbase.TestServerLoad
Running org.apache.hadoop.hbase.client.TestPutDeleteEtcCellIteration
Tests run: 6, Failures: 0, Errors: 0, Skipped: 0, Time elapsed: 1.445 sec - in org.apache.hadoop.hbase.client.TestPutDeleteEtcCellIteration
Running org.apache.hadoop.hbase.client.TestConnectionUtils
Tests run: 1, Failures: 0, Errors: 0, Skipped: 0, Time elapsed: 0.671 sec - in org.apache.hadoop.hbase.client.TestConnectionUtils
Running org.apache.hadoop.hbase.client.TestIntraRowPagination
Tests run: 1, Failures: 0, Errors: 0, Skipped: 0, Time elapsed: 3.496 sec - in org.apache.hadoop.hbase.client.TestIntraRowPagination
Running org.apache.hadoop.hbase.client.TestResult
Tests run: 7, Failures: 0, Errors: 0, Skipped: 0, Time elapsed: 1.484 sec - in org.apache.hadoop.hbase.client.TestResult
Running org.apache.hadoop.hbase.client.TestHBaseAdminNoCluster
Tests run: 1, Failures: 0, Errors: 0, Skipped: 0, Time elapsed: 4.459 sec - in org.apache.hadoop.hbase.client.TestHBaseAdminNoCluster
Running org.apache.hadoop.hbase.protobuf.TestProtobufUtil
Tests run: 7, Failures: 0, Errors: 0, Skipped: 0, Time elapsed: 3.165 sec - in org.apache.hadoop.hbase.protobuf.TestProtobufUtil
Running org.apache.hadoop.hbase.protobuf.TestReplicationProtobuf
Tests run: 1, Failures: 0, Errors: 0, Skipped: 0, Time elapsed: 0.795 sec - in org.apache.hadoop.hbase.protobuf.TestReplicationProtobuf
Running org.apache.hadoop.hbase.procedure.TestProcedureMember
Tests run: 8, Failures: 0, Errors: 0, Skipped: 0, Time elapsed: 2.207 sec - in org.apache.hadoop.hbase.procedure.TestProcedureMember
Running org.apache.hadoop.hbase.procedure.TestProcedureManager
Tests run: 1, Failures: 0, Errors: 0, Skipped: 0, Time elapsed: 1.703 sec - in org.apache.hadoop.hbase.procedure.TestProcedureManager
Running org.apache.hadoop.hbase.procedure.TestProcedure
Tests run: 4, Failures: 0, Errors: 0, Skipped: 0, Time elapsed: 2.325 sec - in org.apache.hadoop.hbase.procedure.TestProcedure
Running org.apache.hadoop.hbase.procedure.TestProcedureCoordinator
Tests run: 7, Failures: 0, Errors: 0, Skipped: 0, Time elapsed: 1.821 sec - in org.apache.hadoop.hbase.procedure.TestProcedureCoordinator
Running org.apache.hadoop.hbase.constraint.TestConstraints
Tests run: 6, Failures: 0, Errors: 0, Skipped: 0, Time elapsed: 3.149 sec - in org.apache.hadoop.hbase.constraint.TestConstraints
Running org.apache.hadoop.hbase.rest.TestGZIPResponseWrapper
Tests run: 4, Failures: 0, Errors: 0, Skipped: 0, Time elapsed: 1.246 sec - in org.apache.hadoop.hbase.rest.TestGZIPResponseWrapper
Running org.apache.hadoop.hbase.rest.client.TestRemoteAdminRetries
Tests run: 7, Failures: 0, Errors: 0, Skipped: 0, Time elapsed: 2.741 sec - in org.apache.hadoop.hbase.rest.client.TestRemoteAdminRetries
Running org.apache.hadoop.hbase.rest.client.TestRemoteHTableRetries
Tests run: 7, Failures: 0, Errors: 0, Skipped: 0, Time elapsed: 2.701 sec - in org.apache.hadoop.hbase.rest.client.TestRemoteHTableRetries
Running org.apache.hadoop.hbase.rest.model.TestVersionModel
Tests run: 6, Failures: 0, Errors: 0, Skipped: 0, Time elapsed: 1.347 sec - in org.apache.hadoop.hbase.rest.model.TestVersionModel
Running org.apache.hadoop.hbase.rest.model.TestStorageClusterVersionModel
Tests run: 6, Failures: 0, Errors: 0, Skipped: 0, Time elapsed: 1.487 sec - in org.apache.hadoop.hbase.rest.model.TestStorageClusterVersionModel
Running org.apache.hadoop.hbase.rest.model.TestColumnSchemaModel
Tests run: 6, Failures: 0, Errors: 0, Skipped: 0, Time elapsed: 1.356 sec - in org.apache.hadoop.hbase.rest.model.TestColumnSchemaModel
Running org.apache.hadoop.hbase.rest.model.TestCellModel
Tests run: 6, Failures: 0, Errors: 0, Skipped: 0, Time elapsed: 1.371 sec - in org.apache.hadoop.hbase.rest.model.TestCellModel
Running org.apache.hadoop.hbase.rest.model.TestTableListModel
Tests run: 6, Failures: 0, Errors: 0, Skipped: 0, Time elapsed: 1.645 sec - in org.apache.hadoop.hbase.rest.model.TestTableListModel
Running org.apache.hadoop.hbase.rest.model.TestStorageClusterStatusModel
Tests run: 6, Failures: 0, Errors: 0, Skipped: 0, Time elapsed: 1.984 sec - in org.apache.hadoop.hbase.rest.model.TestStorageClusterStatusModel
Running org.apache.hadoop.hbase.rest.model.TestScannerModel
Tests run: 6, Failures: 0, Errors: 0, Skipped: 0, Time elapsed: 1.66 sec - in org.apache.hadoop.hbase.rest.model.TestScannerModel
Running org.apache.hadoop.hbase.rest.model.TestTableSchemaModel
Tests run: 6, Failures: 0, Errors: 0, Skipped: 0, Time elapsed: 1.657 sec - in org.apache.hadoop.hbase.rest.model.TestTableSchemaModel
Running org.apache.hadoop.hbase.rest.model.TestTableInfoModel
Tests run: 6, Failures: 0, Errors: 0, Skipped: 0, Time elapsed: 1.399 sec - in org.apache.hadoop.hbase.rest.model.TestTableInfoModel
Running org.apache.hadoop.hbase.rest.model.TestTableRegionModel
Tests run: 8, Failures: 0, Errors: 0, Skipped: 0, Time elapsed: 1.728 sec - in org.apache.hadoop.hbase.rest.model.TestTableRegionModel
Running org.apache.hadoop.hbase.rest.model.TestRowModel
Tests run: 6, Failures: 0, Errors: 0, Skipped: 0, Time elapsed: 1.13 sec - in org.apache.hadoop.hbase.rest.model.TestRowModel
Running org.apache.hadoop.hbase.rest.model.TestCellSetModel
Tests run: 6, Failures: 0, Errors: 0, Skipped: 0, Time elapsed: 1.696 sec - in org.apache.hadoop.hbase.rest.model.TestCellSetModel
Running org.apache.hadoop.hbase.TestHTableDescriptor
Tests run: 11, Failures: 0, Errors: 0, Skipped: 0, Time elapsed: 3.362 sec - in org.apache.hadoop.hbase.TestHTableDescriptor
Running org.apache.hadoop.hbase.snapshot.TestRestoreSnapshotHelper
Tests run: 1, Failures: 0, Errors: 0, Skipped: 0, Time elapsed: 5.534 sec - in org.apache.hadoop.hbase.snapshot.TestRestoreSnapshotHelper
Running org.apache.hadoop.hbase.coprocessor.TestRegionObserverStacking
Tests run: 1, Failures: 0, Errors: 0, Skipped: 0, Time elapsed: 3.255 sec - in org.apache.hadoop.hbase.coprocessor.TestRegionObserverStacking
Running org.apache.hadoop.hbase.coprocessor.TestCoprocessorInterface
Tests run: 2, Failures: 0, Errors: 0, Skipped: 0, Time elapsed: 20.231 sec - in org.apache.hadoop.hbase.coprocessor.TestCoprocessorInterface
Running org.apache.hadoop.hbase.executor.TestExecutorService
Tests run: 1, Failures: 0, Errors: 0, Skipped: 0, Time elapsed: 3.153 sec - in org.apache.hadoop.hbase.executor.TestExecutorService
Running org.apache.hadoop.hbase.zookeeper.TestZooKeeperMainServer
Tests run: 2, Failures: 0, Errors: 0, Skipped: 0, Time elapsed: 2.614 sec - in org.apache.hadoop.hbase.zookeeper.TestZooKeeperMainServer
Running org.apache.hadoop.hbase.zookeeper.TestZKConfig
Tests run: 1, Failures: 0, Errors: 0, Skipped: 0, Time elapsed: 1.159 sec - in org.apache.hadoop.hbase.zookeeper.TestZKConfig
Running org.apache.hadoop.hbase.metrics.TestMetricsHistogram
Tests run: 3, Failures: 0, Errors: 0, Skipped: 0, Time elapsed: 1.916 sec - in org.apache.hadoop.hbase.metrics.TestMetricsHistogram
Running org.apache.hadoop.hbase.TestHColumnDescriptor
Tests run: 3, Failures: 0, Errors: 0, Skipped: 0, Time elapsed: 2.997 sec - in org.apache.hadoop.hbase.TestHColumnDescriptor
Running org.apache.hadoop.hbase.monitoring.TestMemoryBoundedLogMessageBuffer
Tests run: 2, Failures: 0, Errors: 0, Skipped: 0, Time elapsed: 0.777 sec - in org.apache.hadoop.hbase.monitoring.TestMemoryBoundedLogMessageBuffer
Running org.apache.hadoop.hbase.monitoring.TestTaskMonitor
Tests run: 3, Failures: 0, Errors: 0, Skipped: 0, Time elapsed: 1.799 sec - in org.apache.hadoop.hbase.monitoring.TestTaskMonitor
Results :
Tests run: 912, Failures: 0, Errors: 0, Skipped: 7
[INFO] ------------------------------------------------------------------------
[INFO] Reactor Summary:
[INFO]
[INFO] HBase ............................................. SUCCESS [7.302s]
[INFO] HBase - Common .................................... SUCCESS [2:14.610s]
[INFO] HBase - Protocol .................................. SUCCESS [21.085s]
[INFO] HBase - Client .................................... SUCCESS [1:29.962s]
[INFO] HBase - Hadoop Compatibility ...................... SUCCESS [11.610s]
[INFO] HBase - Hadoop Two Compatibility .................. SUCCESS [15.829s]
[INFO] HBase - Prefix Tree ............................... SUCCESS [22.321s]
[INFO] HBase - Server .................................... FAILURE [28:09.541s]
[INFO] HBase - Testing Util .............................. SKIPPED
[INFO] HBase - Thrift .................................... SKIPPED
[INFO] HBase - Shell ..................................... SKIPPED
[INFO] HBase - Integration Tests ......................... SKIPPED
[INFO] HBase - Examples .................................. SKIPPED
[INFO] HBase - Assembly .................................. SKIPPED
[INFO] ------------------------------------------------------------------------
[INFO] BUILD FAILURE
[INFO] ------------------------------------------------------------------------
[INFO] Total time: 33:14.435s
[INFO] Finished at: Wed Aug 27 17:50:52 UTC 2014
[INFO] Final Memory: 64M/992M
[INFO] ------------------------------------------------------------------------
[ERROR] Failed to execute goal org.apache.maven.plugins:maven-surefire-plugin:2.17:test (default-test) on project hbase-server: ExecutionException: java.lang.RuntimeException: The forked VM terminated without properly saying goodbye. VM crash or System.exit called?
[ERROR] Command was /bin/sh -c cd <https://builds.apache.org/job/HBase-TRUNK/ws/hbase-server> && /home/jenkins/tools/java/jdk1.7.0_25-32/jre/bin/java -enableassertions -XX:MaxDirectMemorySize=1G -Xmx1900m -XX:MaxPermSize=256m -Djava.security.egd=file:/dev/./urandom -Djava.net.preferIPv4Stack=true -Djava.awt.headless=true -jar <https://builds.apache.org/job/HBase-TRUNK/ws/hbase-server/target/surefire/surefirebooter3878356272626471511.jar> <https://builds.apache.org/job/HBase-TRUNK/ws/hbase-server/target/surefire/surefire5227710500267194182tmp> <https://builds.apache.org/job/HBase-TRUNK/ws/hbase-server/target/surefire/surefire_4002558952718242312020tmp>
[ERROR] -> [Help 1]
[ERROR]
[ERROR] To see the full stack trace of the errors, re-run Maven with the -e switch.
[ERROR] Re-run Maven using the -X switch to enable full debug logging.
[ERROR]
[ERROR] For more information about the errors and possible solutions, please read the following articles:
[ERROR] [Help 1] http://cwiki.apache.org/confluence/display/MAVEN/MojoFailureException
[ERROR]
[ERROR] After correcting the problems, you can resume the build with the command
[ERROR] mvn <goals> -rf :hbase-server
Build step 'Invoke top-level Maven targets' marked build as failure
Performing Post build task...
Match found for :.* : True
Logical operation result is TRUE
Running script : ZOMBIE_TESTS_COUNT=`jps | grep surefirebooter | wc -l`
if [[ $ZOMBIE_TESTS_COUNT != 0 ]] ; then
#It seems sometimes the tests are not dying immediately. Let's give them 10s
echo "Suspicious java process found - waiting 10s to see if there are just slow to stop"
sleep 10
ZOMBIE_TESTS_COUNT=`jps | grep surefirebooter | wc -l`
if [[ $ZOMBIE_TESTS_COUNT != 0 ]] ; then
echo "There are $ZOMBIE_TESTS_COUNT zombie tests, they should have been killed by surefire but survived"
echo "************ BEGIN zombies jstack extract"
ZB_STACK=`jps | grep surefirebooter | cut -d ' ' -f 1 | xargs -n 1 jstack | grep ".test" | grep "\.java"`
jps | grep surefirebooter | cut -d ' ' -f 1 | xargs -n 1 jstack
echo "************ END zombies jstack extract"
JIRA_COMMENT="$JIRA_COMMENT
{color:red}-1 core zombie tests{color}. There are ${ZOMBIE_TESTS_COUNT} zombie test(s): ${ZB_STACK}"
BAD=1
jps | grep surefirebooter | cut -d ' ' -f 1 | xargs kill -9
else
echo "We're ok: there is no zombie test, but some tests took some time to stop"
fi
else
echo "We're ok: there is no zombie test"
fi
[HBase-TRUNK] $ /bin/bash -xe /tmp/hudson1889914333416833471.sh
++ jps
++ wc -l
++ grep surefirebooter
+ ZOMBIE_TESTS_COUNT=1
+ [[ 1 != 0 ]]
+ echo 'Suspicious java process found - waiting 10s to see if there are just slow to stop'
Suspicious java process found - waiting 10s to see if there are just slow to stop
+ sleep 10
++ jps
++ grep surefirebooter
++ wc -l
+ ZOMBIE_TESTS_COUNT=1
+ [[ 1 != 0 ]]
+ echo 'There are 1 zombie tests, they should have been killed by surefire but survived'
There are 1 zombie tests, they should have been killed by surefire but survived
+ echo '************ BEGIN zombies jstack extract'
************ BEGIN zombies jstack extract
++ cut -d ' ' -f 1
++ xargs -n 1 jstack
++ grep .test
++ grep '\.java'
++ grep surefirebooter
++ jps
+ ZB_STACK=' at org.apache.hadoop.hbase.regionserver.TestExplicitColumnTracker.testStackOverflow(TestExplicitColumnTracker.java:208)'
+ jps
+ grep surefirebooter
+ cut -d ' ' -f 1
+ xargs -n 1 jstack
1877: No such process
POST BUILD TASK : FAILURE
END OF POST BUILD TASK : 0
Archiving artifacts
Sending artifact delta relative to HBase-TRUNK #5421
Archived 890 artifacts
Archive block size is 32768
Received 8 blocks and 33442221 bytes
Compression is 0.8%
Took 37 sec
Recording test results
Updating HBASE-11788
Updating HBASE-9875
Build failed in Jenkins: HBase-TRUNK #5437
Posted by Apache Jenkins Server <je...@builds.apache.org>.
See <https://builds.apache.org/job/HBase-TRUNK/5437/changes>
Changes:
[stack] HBASE-11834 TestHRegionBusyWait.testParallelAppendWithMemStoreFlush fails sporadically
------------------------------------------
[...truncated 1794 lines...]
[ERROR] -> [Help 1]
[ERROR]
[ERROR] To see the full stack trace of the errors, re-run Maven with the -e switch.
[ERROR] Re-run Maven using the -X switch to enable full debug logging.
[ERROR]
[ERROR] For more information about the errors and possible solutions, please read the following articles:
[ERROR] [Help 1] http://cwiki.apache.org/confluence/display/MAVEN/MojoFailureException
[ERROR]
[ERROR] After correcting the problems, you can resume the build with the command
[ERROR] mvn <goals> -rf :hbase-server
Build step 'Invoke top-level Maven targets' marked build as failure
Performing Post build task...
Match found for :.* : True
Logical operation result is TRUE
Running script : ZOMBIE_TESTS_COUNT=`jps | grep surefirebooter | wc -l`
if [[ $ZOMBIE_TESTS_COUNT != 0 ]] ; then
#It seems sometimes the tests are not dying immediately. Let's give them 10s
echo "Suspicious java process found - waiting 10s to see if there are just slow to stop"
sleep 10
ZOMBIE_TESTS_COUNT=`jps | grep surefirebooter | wc -l`
if [[ $ZOMBIE_TESTS_COUNT != 0 ]] ; then
echo "There are $ZOMBIE_TESTS_COUNT zombie tests, they should have been killed by surefire but survived"
echo "************ BEGIN zombies jstack extract"
ZB_STACK=`jps | grep surefirebooter | cut -d ' ' -f 1 | xargs -n 1 jstack | grep ".test" | grep "\.java"`
jps | grep surefirebooter | cut -d ' ' -f 1 | xargs -n 1 jstack
echo "************ END zombies jstack extract"
JIRA_COMMENT="$JIRA_COMMENT
{color:red}-1 core zombie tests{color}. There are ${ZOMBIE_TESTS_COUNT} zombie test(s): ${ZB_STACK}"
BAD=1
jps | grep surefirebooter | cut -d ' ' -f 1 | xargs kill -9
else
echo "We're ok: there is no zombie test, but some tests took some time to stop"
fi
else
echo "We're ok: there is no zombie test"
fi
[HBase-TRUNK] $ /bin/bash -xe /tmp/hudson2949117261329627851.sh
++ jps
++ grep surefirebooter
++ wc -l
+ ZOMBIE_TESTS_COUNT=1
+ [[ 1 != 0 ]]
+ echo 'Suspicious java process found - waiting 10s to see if there are just slow to stop'
Suspicious java process found - waiting 10s to see if there are just slow to stop
+ sleep 10
++ jps
++ grep surefirebooter
++ wc -l
+ ZOMBIE_TESTS_COUNT=1
+ [[ 1 != 0 ]]
+ echo 'There are 1 zombie tests, they should have been killed by surefire but survived'
There are 1 zombie tests, they should have been killed by surefire but survived
+ echo '************ BEGIN zombies jstack extract'
************ BEGIN zombies jstack extract
++ jps
++ grep surefirebooter
++ grep '\.java'
++ xargs -n 1 jstack
++ grep .test
++ cut -d ' ' -f 1
+ ZB_STACK=' at org.apache.james.smtpserver.SMTPServerTest.testMaxRcpt(SMTPServerTest.java:849)'
+ jps
+ grep surefirebooter
+ cut -d ' ' -f 1
+ xargs -n 1 jstack
2014-08-27 17:12:56
Full thread dump Java HotSpot(TM) 64-Bit Server VM (20.45-b01 mixed mode):
"Attach Listener" daemon prio=10 tid=0x00007f1700001000 nid=0x48d3 waiting on condition [0x0000000000000000]
java.lang.Thread.State: RUNNABLE
"New I/O server worker #24-1" prio=10 tid=0x00007f16ac003000 nid=0x3360 runnable [0x00007f16e35f4000]
java.lang.Thread.State: RUNNABLE
at sun.nio.ch.EPollArrayWrapper.epollWait(Native Method)
at sun.nio.ch.EPollArrayWrapper.poll(EPollArrayWrapper.java:210)
at sun.nio.ch.EPollSelectorImpl.doSelect(EPollSelectorImpl.java:65)
at sun.nio.ch.SelectorImpl.lockAndDoSelect(SelectorImpl.java:69)
- locked <0x00000000f7691bb8> (a sun.nio.ch.Util$2)
- locked <0x00000000f7691ba8> (a java.util.Collections$UnmodifiableSet)
- locked <0x00000000f76919a0> (a sun.nio.ch.EPollSelectorImpl)
at sun.nio.ch.SelectorImpl.select(SelectorImpl.java:80)
at org.jboss.netty.channel.socket.nio.SelectorUtil.select(SelectorUtil.java:33)
at org.jboss.netty.channel.socket.nio.NioWorker.run(NioWorker.java:157)
at org.jboss.netty.util.ThreadRenamingRunnable.run(ThreadRenamingRunnable.java:102)
at org.jboss.netty.util.internal.DeadLockProofWorker$1.run(DeadLockProofWorker.java:42)
at java.util.concurrent.ThreadPoolExecutor$Worker.runTask(ThreadPoolExecutor.java:895)
at java.util.concurrent.ThreadPoolExecutor$Worker.run(ThreadPoolExecutor.java:918)
at java.lang.Thread.run(Thread.java:662)
"Hashed wheel timer #24" prio=10 tid=0x00007f16ac001000 nid=0x335e waiting on condition [0x00007f16e2eed000]
java.lang.Thread.State: TIMED_WAITING (sleeping)
at java.lang.Thread.sleep(Native Method)
at org.jboss.netty.util.HashedWheelTimer$Worker.waitForNextTick(HashedWheelTimer.java:455)
at org.jboss.netty.util.HashedWheelTimer$Worker.run(HashedWheelTimer.java:372)
at org.jboss.netty.util.ThreadRenamingRunnable.run(ThreadRenamingRunnable.java:102)
at java.lang.Thread.run(Thread.java:662)
"New I/O server boss #24 ([id: 0x6f03fcaa, /127.0.0.1:8024])" prio=10 tid=0x00007f1744476000 nid=0x335d runnable [0x00007f17401c3000]
java.lang.Thread.State: RUNNABLE
at sun.nio.ch.EPollArrayWrapper.epollWait(Native Method)
at sun.nio.ch.EPollArrayWrapper.poll(EPollArrayWrapper.java:210)
at sun.nio.ch.EPollSelectorImpl.doSelect(EPollSelectorImpl.java:65)
at sun.nio.ch.SelectorImpl.lockAndDoSelect(SelectorImpl.java:69)
- locked <0x00000000f764de00> (a sun.nio.ch.Util$2)
- locked <0x00000000f764ddf0> (a java.util.Collections$UnmodifiableSet)
- locked <0x00000000f764dbe8> (a sun.nio.ch.EPollSelectorImpl)
at sun.nio.ch.SelectorImpl.select(SelectorImpl.java:80)
at org.jboss.netty.channel.socket.nio.NioServerSocketPipelineSink$Boss.run(NioServerSocketPipelineSink.java:232)
at org.jboss.netty.util.ThreadRenamingRunnable.run(ThreadRenamingRunnable.java:102)
at org.jboss.netty.util.internal.DeadLockProofWorker$1.run(DeadLockProofWorker.java:42)
at java.util.concurrent.ThreadPoolExecutor$Worker.runTask(ThreadPoolExecutor.java:895)
at java.util.concurrent.ThreadPoolExecutor$Worker.run(ThreadPoolExecutor.java:918)
at java.lang.Thread.run(Thread.java:662)
"Low Memory Detector" daemon prio=10 tid=0x00007f17440c9000 nid=0x316b runnable [0x0000000000000000]
java.lang.Thread.State: RUNNABLE
"C2 CompilerThread1" daemon prio=10 tid=0x00007f17440c6800 nid=0x316a waiting on condition [0x0000000000000000]
java.lang.Thread.State: RUNNABLE
"C2 CompilerThread0" daemon prio=10 tid=0x00007f17440c3800 nid=0x3169 waiting on condition [0x0000000000000000]
java.lang.Thread.State: RUNNABLE
"Signal Dispatcher" daemon prio=10 tid=0x00007f17440c1800 nid=0x3168 runnable [0x0000000000000000]
java.lang.Thread.State: RUNNABLE
"Finalizer" daemon prio=10 tid=0x00007f17440a6800 nid=0x3167 in Object.wait() [0x00007f1740bfa000]
java.lang.Thread.State: WAITING (on object monitor)
at java.lang.Object.wait(Native Method)
- waiting on <0x00000000f95882e8> (a java.lang.ref.ReferenceQueue$Lock)
at java.lang.ref.ReferenceQueue.remove(ReferenceQueue.java:118)
- locked <0x00000000f95882e8> (a java.lang.ref.ReferenceQueue$Lock)
at java.lang.ref.ReferenceQueue.remove(ReferenceQueue.java:134)
at java.lang.ref.Finalizer$FinalizerThread.run(Finalizer.java:171)
"Reference Handler" daemon prio=10 tid=0x00007f17440a4800 nid=0x3166 in Object.wait() [0x00007f1740cfb000]
java.lang.Thread.State: WAITING (on object monitor)
at java.lang.Object.wait(Native Method)
- waiting on <0x00000000f9580070> (a java.lang.ref.Reference$Lock)
at java.lang.Object.wait(Object.java:485)
at java.lang.ref.Reference$ReferenceHandler.run(Reference.java:116)
- locked <0x00000000f9580070> (a java.lang.ref.Reference$Lock)
"main" prio=10 tid=0x00007f1744007800 nid=0x3157 runnable [0x00007f174ac11000]
java.lang.Thread.State: RUNNABLE
at java.net.SocketInputStream.socketRead0(Native Method)
at java.net.SocketInputStream.read(SocketInputStream.java:129)
at sun.nio.cs.StreamDecoder.readBytes(StreamDecoder.java:264)
at sun.nio.cs.StreamDecoder.implRead(StreamDecoder.java:306)
at sun.nio.cs.StreamDecoder.read(StreamDecoder.java:158)
- locked <0x00000000f765d510> (a java.io.InputStreamReader)
at java.io.InputStreamReader.read(InputStreamReader.java:167)
at java.io.BufferedReader.fill(BufferedReader.java:136)
at java.io.BufferedReader.read(BufferedReader.java:157)
- locked <0x00000000f765d510> (a java.io.InputStreamReader)
at org.apache.commons.net.io.CRLFLineReader.readLine(CRLFLineReader.java:58)
- locked <0x00000000f765d510> (a java.io.InputStreamReader)
at org.apache.commons.net.smtp.SMTP.__getReply(SMTP.java:196)
at org.apache.commons.net.smtp.SMTP.__sendCommand(SMTP.java:171)
at org.apache.commons.net.smtp.SMTP.__sendCommand(SMTP.java:186)
at org.apache.commons.net.smtp.SMTP.rcpt(SMTP.java:529)
at org.apache.commons.net.smtp.SMTPClient.addRecipient(SMTPClient.java:316)
at org.apache.james.smtpserver.SMTPServerTest.testMaxRcpt(SMTPServerTest.java:849)
at sun.reflect.NativeMethodAccessorImpl.invoke0(Native Method)
at sun.reflect.NativeMethodAccessorImpl.invoke(NativeMethodAccessorImpl.java:39)
at sun.reflect.DelegatingMethodAccessorImpl.invoke(DelegatingMethodAccessorImpl.java:25)
at java.lang.reflect.Method.invoke(Method.java:597)
at org.junit.runners.model.FrameworkMethod$1.runReflectiveCall(FrameworkMethod.java:47)
at org.junit.internal.runners.model.ReflectiveCallable.run(ReflectiveCallable.java:12)
at org.junit.runners.model.FrameworkMethod.invokeExplosively(FrameworkMethod.java:44)
at org.junit.internal.runners.statements.InvokeMethod.evaluate(InvokeMethod.java:17)
at org.junit.internal.runners.statements.RunBefores.evaluate(RunBefores.java:26)
at org.junit.internal.runners.statements.RunAfters.evaluate(RunAfters.java:27)
at org.junit.runners.ParentRunner.runLeaf(ParentRunner.java:271)
at org.junit.runners.BlockJUnit4ClassRunner.runChild(BlockJUnit4ClassRunner.java:70)
at org.junit.runners.BlockJUnit4ClassRunner.runChild(BlockJUnit4ClassRunner.java:50)
at org.junit.runners.ParentRunner$3.run(ParentRunner.java:238)
at org.junit.runners.ParentRunner$1.schedule(ParentRunner.java:63)
at org.junit.runners.ParentRunner.runChildren(ParentRunner.java:236)
at org.junit.runners.ParentRunner.access$000(ParentRunner.java:53)
at org.junit.runners.ParentRunner$2.evaluate(ParentRunner.java:229)
at org.junit.runners.ParentRunner.run(ParentRunner.java:309)
at org.apache.maven.surefire.junit4.JUnit4Provider.execute(JUnit4Provider.java:264)
at org.apache.maven.surefire.junit4.JUnit4Provider.executeTestSet(JUnit4Provider.java:153)
at org.apache.maven.surefire.junit4.JUnit4Provider.invoke(JUnit4Provider.java:124)
at sun.reflect.NativeMethodAccessorImpl.invoke0(Native Method)
at sun.reflect.NativeMethodAccessorImpl.invoke(NativeMethodAccessorImpl.java:39)
at sun.reflect.DelegatingMethodAccessorImpl.invoke(DelegatingMethodAccessorImpl.java:25)
at java.lang.reflect.Method.invoke(Method.java:597)
at org.apache.maven.surefire.util.ReflectionUtils.invokeMethodWithArray2(ReflectionUtils.java:208)
at org.apache.maven.surefire.booter.ProviderFactory$ProviderProxy.invoke(ProviderFactory.java:158)
at org.apache.maven.surefire.booter.ProviderFactory.invokeProvider(ProviderFactory.java:86)
at org.apache.maven.surefire.booter.ForkedBooter.runSuitesInProcess(ForkedBooter.java:153)
at org.apache.maven.surefire.booter.ForkedBooter.main(ForkedBooter.java:95)
"VM Thread" prio=10 tid=0x00007f174409e000 nid=0x3165 runnable
"GC task thread#0 (ParallelGC)" prio=10 tid=0x00007f174401a800 nid=0x3158 runnable
"GC task thread#1 (ParallelGC)" prio=10 tid=0x00007f174401c800 nid=0x3159 runnable
"GC task thread#2 (ParallelGC)" prio=10 tid=0x00007f174401e800 nid=0x315a runnable
"GC task thread#3 (ParallelGC)" prio=10 tid=0x00007f1744020000 nid=0x315b runnable
"GC task thread#4 (ParallelGC)" prio=10 tid=0x00007f1744022000 nid=0x315c runnable
"GC task thread#5 (ParallelGC)" prio=10 tid=0x00007f1744024000 nid=0x315d runnable
"GC task thread#6 (ParallelGC)" prio=10 tid=0x00007f1744025800 nid=0x315e runnable
"GC task thread#7 (ParallelGC)" prio=10 tid=0x00007f1744027800 nid=0x315f runnable
"GC task thread#8 (ParallelGC)" prio=10 tid=0x00007f1744029800 nid=0x3160 runnable
"GC task thread#9 (ParallelGC)" prio=10 tid=0x00007f174402b000 nid=0x3161 runnable
"GC task thread#10 (ParallelGC)" prio=10 tid=0x00007f174402d000 nid=0x3162 runnable
"GC task thread#11 (ParallelGC)" prio=10 tid=0x00007f174402f000 nid=0x3163 runnable
"GC task thread#12 (ParallelGC)" prio=10 tid=0x00007f1744030800 nid=0x3164 runnable
"VM Periodic Task Thread" prio=10 tid=0x00007f17440db800 nid=0x316c waiting on condition
JNI global references: 1564
+ echo '************ END zombies jstack extract'
************ END zombies jstack extract
+ JIRA_COMMENT='
{color:red}-1 core zombie tests{color}. There are 1 zombie test(s): at org.apache.james.smtpserver.SMTPServerTest.testMaxRcpt(SMTPServerTest.java:849)'
+ BAD=1
+ jps
+ grep surefirebooter
+ cut -d ' ' -f 1
+ xargs kill -9
POST BUILD TASK : SUCCESS
END OF POST BUILD TASK : 0
Archiving artifacts
Sending artifact delta relative to HBase-TRUNK #5421
Archived 1783 artifacts
Archive block size is 32768
Received 76 blocks and 556941395 bytes
Compression is 0.4%
Took 2 min 51 sec
Recording test results
Updating HBASE-11834
Build failed in Jenkins: HBase-TRUNK #5436
Posted by Apache Jenkins Server <je...@builds.apache.org>.
See <https://builds.apache.org/job/HBase-TRUNK/5436/changes>
Changes:
[ramkrishna] HBASE-11440 Make KeyValueCodecWithTags as the default codec for
[anoopsamjohn] HBASE-11820 ReplicationSource : Set replication codec class as RPC codec class on a clonned Configuration.
------------------------------------------
[...truncated 16448 lines...]
- locked <0x80c86918> (a java.util.Collections$UnmodifiableSet)
- locked <0x80c86510> (a sun.nio.ch.EPollSelectorImpl)
at sun.nio.ch.SelectorImpl.select(SelectorImpl.java:98)
at sun.nio.ch.SelectorImpl.select(SelectorImpl.java:102)
at org.apache.hadoop.ipc.Server$Listener.run(Server.java:668)
"IPC Server Responder" daemon prio=10 tid=0x60b23400 nid=0x296f runnable [0x6345c000]
java.lang.Thread.State: RUNNABLE
at sun.nio.ch.EPollArrayWrapper.epollWait(Native Method)
at sun.nio.ch.EPollArrayWrapper.poll(EPollArrayWrapper.java:228)
at sun.nio.ch.EPollSelectorImpl.doSelect(EPollSelectorImpl.java:81)
at sun.nio.ch.SelectorImpl.lockAndDoSelect(SelectorImpl.java:87)
- locked <0x80c87310> (a sun.nio.ch.Util$2)
- locked <0x80c87300> (a java.util.Collections$UnmodifiableSet)
- locked <0x80c87100> (a sun.nio.ch.EPollSelectorImpl)
at sun.nio.ch.SelectorImpl.select(SelectorImpl.java:98)
at org.apache.hadoop.ipc.Server$Responder.doRunLoop(Server.java:835)
at org.apache.hadoop.ipc.Server$Responder.run(Server.java:818)
"org.apache.hadoop.hdfs.server.blockmanagement.BlockManager$ReplicationMonitor@1bea2fb" daemon prio=10 tid=0x6110ec00 nid=0x293e waiting on condition [0x62cfe000]
java.lang.Thread.State: TIMED_WAITING (sleeping)
at java.lang.Thread.sleep(Native Method)
at org.apache.hadoop.hdfs.server.blockmanagement.BlockManager$ReplicationMonitor.run(BlockManager.java:3336)
at java.lang.Thread.run(Thread.java:724)
"org.apache.hadoop.hdfs.server.blockmanagement.HeartbeatManager$Monitor@be11bc" daemon prio=10 tid=0x6110d400 nid=0x293d waiting on condition [0x62e5c000]
java.lang.Thread.State: TIMED_WAITING (sleeping)
at java.lang.Thread.sleep(Native Method)
at org.apache.hadoop.hdfs.server.blockmanagement.HeartbeatManager$Monitor.run(HeartbeatManager.java:307)
at java.lang.Thread.run(Thread.java:724)
"org.apache.hadoop.hdfs.server.blockmanagement.DecommissionManager$Monitor@e464e" daemon prio=10 tid=0x6110b800 nid=0x293b waiting on condition [0x62ead000]
java.lang.Thread.State: TIMED_WAITING (sleeping)
at java.lang.Thread.sleep(Native Method)
at org.apache.hadoop.hdfs.server.blockmanagement.DecommissionManager$Monitor.run(DecommissionManager.java:76)
at java.lang.Thread.run(Thread.java:724)
"org.apache.hadoop.hdfs.server.blockmanagement.PendingReplicationBlocks$PendingReplicationMonitor@101b67a" daemon prio=10 tid=0x61109c00 nid=0x2939 waiting on condition [0x62efe000]
java.lang.Thread.State: TIMED_WAITING (sleeping)
at java.lang.Thread.sleep(Native Method)
at org.apache.hadoop.hdfs.server.blockmanagement.PendingReplicationBlocks$PendingReplicationMonitor.run(PendingReplicationBlocks.java:221)
at java.lang.Thread.run(Thread.java:724)
"org.apache.hadoop.util.JvmPauseMonitor$Monitor@64d330" daemon prio=10 tid=0x61102400 nid=0x2923 waiting on condition [0x634fe000]
java.lang.Thread.State: TIMED_WAITING (sleeping)
at java.lang.Thread.sleep(Native Method)
at org.apache.hadoop.util.JvmPauseMonitor$Monitor.run(JvmPauseMonitor.java:161)
at java.lang.Thread.run(Thread.java:724)
"IPC Server idle connection scanner for port 58895" daemon prio=10 tid=0x62b0dc00 nid=0x2916 in Object.wait() [0x6385c000]
java.lang.Thread.State: TIMED_WAITING (on object monitor)
at java.lang.Object.wait(Native Method)
at java.util.TimerThread.mainLoop(Timer.java:552)
- locked <0x80c85e80> (a java.util.TaskQueue)
at java.util.TimerThread.run(Timer.java:505)
"Socket Reader #1 for port 58895" prio=10 tid=0x637f6400 nid=0x2914 runnable [0x638ad000]
java.lang.Thread.State: RUNNABLE
at sun.nio.ch.EPollArrayWrapper.epollWait(Native Method)
at sun.nio.ch.EPollArrayWrapper.poll(EPollArrayWrapper.java:228)
at sun.nio.ch.EPollSelectorImpl.doSelect(EPollSelectorImpl.java:81)
at sun.nio.ch.SelectorImpl.lockAndDoSelect(SelectorImpl.java:87)
- locked <0x80c85858> (a sun.nio.ch.Util$2)
- locked <0x80c85848> (a java.util.Collections$UnmodifiableSet)
- locked <0x80c83f38> (a sun.nio.ch.EPollSelectorImpl)
at sun.nio.ch.SelectorImpl.select(SelectorImpl.java:98)
at sun.nio.ch.SelectorImpl.select(SelectorImpl.java:102)
at org.apache.hadoop.ipc.Server$Listener$Reader.doRunLoop(Server.java:616)
- locked <0x80c86af8> (a org.apache.hadoop.ipc.Server$Listener$Reader)
at org.apache.hadoop.ipc.Server$Listener$Reader.run(Server.java:595)
"Timer-0" daemon prio=10 tid=0x60dbd800 nid=0x27e8 in Object.wait() [0x638fe000]
java.lang.Thread.State: TIMED_WAITING (on object monitor)
at java.lang.Object.wait(Native Method)
at java.util.TimerThread.mainLoop(Timer.java:552)
- locked <0x7fd8d160> (a java.util.TaskQueue)
at java.util.TimerThread.run(Timer.java:505)
"23103054@qtp-17776654-1 - Acceptor0 SelectChannelConnector@localhost:52486" daemon prio=10 tid=0x60da0400 nid=0x27aa runnable [0x6437d000]
java.lang.Thread.State: RUNNABLE
at sun.nio.ch.EPollArrayWrapper.epollWait(Native Method)
at sun.nio.ch.EPollArrayWrapper.poll(EPollArrayWrapper.java:228)
at sun.nio.ch.EPollSelectorImpl.doSelect(EPollSelectorImpl.java:81)
at sun.nio.ch.SelectorImpl.lockAndDoSelect(SelectorImpl.java:87)
- locked <0x7fd83b40> (a sun.nio.ch.Util$2)
- locked <0x7fd83b30> (a java.util.Collections$UnmodifiableSet)
- locked <0x7fd83730> (a sun.nio.ch.EPollSelectorImpl)
at sun.nio.ch.SelectorImpl.select(SelectorImpl.java:98)
at org.mortbay.io.nio.SelectorManager$SelectSet.doSelect(SelectorManager.java:498)
at org.mortbay.io.nio.SelectorManager.doSelect(SelectorManager.java:192)
at org.mortbay.jetty.nio.SelectChannelConnector.accept(SelectChannelConnector.java:124)
at org.mortbay.jetty.AbstractConnector$Acceptor.run(AbstractConnector.java:708)
at org.mortbay.thread.QueuedThreadPool$PoolThread.run(QueuedThreadPool.java:582)
"31216000@qtp-17776654-0" daemon prio=10 tid=0x60d9fc00 nid=0x27a9 in Object.wait() [0x6477d000]
java.lang.Thread.State: TIMED_WAITING (on object monitor)
at java.lang.Object.wait(Native Method)
at org.mortbay.thread.QueuedThreadPool$PoolThread.run(QueuedThreadPool.java:626)
- locked <0x7fd83d18> (a org.mortbay.thread.QueuedThreadPool$PoolThread)
"Timer for 'NameNode' metrics system" daemon prio=10 tid=0x60d4c000 nid=0x273f in Object.wait() [0x6457d000]
java.lang.Thread.State: TIMED_WAITING (on object monitor)
at java.lang.Object.wait(Native Method)
at java.util.TimerThread.mainLoop(Timer.java:552)
- locked <0x7fd75d78> (a java.util.TaskQueue)
at java.util.TimerThread.run(Timer.java:505)
"Service Thread" daemon prio=10 tid=0x64df7400 nid=0x22f4 runnable [0x00000000]
java.lang.Thread.State: RUNNABLE
"C2 CompilerThread1" daemon prio=10 tid=0x64df5400 nid=0x22f1 waiting on condition [0x00000000]
java.lang.Thread.State: RUNNABLE
"C2 CompilerThread0" daemon prio=10 tid=0x64df3400 nid=0x22f0 waiting on condition [0x00000000]
java.lang.Thread.State: RUNNABLE
"Signal Dispatcher" daemon prio=10 tid=0x64df1c00 nid=0x22ef runnable [0x00000000]
java.lang.Thread.State: RUNNABLE
"Finalizer" daemon prio=10 tid=0x64db7400 nid=0x22ec in Object.wait() [0x6bd7d000]
java.lang.Thread.State: WAITING (on object monitor)
at java.lang.Object.wait(Native Method)
- waiting on <0x7cb06220> (a java.lang.ref.ReferenceQueue$Lock)
at java.lang.ref.ReferenceQueue.remove(ReferenceQueue.java:135)
- locked <0x7cb06220> (a java.lang.ref.ReferenceQueue$Lock)
at java.lang.ref.ReferenceQueue.remove(ReferenceQueue.java:151)
at java.lang.ref.Finalizer$FinalizerThread.run(Finalizer.java:189)
"Reference Handler" daemon prio=10 tid=0x64db5400 nid=0x22eb in Object.wait() [0x6c07d000]
java.lang.Thread.State: WAITING (on object monitor)
at java.lang.Object.wait(Native Method)
at java.lang.Object.wait(Object.java:503)
at java.lang.ref.Reference$ReferenceHandler.run(Reference.java:133)
- locked <0x7cb05c50> (a java.lang.ref.Reference$Lock)
"main" prio=10 tid=0xf6706c00 nid=0x22d2 waiting on condition [0xf693e000]
java.lang.Thread.State: TIMED_WAITING (sleeping)
at java.lang.Thread.sleep(Native Method)
at org.apache.hadoop.util.ThreadUtil.sleepAtLeastIgnoreInterrupts(ThreadUtil.java:43)
at org.apache.hadoop.io.retry.RetryInvocationHandler.invoke(RetryInvocationHandler.java:154)
at com.sun.proxy.$Proxy89.getNewApplication(Unknown Source)
at org.apache.hadoop.yarn.client.api.impl.YarnClientImpl.getNewApplication(YarnClientImpl.java:165)
at org.apache.hadoop.yarn.client.api.impl.YarnClientImpl.createApplication(YarnClientImpl.java:173)
at org.apache.hadoop.mapred.ResourceMgrDelegate.getNewJobID(ResourceMgrDelegate.java:179)
at org.apache.hadoop.mapred.YARNRunner.getNewJobID(YARNRunner.java:230)
at org.apache.hadoop.mapreduce.JobSubmitter.submitJobInternal(JobSubmitter.java:357)
at org.apache.hadoop.mapreduce.Job$10.run(Job.java:1285)
at org.apache.hadoop.mapreduce.Job$10.run(Job.java:1282)
at java.security.AccessController.doPrivileged(Native Method)
at javax.security.auth.Subject.doAs(Subject.java:415)
at org.apache.hadoop.security.UserGroupInformation.doAs(UserGroupInformation.java:1548)
at org.apache.hadoop.mapreduce.Job.submit(Job.java:1282)
at org.apache.hadoop.mapreduce.Job.waitForCompletion(Job.java:1303)
at org.apache.hadoop.hbase.mapreduce.ImportTsv.run(ImportTsv.java:613)
at org.apache.hadoop.util.ToolRunner.run(ToolRunner.java:70)
at org.apache.hadoop.hbase.mapreduce.TestImportTSVWithOperationAttributes.doMROnTableTest(TestImportTSVWithOperationAttributes.java:175)
at org.apache.hadoop.hbase.mapreduce.TestImportTSVWithOperationAttributes.testMROnTableWithInvalidOperationAttr(TestImportTSVWithOperationAttributes.java:137)
at sun.reflect.NativeMethodAccessorImpl.invoke0(Native Method)
at sun.reflect.NativeMethodAccessorImpl.invoke(NativeMethodAccessorImpl.java:57)
at sun.reflect.DelegatingMethodAccessorImpl.invoke(DelegatingMethodAccessorImpl.java:43)
at java.lang.reflect.Method.invoke(Method.java:606)
at org.junit.runners.model.FrameworkMethod$1.runReflectiveCall(FrameworkMethod.java:47)
at org.junit.internal.runners.model.ReflectiveCallable.run(ReflectiveCallable.java:12)
at org.junit.runners.model.FrameworkMethod.invokeExplosively(FrameworkMethod.java:44)
at org.junit.internal.runners.statements.InvokeMethod.evaluate(InvokeMethod.java:17)
at org.junit.runners.ParentRunner.runLeaf(ParentRunner.java:271)
at org.junit.runners.BlockJUnit4ClassRunner.runChild(BlockJUnit4ClassRunner.java:70)
at org.junit.runners.BlockJUnit4ClassRunner.runChild(BlockJUnit4ClassRunner.java:50)
at org.junit.runners.ParentRunner$3.run(ParentRunner.java:238)
at org.junit.runners.ParentRunner$1.schedule(ParentRunner.java:63)
at org.junit.runners.ParentRunner.runChildren(ParentRunner.java:236)
at org.junit.runners.ParentRunner.access$000(ParentRunner.java:53)
at org.junit.runners.ParentRunner$2.evaluate(ParentRunner.java:229)
at org.junit.internal.runners.statements.RunBefores.evaluate(RunBefores.java:26)
at org.junit.internal.runners.statements.RunAfters.evaluate(RunAfters.java:27)
at org.junit.runners.ParentRunner.run(ParentRunner.java:309)
at org.junit.runners.Suite.runChild(Suite.java:127)
at org.junit.runners.Suite.runChild(Suite.java:26)
at org.junit.runners.ParentRunner$3.run(ParentRunner.java:238)
at org.junit.runners.ParentRunner$1.schedule(ParentRunner.java:63)
at org.junit.runners.ParentRunner.runChildren(ParentRunner.java:236)
at org.junit.runners.ParentRunner.access$000(ParentRunner.java:53)
at org.junit.runners.ParentRunner$2.evaluate(ParentRunner.java:229)
at org.junit.runners.ParentRunner.run(ParentRunner.java:309)
at org.junit.runner.JUnitCore.run(JUnitCore.java:160)
at org.junit.runner.JUnitCore.run(JUnitCore.java:138)
at org.apache.maven.surefire.junitcore.JUnitCoreWrapper.createRequestAndRun(JUnitCoreWrapper.java:113)
at org.apache.maven.surefire.junitcore.JUnitCoreWrapper.executeEager(JUnitCoreWrapper.java:85)
at org.apache.maven.surefire.junitcore.JUnitCoreWrapper.execute(JUnitCoreWrapper.java:54)
at org.apache.maven.surefire.junitcore.JUnitCoreProvider.invoke(JUnitCoreProvider.java:134)
at org.apache.maven.surefire.booter.ForkedBooter.invokeProviderInSameClassLoader(ForkedBooter.java:200)
at org.apache.maven.surefire.booter.ForkedBooter.runSuitesInProcess(ForkedBooter.java:153)
at org.apache.maven.surefire.booter.ForkedBooter.main(ForkedBooter.java:103)
"VM Thread" prio=10 tid=0x64cf8c00 nid=0x22ea runnable
"GC task thread#0 (ParallelGC)" prio=10 tid=0xf6710c00 nid=0x22d5 runnable
"GC task thread#1 (ParallelGC)" prio=10 tid=0xf6712000 nid=0x22d7 runnable
"GC task thread#2 (ParallelGC)" prio=10 tid=0xf6713800 nid=0x22d8 runnable
"GC task thread#3 (ParallelGC)" prio=10 tid=0xf6715000 nid=0x22d9 runnable
"GC task thread#4 (ParallelGC)" prio=10 tid=0xf6716800 nid=0x22dc runnable
"GC task thread#5 (ParallelGC)" prio=10 tid=0xf6717c00 nid=0x22dd runnable
"GC task thread#6 (ParallelGC)" prio=10 tid=0xf6719400 nid=0x22de runnable
"GC task thread#7 (ParallelGC)" prio=10 tid=0xf671ac00 nid=0x22df runnable
"GC task thread#8 (ParallelGC)" prio=10 tid=0xf671c000 nid=0x22e1 runnable
"GC task thread#9 (ParallelGC)" prio=10 tid=0xf671d800 nid=0x22e2 runnable
"GC task thread#10 (ParallelGC)" prio=10 tid=0xf671f000 nid=0x22e3 runnable
"GC task thread#11 (ParallelGC)" prio=10 tid=0xf6720400 nid=0x22e4 runnable
"GC task thread#12 (ParallelGC)" prio=10 tid=0xf6721c00 nid=0x22e5 runnable
"VM Periodic Task Thread" prio=10 tid=0x64df9000 nid=0x22f9 waiting on condition
JNI global references: 213
+ echo '************ END zombies jstack extract'
************ END zombies jstack extract
+ JIRA_COMMENT='
{color:red}-1 core zombie tests{color}. There are 2 zombie test(s): at org.apache.hadoop.hbase.mapreduce.TestRowCounter.testRowCounterHiddenColumn(TestRowCounter.java:137)
at org.apache.hadoop.hbase.mapreduce.TestImportTSVWithOperationAttributes.testMROnTableWithInvalidOperationAttr(TestImportTSVWithOperationAttributes.java:137)'
+ BAD=1
+ jps
+ grep surefirebooter
+ xargs kill -9
+ cut -d ' ' -f 1
POST BUILD TASK : SUCCESS
END OF POST BUILD TASK : 0
Archiving artifacts
Sending artifact delta relative to HBase-TRUNK #5421
Archived 1777 artifacts
Archive block size is 32768
Received 76 blocks and 515181676 bytes
Compression is 0.5%
Took 4 min 20 sec
Recording test results
Updating HBASE-11440
Updating HBASE-11820
Build failed in Jenkins: HBase-TRUNK #5435
Posted by Apache Jenkins Server <je...@builds.apache.org>.
See <https://builds.apache.org/job/HBase-TRUNK/5435/changes>
Changes:
[apurtell] HBASE-11828 callers of SeverName.valueOf should use equals and not ==.
------------------------------------------
[...truncated 1599 lines...]
Tests run: 2, Failures: 0, Errors: 0, Skipped: 0, Time elapsed: 0.419 sec - in org.apache.hadoop.hbase.security.token.TestTokenAuthentication
Tests run: 44, Failures: 0, Errors: 0, Skipped: 0, Time elapsed: 82.949 sec - in org.apache.hadoop.hbase.security.access.TestAccessController
Running org.apache.hadoop.hbase.security.visibility.TestVisibilityLabelsWithDistributedLogReplay
Tests run: 1, Failures: 0, Errors: 0, Skipped: 0, Time elapsed: 13.226 sec - in org.apache.hadoop.hbase.security.token.TestZKSecretWatcher
Running org.apache.hadoop.hbase.security.visibility.TestVisibilityLabelsWithSLGStack
Tests run: 1, Failures: 0, Errors: 0, Skipped: 0, Time elapsed: 1.499 sec - in org.apache.hadoop.hbase.security.visibility.TestVisibilityLabelsWithSLGStack
Running org.apache.hadoop.hbase.security.visibility.TestVisibilityLabelsWithACL
Tests run: 21, Failures: 0, Errors: 0, Skipped: 0, Time elapsed: 14.21 sec - in org.apache.hadoop.hbase.security.visibility.TestVisibilityLabelsWithDistributedLogReplay
Tests run: 5, Failures: 0, Errors: 0, Skipped: 0, Time elapsed: 4.874 sec - in org.apache.hadoop.hbase.security.visibility.TestVisibilityLabelsWithACL
Running org.apache.hadoop.hbase.security.visibility.TestVisibilityLabelsWithCustomVisLabService
Running org.apache.hadoop.hbase.security.visibility.TestVisibilityLabelsWithDefaultVisLabelService
Running org.apache.hadoop.hbase.security.visibility.TestEnforcingScanLabelGenerator
Tests run: 1, Failures: 0, Errors: 0, Skipped: 0, Time elapsed: 2.283 sec - in org.apache.hadoop.hbase.security.visibility.TestEnforcingScanLabelGenerator
Tests run: 19, Failures: 0, Errors: 0, Skipped: 0, Time elapsed: 11.35 sec - in org.apache.hadoop.hbase.security.visibility.TestVisibilityLabelsWithCustomVisLabService
Tests run: 21, Failures: 0, Errors: 0, Skipped: 0, Time elapsed: 13.201 sec - in org.apache.hadoop.hbase.security.visibility.TestVisibilityLabelsWithDefaultVisLabelService
Running org.apache.hadoop.hbase.security.visibility.TestVisibilityLabelsWithDeletes
Running org.apache.hadoop.hbase.security.visibility.TestVisibilityLabelsOpWithDifferentUsersNoACL
Tests run: 1, Failures: 0, Errors: 0, Skipped: 0, Time elapsed: 2.268 sec - in org.apache.hadoop.hbase.security.visibility.TestVisibilityLabelsOpWithDifferentUsersNoACL
Running org.apache.hadoop.hbase.TestGlobalMemStoreSize
Running org.apache.hadoop.hbase.security.visibility.TestVisibilityWithCheckAuths
Tests run: 2, Failures: 0, Errors: 0, Skipped: 0, Time elapsed: 2.877 sec - in org.apache.hadoop.hbase.security.visibility.TestVisibilityWithCheckAuths
Tests run: 1, Failures: 0, Errors: 0, Skipped: 0, Time elapsed: 11.879 sec - in org.apache.hadoop.hbase.TestGlobalMemStoreSize
Running org.apache.hadoop.hbase.TestNamespace
Running org.apache.hadoop.hbase.constraint.TestConstraint
Tests run: 9, Failures: 0, Errors: 0, Skipped: 1, Time elapsed: 5.971 sec - in org.apache.hadoop.hbase.TestNamespace
Tests run: 5, Failures: 0, Errors: 0, Skipped: 0, Time elapsed: 5.798 sec - in org.apache.hadoop.hbase.constraint.TestConstraint
Running org.apache.hadoop.hbase.filter.TestFuzzyRowAndColumnRangeFilter
Tests run: 1, Failures: 0, Errors: 0, Skipped: 0, Time elapsed: 1.527 sec - in org.apache.hadoop.hbase.filter.TestFuzzyRowAndColumnRangeFilter
Tests run: 37, Failures: 0, Errors: 0, Skipped: 0, Time elapsed: 39.743 sec - in org.apache.hadoop.hbase.security.visibility.TestVisibilityLabelsWithDeletes
Running org.apache.hadoop.hbase.filter.TestFilterWrapper
Tests run: 1, Failures: 0, Errors: 0, Skipped: 0, Time elapsed: 1.971 sec - in org.apache.hadoop.hbase.filter.TestFilterWrapper
Running org.apache.hadoop.hbase.TestHBaseTestingUtility
Running org.apache.hadoop.hbase.filter.TestColumnRangeFilter
Running org.apache.hadoop.hbase.filter.TestFilterWithScanLimits
Tests run: 1, Failures: 0, Errors: 0, Skipped: 0, Time elapsed: 2.058 sec - in org.apache.hadoop.hbase.filter.TestFilterWithScanLimits
Tests run: 1, Failures: 0, Errors: 0, Skipped: 0, Time elapsed: 7.341 sec - in org.apache.hadoop.hbase.filter.TestColumnRangeFilter
Running org.apache.hadoop.hbase.io.encoding.TestDataBlockEncoders
Running org.apache.hadoop.hbase.io.encoding.TestChangingEncoding
Tests run: 7, Failures: 0, Errors: 0, Skipped: 0, Time elapsed: 29.952 sec - in org.apache.hadoop.hbase.TestHBaseTestingUtility
Running org.apache.hadoop.hbase.io.encoding.TestEncodedSeekers
Tests run: 3, Failures: 0, Errors: 0, Skipped: 0, Time elapsed: 49.386 sec - in org.apache.hadoop.hbase.io.encoding.TestChangingEncoding
Running org.apache.hadoop.hbase.io.encoding.TestPrefixTree
Tests run: 1, Failures: 0, Errors: 0, Skipped: 0, Time elapsed: 1.767 sec - in org.apache.hadoop.hbase.io.encoding.TestPrefixTree
Running org.apache.hadoop.hbase.io.encoding.TestBufferedDataBlockEncoder
Tests run: 1, Failures: 0, Errors: 0, Skipped: 0, Time elapsed: 23.404 sec - in org.apache.hadoop.hbase.io.encoding.TestBufferedDataBlockEncoder
Running org.apache.hadoop.hbase.io.encoding.TestLoadAndSwitchEncodeOnDisk
Tests run: 9, Failures: 0, Errors: 0, Skipped: 0, Time elapsed: 275.714 sec - in org.apache.hadoop.hbase.snapshot.TestSecureExportSnapshot
Running org.apache.hadoop.hbase.io.hfile.TestScannerSelectionUsingTTL
Tests run: 9, Failures: 0, Errors: 0, Skipped: 0, Time elapsed: 278.546 sec - in org.apache.hadoop.hbase.snapshot.TestExportSnapshot
Running org.apache.hadoop.hbase.io.hfile.TestHFileBlock
Tests run: 1, Failures: 0, Errors: 0, Skipped: 0, Time elapsed: 21.004 sec - in org.apache.hadoop.hbase.io.encoding.TestLoadAndSwitchEncodeOnDisk
Running org.apache.hadoop.hbase.io.hfile.TestCacheOnWrite
Tests run: 20, Failures: 0, Errors: 0, Skipped: 0, Time elapsed: 134.624 sec - in org.apache.hadoop.hbase.io.encoding.TestEncodedSeekers
Running org.apache.hadoop.hbase.io.hfile.TestHFileBlockIndex
Tests run: 2, Failures: 0, Errors: 0, Skipped: 0, Time elapsed: 0.951 sec - in org.apache.hadoop.hbase.io.hfile.TestHFileBlockIndex
Running org.apache.hadoop.hbase.io.hfile.TestHFileSeek
Tests run: 6, Failures: 0, Errors: 0, Skipped: 0, Time elapsed: 63.133 sec - in org.apache.hadoop.hbase.io.hfile.TestScannerSelectionUsingTTL
Tests run: 1, Failures: 0, Errors: 0, Skipped: 0, Time elapsed: 3.707 sec - in org.apache.hadoop.hbase.io.hfile.TestHFileSeek
Running org.apache.hadoop.hbase.io.hfile.TestCacheConfig
Tests run: 6, Failures: 0, Errors: 0, Skipped: 0, Time elapsed: 2.091 sec - in org.apache.hadoop.hbase.io.hfile.TestCacheConfig
Running org.apache.hadoop.hbase.io.hfile.TestForceCacheImportantBlocks
Running org.apache.hadoop.hbase.io.TestFileLink
Tests run: 3, Failures: 0, Errors: 0, Skipped: 0, Time elapsed: 17.796 sec - in org.apache.hadoop.hbase.io.TestFileLink
Running org.apache.hadoop.hbase.procedure.TestZKProcedure
Tests run: 4, Failures: 0, Errors: 0, Skipped: 0, Time elapsed: 2.882 sec - in org.apache.hadoop.hbase.procedure.TestZKProcedure
Running org.apache.hadoop.hbase.procedure.TestZKProcedureControllers
Tests run: 4, Failures: 0, Errors: 0, Skipped: 0, Time elapsed: 2.578 sec - in org.apache.hadoop.hbase.procedure.TestZKProcedureControllers
Tests run: 2, Failures: 0, Errors: 0, Skipped: 0, Time elapsed: 31.41 sec - in org.apache.hadoop.hbase.io.hfile.TestForceCacheImportantBlocks
Tests run: 28, Failures: 0, Errors: 0, Skipped: 0, Time elapsed: 93.895 sec - in org.apache.hadoop.hbase.io.hfile.TestHFileBlock
Running org.apache.hadoop.hbase.ipc.TestHBaseClient
Tests run: 36, Failures: 0, Errors: 0, Skipped: 0, Time elapsed: 85.717 sec - in org.apache.hadoop.hbase.io.hfile.TestCacheOnWrite
Tests run: 1, Failures: 0, Errors: 0, Skipped: 0, Time elapsed: 0.415 sec - in org.apache.hadoop.hbase.ipc.TestHBaseClient
Running org.apache.hadoop.hbase.ipc.TestProtoBufRpc
Running org.apache.hadoop.hbase.ipc.TestDelayedRpc
Running org.apache.hadoop.hbase.TestAcidGuarantees
Running org.apache.hadoop.hbase.TestLocalHBaseCluster
Tests run: 1, Failures: 0, Errors: 0, Skipped: 0, Time elapsed: 1.847 sec - in org.apache.hadoop.hbase.ipc.TestProtoBufRpc
Tests run: 4, Failures: 0, Errors: 0, Skipped: 0, Time elapsed: 3.651 sec - in org.apache.hadoop.hbase.ipc.TestDelayedRpc
Running org.apache.hadoop.hbase.zookeeper.TestRecoverableZooKeeper
Tests run: 1, Failures: 0, Errors: 0, Skipped: 0, Time elapsed: 1.302 sec - in org.apache.hadoop.hbase.zookeeper.TestRecoverableZooKeeper
Running org.apache.hadoop.hbase.zookeeper.TestZooKeeperNodeTracker
Tests run: 3, Failures: 0, Errors: 0, Skipped: 0, Time elapsed: 1.092 sec - in org.apache.hadoop.hbase.zookeeper.TestZooKeeperNodeTracker
Tests run: 1, Failures: 0, Errors: 0, Skipped: 0, Time elapsed: 8.201 sec - in org.apache.hadoop.hbase.TestLocalHBaseCluster
Running org.apache.hadoop.hbase.zookeeper.TestZKTableStateManager
Running org.apache.hadoop.hbase.zookeeper.TestHQuorumPeer
Tests run: 1, Failures: 0, Errors: 0, Skipped: 0, Time elapsed: 1.018 sec - in org.apache.hadoop.hbase.zookeeper.TestZKTableStateManager
Tests run: 3, Failures: 0, Errors: 0, Skipped: 0, Time elapsed: 1.6 sec - in org.apache.hadoop.hbase.zookeeper.TestHQuorumPeer
Running org.apache.hadoop.hbase.zookeeper.TestZooKeeperACL
Tests run: 6, Failures: 0, Errors: 0, Skipped: 0, Time elapsed: 0.379 sec - in org.apache.hadoop.hbase.zookeeper.TestZooKeeperACL
Running org.apache.hadoop.hbase.zookeeper.TestZKLeaderManager
Tests run: 1, Failures: 0, Errors: 0, Skipped: 0, Time elapsed: 0.156 sec - in org.apache.hadoop.hbase.zookeeper.TestZKLeaderManager
Running org.apache.hadoop.hbase.zookeeper.TestZKMulti
Tests run: 6, Failures: 0, Errors: 0, Skipped: 0, Time elapsed: 0.331 sec - in org.apache.hadoop.hbase.zookeeper.TestZKMulti
Running org.apache.hadoop.hbase.zookeeper.lock.TestZKInterProcessReadWriteLock
Running org.apache.hadoop.hbase.TestMetaTableAccessorNoCluster
Tests run: 2, Failures: 0, Errors: 0, Skipped: 0, Time elapsed: 3.595 sec - in org.apache.hadoop.hbase.TestMetaTableAccessorNoCluster
Running org.apache.hadoop.hbase.TestJMXListener
Running org.apache.hadoop.hbase.TestZooKeeper
Tests run: 6, Failures: 0, Errors: 0, Skipped: 0, Time elapsed: 24.432 sec - in org.apache.hadoop.hbase.zookeeper.lock.TestZKInterProcessReadWriteLock
Tests run: 2, Failures: 0, Errors: 0, Skipped: 0, Time elapsed: 16.853 sec - in org.apache.hadoop.hbase.TestJMXListener
Running org.apache.hadoop.hbase.replication.regionserver.TestReplicationHLogReaderManager
Running org.apache.hadoop.hbase.replication.regionserver.TestRegionReplicaReplicationEndpoint
Tests run: 28, Failures: 0, Errors: 0, Skipped: 0, Time elapsed: 273.146 sec - in org.apache.hadoop.hbase.io.encoding.TestDataBlockEncoders
Tests run: 3, Failures: 0, Errors: 0, Skipped: 0, Time elapsed: 81.374 sec - in org.apache.hadoop.hbase.TestAcidGuarantees
Running org.apache.hadoop.hbase.replication.regionserver.TestRegionReplicaReplicationEndpointNoMaster
Tests run: 7, Failures: 0, Errors: 0, Skipped: 0, Time elapsed: 40.021 sec - in org.apache.hadoop.hbase.replication.regionserver.TestRegionReplicaReplicationEndpoint
Running org.apache.hadoop.hbase.replication.regionserver.TestReplicationSink
Running org.apache.hadoop.hbase.replication.regionserver.TestReplicationSourceManager
Tests run: 5, Failures: 0, Errors: 0, Skipped: 0, Time elapsed: 2.09 sec - in org.apache.hadoop.hbase.replication.regionserver.TestReplicationSink
Running org.apache.hadoop.hbase.replication.TestReplicationTrackerZKImpl
Tests run: 4, Failures: 0, Errors: 0, Skipped: 0, Time elapsed: 4.424 sec - in org.apache.hadoop.hbase.replication.regionserver.TestReplicationSourceManager
Tests run: 4, Failures: 0, Errors: 0, Skipped: 2, Time elapsed: 0.795 sec - in org.apache.hadoop.hbase.replication.TestReplicationTrackerZKImpl
Running org.apache.hadoop.hbase.replication.TestReplicationKillMasterRSCompressed
Running org.apache.hadoop.hbase.replication.TestReplicationKillMasterRS
Tests run: 3, Failures: 0, Errors: 0, Skipped: 0, Time elapsed: 35.316 sec - in org.apache.hadoop.hbase.replication.regionserver.TestRegionReplicaReplicationEndpointNoMaster
Running org.apache.hadoop.hbase.replication.TestMultiSlaveReplication
Tests run: 1, Failures: 0, Errors: 0, Skipped: 0, Time elapsed: 16.757 sec - in org.apache.hadoop.hbase.replication.TestReplicationKillMasterRSCompressed
Tests run: 1, Failures: 0, Errors: 0, Skipped: 0, Time elapsed: 17.146 sec - in org.apache.hadoop.hbase.replication.TestReplicationKillMasterRS
Tests run: 1, Failures: 0, Errors: 0, Skipped: 0, Time elapsed: 24.83 sec - in org.apache.hadoop.hbase.replication.TestMultiSlaveReplication
Running org.apache.hadoop.hbase.replication.TestReplicationChangingPeerRegionservers
Running org.apache.hadoop.hbase.replication.TestReplicationKillSlaveRS
Tests run: 1, Failures: 0, Errors: 0, Skipped: 0, Time elapsed: 5.277 sec - in org.apache.hadoop.hbase.replication.TestReplicationChangingPeerRegionservers
Tests run: 1, Failures: 0, Errors: 0, Skipped: 0, Time elapsed: 13.343 sec - in org.apache.hadoop.hbase.replication.TestReplicationKillSlaveRS
Running org.apache.hadoop.hbase.replication.TestPerTableCFReplication
Running org.apache.hadoop.hbase.replication.TestMasterReplication
Running org.apache.hadoop.hbase.replication.TestReplicationDisableInactivePeer
Tests run: 2, Failures: 0, Errors: 0, Skipped: 0, Time elapsed: 23.329 sec - in org.apache.hadoop.hbase.replication.TestPerTableCFReplication
Tests run: 1, Failures: 0, Errors: 0, Skipped: 0, Time elapsed: 19.133 sec - in org.apache.hadoop.hbase.replication.TestReplicationDisableInactivePeer
Running org.apache.hadoop.hbase.replication.TestReplicationWithTags
Tests run: 1, Failures: 0, Errors: 0, Skipped: 0, Time elapsed: 2.878 sec - in org.apache.hadoop.hbase.replication.TestReplicationWithTags
Running org.apache.hadoop.hbase.replication.TestReplicationEndpoint
Tests run: 3, Failures: 0, Errors: 0, Skipped: 0, Time elapsed: 2.3 sec - in org.apache.hadoop.hbase.replication.TestReplicationEndpoint
Tests run: 3, Failures: 0, Errors: 0, Skipped: 0, Time elapsed: 46.778 sec - in org.apache.hadoop.hbase.replication.TestMasterReplication
Running org.apache.hadoop.hbase.replication.TestReplicationSource
Tests run: 1, Failures: 0, Errors: 0, Skipped: 0, Time elapsed: 0.528 sec - in org.apache.hadoop.hbase.replication.TestReplicationSource
Running org.apache.hadoop.hbase.replication.TestReplicationStateZKImpl
Tests run: 6, Failures: 0, Errors: 0, Skipped: 0, Time elapsed: 0.84 sec - in org.apache.hadoop.hbase.replication.TestReplicationStateZKImpl
Running org.apache.hadoop.hbase.fs.TestBlockReorder
Running org.apache.hadoop.hbase.replication.TestReplicationSmallTests
Running org.apache.hadoop.hbase.replication.TestReplicationSyncUpTool
Tests run: 11, Failures: 0, Errors: 0, Skipped: 0, Time elapsed: 202.474 sec - in org.apache.hadoop.hbase.TestZooKeeper
Tests run: 3, Failures: 0, Errors: 0, Skipped: 0, Time elapsed: 22.007 sec - in org.apache.hadoop.hbase.fs.TestBlockReorder
Running org.apache.hadoop.hbase.trace.TestHTraceHooks
Tests run: 1, Failures: 0, Errors: 0, Skipped: 0, Time elapsed: 1.875 sec - in org.apache.hadoop.hbase.trace.TestHTraceHooks
Running org.apache.hadoop.hbase.TestMetaTableLocator
Tests run: 6, Failures: 0, Errors: 0, Skipped: 0, Time elapsed: 1.857 sec - in org.apache.hadoop.hbase.TestMetaTableLocator
Running org.apache.hadoop.hbase.mapred.TestTableSnapshotInputFormat
Tests run: 9, Failures: 0, Errors: 0, Skipped: 0, Time elapsed: 36.933 sec - in org.apache.hadoop.hbase.replication.TestReplicationSmallTests
Running org.apache.hadoop.hbase.mapred.TestTableInputFormat
Tests run: 10, Failures: 0, Errors: 0, Skipped: 0, Time elapsed: 3.998 sec - in org.apache.hadoop.hbase.mapred.TestTableInputFormat
Running org.apache.hadoop.hbase.mapred.TestTableMapReduceUtil
Tests run: 1, Failures: 0, Errors: 0, Skipped: 0, Time elapsed: 46.63 sec - in org.apache.hadoop.hbase.replication.TestReplicationSyncUpTool
Running org.apache.hadoop.hbase.TestMultiVersions
Tests run: 3, Failures: 0, Errors: 0, Skipped: 0, Time elapsed: 4.892 sec - in org.apache.hadoop.hbase.TestMultiVersions
Tests run: 8, Failures: 0, Errors: 0, Skipped: 0, Time elapsed: 240.081 sec - in org.apache.hadoop.hbase.replication.regionserver.TestReplicationHLogReaderManager
Running org.apache.hadoop.hbase.mapred.TestTableMapReduce
Tests run: 4, Failures: 0, Errors: 0, Skipped: 0, Time elapsed: 91.169 sec - in org.apache.hadoop.hbase.mapred.TestTableMapReduceUtil
Tests run: 2, Failures: 0, Errors: 0, Skipped: 0, Time elapsed: 97.707 sec - in org.apache.hadoop.hbase.mapred.TestTableMapReduce
Tests run: 6, Failures: 0, Errors: 0, Skipped: 0, Time elapsed: 251.733 sec - in org.apache.hadoop.hbase.mapred.TestTableSnapshotInputFormat
Results :
Failed tests:
TestRegionRebalancing.testRebalanceOnRegionServerNumberChange:131->assertRegionsAreBalanced:221 After 5 attempts, region assignments were not balanced.
Tests run: 1935, Failures: 1, Errors: 0, Skipped: 18
[INFO] ------------------------------------------------------------------------
[INFO] Reactor Summary:
[INFO]
[INFO] HBase ............................................. SUCCESS [3.090s]
[INFO] HBase - Common .................................... SUCCESS [57.561s]
[INFO] HBase - Protocol .................................. SUCCESS [10.205s]
[INFO] HBase - Client .................................... SUCCESS [1:06.545s]
[INFO] HBase - Hadoop Compatibility ...................... SUCCESS [7.163s]
[INFO] HBase - Hadoop Two Compatibility .................. SUCCESS [6.035s]
[INFO] HBase - Prefix Tree ............................... SUCCESS [9.579s]
[INFO] HBase - Server .................................... FAILURE [1:04:32.360s]
[INFO] HBase - Testing Util .............................. SKIPPED
[INFO] HBase - Thrift .................................... SKIPPED
[INFO] HBase - Shell ..................................... SKIPPED
[INFO] HBase - Integration Tests ......................... SKIPPED
[INFO] HBase - Examples .................................. SKIPPED
[INFO] HBase - Assembly .................................. SKIPPED
[INFO] ------------------------------------------------------------------------
[INFO] BUILD FAILURE
[INFO] ------------------------------------------------------------------------
[INFO] Total time: 1:07:13.417s
[INFO] Finished at: Wed Aug 27 02:14:13 UTC 2014
[INFO] Final Memory: 40M/189M
[INFO] ------------------------------------------------------------------------
[ERROR] Failed to execute goal org.apache.maven.plugins:maven-surefire-plugin:2.17:test (secondPartTestsExecution) on project hbase-server: ExecutionException: java.lang.RuntimeException: The forked VM terminated without properly saying goodbye. VM crash or System.exit called?
[ERROR] Command was /bin/sh -c cd <https://builds.apache.org/job/HBase-TRUNK/ws/hbase-server> && /home/jenkins/tools/java/jdk1.7.0_25-32/jre/bin/java -enableassertions -XX:MaxDirectMemorySize=1G -Xmx1900m -XX:MaxPermSize=256m -Djava.security.egd=file:/dev/./urandom -Djava.net.preferIPv4Stack=true -Djava.awt.headless=true -jar <https://builds.apache.org/job/HBase-TRUNK/ws/hbase-server/target/surefire/surefirebooter750263313646966280.jar> <https://builds.apache.org/job/HBase-TRUNK/ws/hbase-server/target/surefire/surefire1932147828307743858tmp> <https://builds.apache.org/job/HBase-TRUNK/ws/hbase-server/target/surefire/surefire_837590770471328005371tmp>
[ERROR] -> [Help 1]
[ERROR]
[ERROR] To see the full stack trace of the errors, re-run Maven with the -e switch.
[ERROR] Re-run Maven using the -X switch to enable full debug logging.
[ERROR]
[ERROR] For more information about the errors and possible solutions, please read the following articles:
[ERROR] [Help 1] http://cwiki.apache.org/confluence/display/MAVEN/MojoFailureException
[ERROR]
[ERROR] After correcting the problems, you can resume the build with the command
[ERROR] mvn <goals> -rf :hbase-server
Build step 'Invoke top-level Maven targets' marked build as failure
Performing Post build task...
Match found for :.* : True
Logical operation result is TRUE
Running script : ZOMBIE_TESTS_COUNT=`jps | grep surefirebooter | wc -l`
if [[ $ZOMBIE_TESTS_COUNT != 0 ]] ; then
#It seems sometimes the tests are not dying immediately. Let's give them 10s
echo "Suspicious java process found - waiting 10s to see if there are just slow to stop"
sleep 10
ZOMBIE_TESTS_COUNT=`jps | grep surefirebooter | wc -l`
if [[ $ZOMBIE_TESTS_COUNT != 0 ]] ; then
echo "There are $ZOMBIE_TESTS_COUNT zombie tests, they should have been killed by surefire but survived"
echo "************ BEGIN zombies jstack extract"
ZB_STACK=`jps | grep surefirebooter | cut -d ' ' -f 1 | xargs -n 1 jstack | grep ".test" | grep "\.java"`
jps | grep surefirebooter | cut -d ' ' -f 1 | xargs -n 1 jstack
echo "************ END zombies jstack extract"
JIRA_COMMENT="$JIRA_COMMENT
{color:red}-1 core zombie tests{color}. There are ${ZOMBIE_TESTS_COUNT} zombie test(s): ${ZB_STACK}"
BAD=1
jps | grep surefirebooter | cut -d ' ' -f 1 | xargs kill -9
else
echo "We're ok: there is no zombie test, but some tests took some time to stop"
fi
else
echo "We're ok: there is no zombie test"
fi
[HBase-TRUNK] $ /bin/bash -xe /tmp/hudson6601352287570686373.sh
++ jps
++ grep surefirebooter
++ wc -l
+ ZOMBIE_TESTS_COUNT=0
+ [[ 0 != 0 ]]
+ echo 'We'\''re ok: there is no zombie test'
We're ok: there is no zombie test
POST BUILD TASK : SUCCESS
END OF POST BUILD TASK : 0
Archiving artifacts
Sending artifact delta relative to HBase-TRUNK #5421
Archived 1772 artifacts
Archive block size is 32768
Received 76 blocks and 533184614 bytes
Compression is 0.5%
Took 3 min 12 sec
Recording test results
Updating HBASE-11828
Build failed in Jenkins: HBase-TRUNK #5434
Posted by Apache Jenkins Server <je...@builds.apache.org>.
See <https://builds.apache.org/job/HBase-TRUNK/5434/changes>
Changes:
[stack] Add section on how to reference Hadoop native libs
[stack] Add what not loading libs looks like
------------------------------------------
[...truncated 28942 lines...]
++ xargs -n 1 jstack
+ ZB_STACK=' at org.apache.hadoop.hbase.master.balancer.TestDefaultLoadBalancer.testBalanceCluster(TestDefaultLoadBalancer.java:126)
at org.apache.hadoop.hbase.master.balancer.TestBaseLoadBalancer.testImmediateAssignment(TestBaseLoadBalancer.java:137)'
+ jps
+ grep surefirebooter
+ cut -d ' ' -f 1
+ xargs -n 1 jstack
2014-08-26 22:53:03
Full thread dump Java HotSpot(TM) Server VM (23.25-b01 mixed mode):
"Attach Listener" daemon prio=10 tid=0x65f03c00 nid=0x501e waiting on condition [0x00000000]
java.lang.Thread.State: RUNNABLE
"Timer for 'HBase' metrics system" daemon prio=10 tid=0x63b2d000 nid=0x6a4c in Object.wait() [0x64a63000]
java.lang.Thread.State: TIMED_WAITING (on object monitor)
at java.lang.Object.wait(Native Method)
- waiting on <0xcc5736e8> (a java.util.TaskQueue)
at java.util.TimerThread.mainLoop(Timer.java:552)
- locked <0xcc5736e8> (a java.util.TaskQueue)
at java.util.TimerThread.run(Timer.java:505)
"Service Thread" daemon prio=10 tid=0x660e9000 nid=0x68ce runnable [0x00000000]
java.lang.Thread.State: RUNNABLE
"C2 CompilerThread1" daemon prio=10 tid=0x660e7400 nid=0x68cd waiting on condition [0x00000000]
java.lang.Thread.State: RUNNABLE
"C2 CompilerThread0" daemon prio=10 tid=0x660e5400 nid=0x68cc waiting on condition [0x00000000]
java.lang.Thread.State: RUNNABLE
"Signal Dispatcher" daemon prio=10 tid=0x660e3800 nid=0x68cb runnable [0x00000000]
java.lang.Thread.State: RUNNABLE
"Finalizer" daemon prio=10 tid=0x660a8000 nid=0x68c9 in Object.wait() [0x66152000]
java.lang.Thread.State: WAITING (on object monitor)
at java.lang.Object.wait(Native Method)
- waiting on <0xcdee4e78> (a java.lang.ref.ReferenceQueue$Lock)
at java.lang.ref.ReferenceQueue.remove(ReferenceQueue.java:135)
- locked <0xcdee4e78> (a java.lang.ref.ReferenceQueue$Lock)
at java.lang.ref.ReferenceQueue.remove(ReferenceQueue.java:151)
at java.lang.ref.Finalizer$FinalizerThread.run(Finalizer.java:189)
"Reference Handler" daemon prio=10 tid=0x660a6000 nid=0x68c8 in Object.wait() [0x6bd7d000]
java.lang.Thread.State: WAITING (on object monitor)
at java.lang.Object.wait(Native Method)
- waiting on <0xcdee4b48> (a java.lang.ref.Reference$Lock)
at java.lang.Object.wait(Object.java:503)
at java.lang.ref.Reference$ReferenceHandler.run(Reference.java:133)
- locked <0xcdee4b48> (a java.lang.ref.Reference$Lock)
"main" prio=10 tid=0xf6706800 nid=0x68bc runnable [0xf6918000]
java.lang.Thread.State: RUNNABLE
at java.net.Inet4AddressImpl.lookupAllHostAddr(Native Method)
at java.net.InetAddress$1.lookupAllHostAddr(InetAddress.java:894)
at java.net.InetAddress.getAddressesFromNameService(InetAddress.java:1286)
at java.net.InetAddress.getAllByName0(InetAddress.java:1239)
at java.net.InetAddress.getAllByName(InetAddress.java:1155)
at java.net.InetAddress.getAllByName(InetAddress.java:1091)
at java.net.InetAddress.getByName(InetAddress.java:1041)
at org.apache.hadoop.net.NetUtils.normalizeHostName(NetUtils.java:561)
at org.apache.hadoop.net.NetUtils.normalizeHostNames(NetUtils.java:578)
at org.apache.hadoop.net.CachedDNSToSwitchMapping.resolve(CachedDNSToSwitchMapping.java:109)
at org.apache.hadoop.hbase.master.RackManager.getRack(RackManager.java:66)
at org.apache.hadoop.hbase.master.balancer.BaseLoadBalancer$Cluster.<init>(BaseLoadBalancer.java:210)
at org.apache.hadoop.hbase.master.balancer.BaseLoadBalancer$Cluster.<init>(BaseLoadBalancer.java:159)
at org.apache.hadoop.hbase.master.balancer.SimpleLoadBalancer.balanceCluster(SimpleLoadBalancer.java:198)
at org.apache.hadoop.hbase.master.balancer.TestDefaultLoadBalancer.testBalanceCluster(TestDefaultLoadBalancer.java:126)
at sun.reflect.NativeMethodAccessorImpl.invoke0(Native Method)
at sun.reflect.NativeMethodAccessorImpl.invoke(NativeMethodAccessorImpl.java:57)
at sun.reflect.DelegatingMethodAccessorImpl.invoke(DelegatingMethodAccessorImpl.java:43)
at java.lang.reflect.Method.invoke(Method.java:606)
at org.junit.runners.model.FrameworkMethod$1.runReflectiveCall(FrameworkMethod.java:47)
at org.junit.internal.runners.model.ReflectiveCallable.run(ReflectiveCallable.java:12)
at org.junit.runners.model.FrameworkMethod.invokeExplosively(FrameworkMethod.java:44)
at org.junit.internal.runners.statements.InvokeMethod.evaluate(InvokeMethod.java:17)
at org.junit.runners.ParentRunner.runLeaf(ParentRunner.java:271)
at org.junit.runners.BlockJUnit4ClassRunner.runChild(BlockJUnit4ClassRunner.java:70)
at org.junit.runners.BlockJUnit4ClassRunner.runChild(BlockJUnit4ClassRunner.java:50)
at org.junit.runners.ParentRunner$3.run(ParentRunner.java:238)
at org.junit.runners.ParentRunner$1.schedule(ParentRunner.java:63)
at org.junit.runners.ParentRunner.runChildren(ParentRunner.java:236)
at org.junit.runners.ParentRunner.access$000(ParentRunner.java:53)
at org.junit.runners.ParentRunner$2.evaluate(ParentRunner.java:229)
at org.junit.internal.runners.statements.RunBefores.evaluate(RunBefores.java:26)
at org.junit.runners.ParentRunner.run(ParentRunner.java:309)
at org.junit.runners.Suite.runChild(Suite.java:127)
at org.junit.runners.Suite.runChild(Suite.java:26)
at org.junit.runners.ParentRunner$3.run(ParentRunner.java:238)
at org.junit.runners.ParentRunner$1.schedule(ParentRunner.java:63)
at org.junit.runners.ParentRunner.runChildren(ParentRunner.java:236)
at org.junit.runners.ParentRunner.access$000(ParentRunner.java:53)
at org.junit.runners.ParentRunner$2.evaluate(ParentRunner.java:229)
at org.junit.runners.ParentRunner.run(ParentRunner.java:309)
at org.junit.runner.JUnitCore.run(JUnitCore.java:160)
at org.junit.runner.JUnitCore.run(JUnitCore.java:138)
at org.apache.maven.surefire.junitcore.JUnitCoreWrapper.createRequestAndRun(JUnitCoreWrapper.java:113)
at org.apache.maven.surefire.junitcore.JUnitCoreWrapper.executeEager(JUnitCoreWrapper.java:85)
at org.apache.maven.surefire.junitcore.JUnitCoreWrapper.execute(JUnitCoreWrapper.java:54)
at org.apache.maven.surefire.junitcore.JUnitCoreProvider.invoke(JUnitCoreProvider.java:134)
at org.apache.maven.surefire.booter.ForkedBooter.invokeProviderInSameClassLoader(ForkedBooter.java:200)
at org.apache.maven.surefire.booter.ForkedBooter.runSuitesInProcess(ForkedBooter.java:153)
at org.apache.maven.surefire.booter.ForkedBooter.main(ForkedBooter.java:103)
"VM Thread" prio=10 tid=0x660a0800 nid=0x68c6 runnable
"GC task thread#0 (ParallelGC)" prio=10 tid=0xf6710800 nid=0x68be runnable
"GC task thread#1 (ParallelGC)" prio=10 tid=0xf6712000 nid=0x68bf runnable
"GC task thread#2 (ParallelGC)" prio=10 tid=0xf6713800 nid=0x68c0 runnable
"GC task thread#3 (ParallelGC)" prio=10 tid=0xf6714c00 nid=0x68c1 runnable
"VM Periodic Task Thread" prio=10 tid=0x660eb000 nid=0x68cf waiting on condition
JNI global references: 263
2014-08-26 22:53:03
Full thread dump Java HotSpot(TM) Server VM (23.25-b01 mixed mode):
"Attach Listener" daemon prio=10 tid=0x65f03c00 nid=0x502d waiting on condition [0x00000000]
java.lang.Thread.State: RUNNABLE
"Timer for 'HBase' metrics system" daemon prio=10 tid=0x644f4400 nid=0x7fff in Object.wait() [0x65352000]
java.lang.Thread.State: TIMED_WAITING (on object monitor)
at java.lang.Object.wait(Native Method)
- waiting on <0xcdefe518> (a java.util.TaskQueue)
at java.util.TimerThread.mainLoop(Timer.java:552)
- locked <0xcdefe518> (a java.util.TaskQueue)
at java.util.TimerThread.run(Timer.java:505)
"Service Thread" daemon prio=10 tid=0x660e9000 nid=0x7ff9 runnable [0x00000000]
java.lang.Thread.State: RUNNABLE
"C2 CompilerThread1" daemon prio=10 tid=0x660e7400 nid=0x7ff8 waiting on condition [0x00000000]
java.lang.Thread.State: RUNNABLE
"C2 CompilerThread0" daemon prio=10 tid=0x660e5400 nid=0x7ff7 waiting on condition [0x00000000]
java.lang.Thread.State: RUNNABLE
"Signal Dispatcher" daemon prio=10 tid=0x660e3800 nid=0x7ff6 runnable [0x00000000]
java.lang.Thread.State: RUNNABLE
"Finalizer" daemon prio=10 tid=0x660a8000 nid=0x7ff2 in Object.wait() [0x6bd7d000]
java.lang.Thread.State: WAITING (on object monitor)
at java.lang.Object.wait(Native Method)
- waiting on <0xcdee9f00> (a java.lang.ref.ReferenceQueue$Lock)
at java.lang.ref.ReferenceQueue.remove(ReferenceQueue.java:135)
- locked <0xcdee9f00> (a java.lang.ref.ReferenceQueue$Lock)
at java.lang.ref.ReferenceQueue.remove(ReferenceQueue.java:151)
at java.lang.ref.Finalizer$FinalizerThread.run(Finalizer.java:189)
"Reference Handler" daemon prio=10 tid=0x660a6000 nid=0x7ff1 in Object.wait() [0x6c07d000]
java.lang.Thread.State: WAITING (on object monitor)
at java.lang.Object.wait(Native Method)
- waiting on <0xcdee9910> (a java.lang.ref.Reference$Lock)
at java.lang.Object.wait(Object.java:503)
at java.lang.ref.Reference$ReferenceHandler.run(Reference.java:133)
- locked <0xcdee9910> (a java.lang.ref.Reference$Lock)
"main" prio=10 tid=0xf6706800 nid=0x7feb runnable [0xf6930000]
java.lang.Thread.State: RUNNABLE
at java.net.Inet4AddressImpl.lookupAllHostAddr(Native Method)
at java.net.InetAddress$1.lookupAllHostAddr(InetAddress.java:894)
at java.net.InetAddress.getAddressesFromNameService(InetAddress.java:1286)
at java.net.InetAddress.getAllByName0(InetAddress.java:1239)
at java.net.InetAddress.getAllByName(InetAddress.java:1155)
at java.net.InetAddress.getAllByName(InetAddress.java:1091)
at java.net.InetAddress.getByName(InetAddress.java:1041)
at org.apache.hadoop.net.NetUtils.normalizeHostName(NetUtils.java:561)
at org.apache.hadoop.net.NetUtils.normalizeHostNames(NetUtils.java:578)
at org.apache.hadoop.net.CachedDNSToSwitchMapping.resolve(CachedDNSToSwitchMapping.java:109)
at org.apache.hadoop.hbase.master.RackManager.getRack(RackManager.java:66)
at org.apache.hadoop.hbase.master.balancer.BaseLoadBalancer$Cluster.<init>(BaseLoadBalancer.java:298)
at org.apache.hadoop.hbase.master.balancer.BaseLoadBalancer.createCluster(BaseLoadBalancer.java:1223)
at org.apache.hadoop.hbase.master.balancer.BaseLoadBalancer.randomAssignment(BaseLoadBalancer.java:1272)
at org.apache.hadoop.hbase.master.balancer.BaseLoadBalancer.immediateAssignment(BaseLoadBalancer.java:1255)
at org.apache.hadoop.hbase.master.balancer.TestBaseLoadBalancer.testImmediateAssignment(TestBaseLoadBalancer.java:137)
at sun.reflect.NativeMethodAccessorImpl.invoke0(Native Method)
at sun.reflect.NativeMethodAccessorImpl.invoke(NativeMethodAccessorImpl.java:57)
at sun.reflect.DelegatingMethodAccessorImpl.invoke(DelegatingMethodAccessorImpl.java:43)
at java.lang.reflect.Method.invoke(Method.java:606)
at org.junit.runners.model.FrameworkMethod$1.runReflectiveCall(FrameworkMethod.java:47)
at org.junit.internal.runners.model.ReflectiveCallable.run(ReflectiveCallable.java:12)
at org.junit.runners.model.FrameworkMethod.invokeExplosively(FrameworkMethod.java:44)
at org.junit.internal.runners.statements.InvokeMethod.evaluate(InvokeMethod.java:17)
at org.junit.runners.ParentRunner.runLeaf(ParentRunner.java:271)
at org.junit.runners.BlockJUnit4ClassRunner.runChild(BlockJUnit4ClassRunner.java:70)
at org.junit.runners.BlockJUnit4ClassRunner.runChild(BlockJUnit4ClassRunner.java:50)
at org.junit.runners.ParentRunner$3.run(ParentRunner.java:238)
at org.junit.runners.ParentRunner$1.schedule(ParentRunner.java:63)
at org.junit.runners.ParentRunner.runChildren(ParentRunner.java:236)
at org.junit.runners.ParentRunner.access$000(ParentRunner.java:53)
at org.junit.runners.ParentRunner$2.evaluate(ParentRunner.java:229)
at org.junit.internal.runners.statements.RunBefores.evaluate(RunBefores.java:26)
at org.junit.runners.ParentRunner.run(ParentRunner.java:309)
at org.junit.runners.Suite.runChild(Suite.java:127)
at org.junit.runners.Suite.runChild(Suite.java:26)
at org.junit.runners.ParentRunner$3.run(ParentRunner.java:238)
at org.junit.runners.ParentRunner$1.schedule(ParentRunner.java:63)
at org.junit.runners.ParentRunner.runChildren(ParentRunner.java:236)
at org.junit.runners.ParentRunner.access$000(ParentRunner.java:53)
at org.junit.runners.ParentRunner$2.evaluate(ParentRunner.java:229)
at org.junit.runners.ParentRunner.run(ParentRunner.java:309)
at org.junit.runner.JUnitCore.run(JUnitCore.java:160)
at org.junit.runner.JUnitCore.run(JUnitCore.java:138)
at org.apache.maven.surefire.junitcore.JUnitCoreWrapper.createRequestAndRun(JUnitCoreWrapper.java:113)
at org.apache.maven.surefire.junitcore.JUnitCoreWrapper.executeEager(JUnitCoreWrapper.java:85)
at org.apache.maven.surefire.junitcore.JUnitCoreWrapper.execute(JUnitCoreWrapper.java:54)
at org.apache.maven.surefire.junitcore.JUnitCoreProvider.invoke(JUnitCoreProvider.java:134)
at org.apache.maven.surefire.booter.ForkedBooter.invokeProviderInSameClassLoader(ForkedBooter.java:200)
at org.apache.maven.surefire.booter.ForkedBooter.runSuitesInProcess(ForkedBooter.java:153)
at org.apache.maven.surefire.booter.ForkedBooter.main(ForkedBooter.java:103)
"VM Thread" prio=10 tid=0x660a0800 nid=0x7ff0 runnable
"GC task thread#0 (ParallelGC)" prio=10 tid=0xf6710800 nid=0x7fec runnable
"GC task thread#1 (ParallelGC)" prio=10 tid=0xf6712000 nid=0x7fed runnable
"GC task thread#2 (ParallelGC)" prio=10 tid=0xf6713800 nid=0x7fee runnable
"GC task thread#3 (ParallelGC)" prio=10 tid=0xf6714c00 nid=0x7fef runnable
"VM Periodic Task Thread" prio=10 tid=0x660f3000 nid=0x7ffa waiting on condition
JNI global references: 165
+ echo '************ END zombies jstack extract'
************ END zombies jstack extract
+ JIRA_COMMENT='
{color:red}-1 core zombie tests{color}. There are 2 zombie test(s): at org.apache.hadoop.hbase.master.balancer.TestDefaultLoadBalancer.testBalanceCluster(TestDefaultLoadBalancer.java:126)
at org.apache.hadoop.hbase.master.balancer.TestBaseLoadBalancer.testImmediateAssignment(TestBaseLoadBalancer.java:137)'
+ BAD=1
+ jps
+ cut -d ' ' -f 1
+ grep surefirebooter
+ xargs kill -9
POST BUILD TASK : SUCCESS
END OF POST BUILD TASK : 0
Archiving artifacts
Sending artifact delta relative to HBase-TRUNK #5421
Archived 1748 artifacts
Archive block size is 32768
Received 76 blocks and 521329986 bytes
Compression is 0.5%
Took 2 min 51 sec
Recording test results
Build failed in Jenkins: HBase-TRUNK #5433
Posted by Apache Jenkins Server <je...@builds.apache.org>.
See <https://builds.apache.org/job/HBase-TRUNK/5433/changes>
Changes:
[stack] HBASE-7782 HBaseTestingUtility.truncateTable() not acting like CLI (Sean Busbey)
[larsh] HBASE-9746 Addendum.
------------------------------------------
[...truncated 3294 lines...]
Tests run: 4, Failures: 0, Errors: 0, Skipped: 0, Time elapsed: 44.404 sec - in org.apache.hadoop.hbase.client.TestScannerTimeout
Running org.apache.hadoop.hbase.client.TestTableSnapshotScanner
Tests run: 79, Failures: 0, Errors: 0, Skipped: 4, Time elapsed: 176.931 sec - in org.apache.hadoop.hbase.client.TestFromClientSide
Running org.apache.hadoop.hbase.client.TestFromClientSide3
Running org.apache.hadoop.hbase.client.TestRestoreSnapshotFromClient
Tests run: 12, Failures: 0, Errors: 0, Skipped: 0, Time elapsed: 106.236 sec - in org.apache.hadoop.hbase.client.TestReplicasClient
Running org.apache.hadoop.hbase.client.TestSnapshotMetadata
Tests run: 3, Failures: 0, Errors: 0, Skipped: 0, Time elapsed: 90.434 sec - in org.apache.hadoop.hbase.client.TestTableSnapshotScanner
Tests run: 6, Failures: 0, Errors: 0, Skipped: 0, Time elapsed: 66.39 sec - in org.apache.hadoop.hbase.client.TestFromClientSide3
Running org.apache.hadoop.hbase.TestHColumnDescriptorDefaultVersions
Running org.apache.hadoop.hbase.TestMultiVersions
Tests run: 4, Failures: 0, Errors: 0, Skipped: 0, Time elapsed: 31.307 sec - in org.apache.hadoop.hbase.client.TestSnapshotMetadata
Running org.apache.hadoop.hbase.procedure.TestZKProcedure
Tests run: 3, Failures: 0, Errors: 0, Skipped: 0, Time elapsed: 12.653 sec - in org.apache.hadoop.hbase.TestMultiVersions
Tests run: 4, Failures: 0, Errors: 0, Skipped: 0, Time elapsed: 4.761 sec - in org.apache.hadoop.hbase.procedure.TestZKProcedure
Running org.apache.hadoop.hbase.procedure.TestZKProcedureControllers
Tests run: 3, Failures: 0, Errors: 0, Skipped: 0, Time elapsed: 20.683 sec - in org.apache.hadoop.hbase.TestHColumnDescriptorDefaultVersions
Tests run: 4, Failures: 0, Errors: 0, Skipped: 0, Time elapsed: 4.558 sec - in org.apache.hadoop.hbase.procedure.TestZKProcedureControllers
Running org.apache.hadoop.hbase.constraint.TestConstraint
Running org.apache.hadoop.hbase.TestNamespace
Running org.apache.hadoop.hbase.rest.TestDeleteRow
Tests run: 5, Failures: 0, Errors: 0, Skipped: 0, Time elapsed: 11.317 sec - in org.apache.hadoop.hbase.constraint.TestConstraint
Tests run: 9, Failures: 0, Errors: 0, Skipped: 1, Time elapsed: 12.78 sec - in org.apache.hadoop.hbase.TestNamespace
Tests run: 2, Failures: 0, Errors: 0, Skipped: 0, Time elapsed: 9.82 sec - in org.apache.hadoop.hbase.rest.TestDeleteRow
Tests run: 5, Failures: 0, Errors: 0, Skipped: 0, Time elapsed: 132.258 sec - in org.apache.hadoop.hbase.client.TestRestoreSnapshotFromClient
Running org.apache.hadoop.hbase.rest.TestScannersWithLabels
Tests run: 2, Failures: 0, Errors: 0, Skipped: 0, Time elapsed: 5.296 sec - in org.apache.hadoop.hbase.rest.TestScannersWithLabels
Running org.apache.hadoop.hbase.rest.TestSchemaResource
Tests run: 2, Failures: 0, Errors: 0, Skipped: 0, Time elapsed: 8.842 sec - in org.apache.hadoop.hbase.rest.TestSchemaResource
Running org.apache.hadoop.hbase.rest.TestTableResource
Running org.apache.hadoop.hbase.rest.TestTableScan
Tests run: 8, Failures: 0, Errors: 0, Skipped: 0, Time elapsed: 7.13 sec - in org.apache.hadoop.hbase.rest.TestTableResource
Running org.apache.hadoop.hbase.rest.TestGetAndPutResource
Running org.apache.hadoop.hbase.rest.TestStatusResource
Tests run: 10, Failures: 0, Errors: 0, Skipped: 0, Time elapsed: 20.538 sec - in org.apache.hadoop.hbase.rest.TestTableScan
Tests run: 2, Failures: 0, Errors: 0, Skipped: 0, Time elapsed: 5.727 sec - in org.apache.hadoop.hbase.rest.TestStatusResource
Running org.apache.hadoop.hbase.rest.TestResourceFilter
Tests run: 1, Failures: 0, Errors: 0, Skipped: 0, Time elapsed: 1.877 sec - in org.apache.hadoop.hbase.rest.TestResourceFilter
Running org.apache.hadoop.hbase.rest.client.TestRemoteTable
Tests run: 18, Failures: 0, Errors: 0, Skipped: 0, Time elapsed: 39.398 sec - in org.apache.hadoop.hbase.rest.TestGetAndPutResource
Tests run: 9, Failures: 0, Errors: 0, Skipped: 0, Time elapsed: 23.494 sec - in org.apache.hadoop.hbase.rest.client.TestRemoteTable
Running org.apache.hadoop.hbase.rest.TestVersionResource
Tests run: 7, Failures: 0, Errors: 0, Skipped: 0, Time elapsed: 6.754 sec - in org.apache.hadoop.hbase.rest.TestVersionResource
Running org.apache.hadoop.hbase.rest.TestMultiRowResource
Running org.apache.hadoop.hbase.rest.TestScannersWithFilters
Tests run: 3, Failures: 0, Errors: 0, Skipped: 0, Time elapsed: 6.292 sec - in org.apache.hadoop.hbase.rest.TestMultiRowResource
Running org.apache.hadoop.hbase.rest.TestGzipFilter
Tests run: 10, Failures: 0, Errors: 0, Skipped: 0, Time elapsed: 14.798 sec - in org.apache.hadoop.hbase.rest.TestScannersWithFilters
Tests run: 2, Failures: 0, Errors: 0, Skipped: 0, Time elapsed: 6.602 sec - in org.apache.hadoop.hbase.rest.TestGzipFilter
Running org.apache.hadoop.hbase.TestZooKeeper
Running org.apache.hadoop.hbase.rest.TestScannerResource
Running org.apache.hadoop.hbase.snapshot.TestFlushSnapshotFromClient
Tests run: 5, Failures: 0, Errors: 0, Skipped: 0, Time elapsed: 12.616 sec - in org.apache.hadoop.hbase.rest.TestScannerResource
Running org.apache.hadoop.hbase.snapshot.TestExportSnapshot
Running org.apache.hadoop.hbase.snapshot.TestSecureExportSnapshot
Tests run: 9, Failures: 0, Errors: 0, Skipped: 0, Time elapsed: 73.434 sec - in org.apache.hadoop.hbase.snapshot.TestFlushSnapshotFromClient
Running org.apache.hadoop.hbase.snapshot.TestRestoreFlushSnapshotFromClient
Tests run: 46, Failures: 0, Errors: 0, Skipped: 0, Time elapsed: 584.764 sec - in org.apache.hadoop.hbase.client.TestAdmin
Running org.apache.hadoop.hbase.snapshot.TestSnapshotDescriptionUtils
Tests run: 2, Failures: 0, Errors: 0, Skipped: 0, Time elapsed: 1.067 sec - in org.apache.hadoop.hbase.snapshot.TestSnapshotDescriptionUtils
Running org.apache.hadoop.hbase.TestIOFencing
Tests run: 5, Failures: 0, Errors: 0, Skipped: 0, Time elapsed: 90.75 sec - in org.apache.hadoop.hbase.snapshot.TestRestoreFlushSnapshotFromClient
Running org.apache.hadoop.hbase.coprocessor.TestRegionObserverScannerOpenHook
Tests run: 11, Failures: 0, Errors: 0, Skipped: 0, Time elapsed: 247.345 sec - in org.apache.hadoop.hbase.TestZooKeeper
Tests run: 3, Failures: 0, Errors: 0, Skipped: 0, Time elapsed: 26.5 sec - in org.apache.hadoop.hbase.coprocessor.TestRegionObserverScannerOpenHook
Running org.apache.hadoop.hbase.coprocessor.TestMasterCoprocessorExceptionWithAbort
Running org.apache.hadoop.hbase.coprocessor.TestOpenTableInCoprocessor
Tests run: 2, Failures: 0, Errors: 0, Skipped: 0, Time elapsed: 7.447 sec - in org.apache.hadoop.hbase.coprocessor.TestOpenTableInCoprocessor
Tests run: 1, Failures: 0, Errors: 0, Skipped: 0, Time elapsed: 18.831 sec - in org.apache.hadoop.hbase.coprocessor.TestMasterCoprocessorExceptionWithAbort
Running org.apache.hadoop.hbase.coprocessor.TestRegionObserverInterface
Running org.apache.hadoop.hbase.coprocessor.TestMasterCoprocessorExceptionWithRemove
Tests run: 1, Failures: 0, Errors: 0, Skipped: 0, Time elapsed: 5.811 sec - in org.apache.hadoop.hbase.coprocessor.TestMasterCoprocessorExceptionWithRemove
Running org.apache.hadoop.hbase.coprocessor.TestAggregateProtocol
Tests run: 12, Failures: 0, Errors: 0, Skipped: 0, Time elapsed: 48.261 sec - in org.apache.hadoop.hbase.coprocessor.TestRegionObserverInterface
Tests run: 44, Failures: 0, Errors: 0, Skipped: 0, Time elapsed: 14.107 sec - in org.apache.hadoop.hbase.coprocessor.TestAggregateProtocol
Running org.apache.hadoop.hbase.coprocessor.TestBatchCoprocessorEndpoint
Running org.apache.hadoop.hbase.coprocessor.TestHTableWrapper
Tests run: 4, Failures: 0, Errors: 0, Skipped: 0, Time elapsed: 2.649 sec - in org.apache.hadoop.hbase.coprocessor.TestBatchCoprocessorEndpoint
Running org.apache.hadoop.hbase.coprocessor.TestRegionServerObserver
Tests run: 1, Failures: 0, Errors: 0, Skipped: 0, Time elapsed: 4.323 sec - in org.apache.hadoop.hbase.coprocessor.TestHTableWrapper
Tests run: 2, Failures: 0, Errors: 0, Skipped: 0, Time elapsed: 259.658 sec - in org.apache.hadoop.hbase.TestIOFencing
Running org.apache.hadoop.hbase.coprocessor.TestRegionServerCoprocessorExceptionWithAbort
Running org.apache.hadoop.hbase.coprocessor.TestClassLoading
Tests run: 1, Failures: 0, Errors: 0, Skipped: 0, Time elapsed: 35.736 sec - in org.apache.hadoop.hbase.coprocessor.TestRegionServerObserver
Tests run: 8, Failures: 0, Errors: 0, Skipped: 0, Time elapsed: 29.984 sec - in org.apache.hadoop.hbase.coprocessor.TestClassLoading
Running org.apache.hadoop.hbase.coprocessor.TestDoubleColumnInterpreter
Tests run: 2, Failures: 0, Errors: 0, Skipped: 0, Time elapsed: 49.637 sec - in org.apache.hadoop.hbase.coprocessor.TestRegionServerCoprocessorExceptionWithAbort
Tests run: 38, Failures: 0, Errors: 0, Skipped: 0, Time elapsed: 13.199 sec - in org.apache.hadoop.hbase.coprocessor.TestDoubleColumnInterpreter
Running org.apache.hadoop.hbase.coprocessor.TestRegionObserverBypass
Tests run: 2, Failures: 0, Errors: 0, Skipped: 0, Time elapsed: 5.472 sec - in org.apache.hadoop.hbase.coprocessor.TestRegionObserverBypass
Running org.apache.hadoop.hbase.coprocessor.TestRowProcessorEndpoint
Running org.apache.hadoop.hbase.coprocessor.TestCoprocessorStop
Tests run: 9, Failures: 0, Errors: 0, Skipped: 0, Time elapsed: 471.673 sec - in org.apache.hadoop.hbase.snapshot.TestExportSnapshot
Tests run: 4, Failures: 0, Errors: 0, Skipped: 0, Time elapsed: 12.542 sec - in org.apache.hadoop.hbase.coprocessor.TestRowProcessorEndpoint
Running org.apache.hadoop.hbase.coprocessor.TestRegionServerCoprocessorExceptionWithRemove
Tests run: 1, Failures: 0, Errors: 0, Skipped: 0, Time elapsed: 16.912 sec - in org.apache.hadoop.hbase.coprocessor.TestCoprocessorStop
Tests run: 1, Failures: 0, Errors: 0, Skipped: 0, Time elapsed: 16.018 sec - in org.apache.hadoop.hbase.coprocessor.TestRegionServerCoprocessorExceptionWithRemove
Running org.apache.hadoop.hbase.coprocessor.TestBigDecimalColumnInterpreter
Running org.apache.hadoop.hbase.coprocessor.TestMasterObserver
Tests run: 38, Failures: 0, Errors: 0, Skipped: 0, Time elapsed: 10.438 sec - in org.apache.hadoop.hbase.coprocessor.TestBigDecimalColumnInterpreter
Tests run: 9, Failures: 0, Errors: 0, Skipped: 0, Time elapsed: 476.134 sec - in org.apache.hadoop.hbase.snapshot.TestSecureExportSnapshot
Running org.apache.hadoop.hbase.TestGlobalMemStoreSize
Running org.apache.hadoop.hbase.coprocessor.TestCoprocessorEndpoint
Tests run: 6, Failures: 0, Errors: 0, Skipped: 0, Time elapsed: 3.47 sec - in org.apache.hadoop.hbase.coprocessor.TestCoprocessorEndpoint
Running org.apache.hadoop.hbase.coprocessor.TestWALObserver
Tests run: 6, Failures: 0, Errors: 0, Skipped: 0, Time elapsed: 19.381 sec - in org.apache.hadoop.hbase.coprocessor.TestMasterObserver
Running org.apache.hadoop.hbase.TestMetaTableLocator
Tests run: 6, Failures: 0, Errors: 0, Skipped: 0, Time elapsed: 5.633 sec - in org.apache.hadoop.hbase.TestMetaTableLocator
Running org.apache.hadoop.hbase.zookeeper.TestZKTableStateManager
Tests run: 1, Failures: 0, Errors: 0, Skipped: 0, Time elapsed: 2.865 sec - in org.apache.hadoop.hbase.zookeeper.TestZKTableStateManager
Tests run: 3, Failures: 0, Errors: 0, Skipped: 0, Time elapsed: 14.098 sec - in org.apache.hadoop.hbase.coprocessor.TestWALObserver
Running org.apache.hadoop.hbase.zookeeper.TestZKMulti
Running org.apache.hadoop.hbase.TestJMXListener
Running org.apache.hadoop.hbase.zookeeper.lock.TestZKInterProcessReadWriteLock
Tests run: 6, Failures: 0, Errors: 0, Skipped: 0, Time elapsed: 1.337 sec - in org.apache.hadoop.hbase.zookeeper.TestZKMulti
Running org.apache.hadoop.hbase.zookeeper.TestZKLeaderManager
Tests run: 1, Failures: 0, Errors: 0, Skipped: 0, Time elapsed: 0.385 sec - in org.apache.hadoop.hbase.zookeeper.TestZKLeaderManager
Tests run: 1, Failures: 0, Errors: 0, Skipped: 0, Time elapsed: 32.641 sec - in org.apache.hadoop.hbase.TestGlobalMemStoreSize
Running org.apache.hadoop.hbase.zookeeper.TestZooKeeperACL
Tests run: 6, Failures: 0, Errors: 0, Skipped: 0, Time elapsed: 0.985 sec - in org.apache.hadoop.hbase.zookeeper.TestZooKeeperACL
Running org.apache.hadoop.hbase.zookeeper.TestRecoverableZooKeeper
Tests run: 1, Failures: 0, Errors: 0, Skipped: 0, Time elapsed: 1.768 sec - in org.apache.hadoop.hbase.zookeeper.TestRecoverableZooKeeper
Running org.apache.hadoop.hbase.zookeeper.TestZooKeeperNodeTracker
Running org.apache.hadoop.hbase.zookeeper.TestHQuorumPeer
Tests run: 3, Failures: 0, Errors: 0, Skipped: 0, Time elapsed: 2.404 sec - in org.apache.hadoop.hbase.zookeeper.TestZooKeeperNodeTracker
Running org.apache.hadoop.hbase.TestClusterBootOrder
Tests run: 3, Failures: 0, Errors: 0, Skipped: 0, Time elapsed: 2.841 sec - in org.apache.hadoop.hbase.zookeeper.TestHQuorumPeer
Tests run: 2, Failures: 0, Errors: 0, Skipped: 0, Time elapsed: 16.976 sec - in org.apache.hadoop.hbase.TestJMXListener
Tests run: 6, Failures: 0, Errors: 0, Skipped: 0, Time elapsed: 25.889 sec - in org.apache.hadoop.hbase.zookeeper.lock.TestZKInterProcessReadWriteLock
Tests run: 2, Failures: 0, Errors: 0, Skipped: 0, Time elapsed: 37.791 sec - in org.apache.hadoop.hbase.TestClusterBootOrder
Results :
Failed tests:
TestPerTableCFReplication.testPerTableCFReplication:293->ensureRowNotReplicated:379 expected:<0> but was:<1>
TestMultiParallel.testActiveThreadsCount:156 expected:<5> but was:<4>
Tests in error:
TestEncryptionKeyRotation.testCFKeyRotation:101->createTableAndFlush:216 ? RetriesExhausted
TestPrefixTree.testHBASE11728:112 ? RetriesExhausted Failed after attempts=35,...
TestRegionReplicaReplicationEndpoint.testRegionReplicaReplicationWith2Replicas:212->testRegionReplicaReplication:162->verifyReplication:192 ?
Tests run: 1991, Failures: 2, Errors: 3, Skipped: 19
[INFO] ------------------------------------------------------------------------
[INFO] Reactor Summary:
[INFO]
[INFO] HBase ............................................. SUCCESS [7.294s]
[INFO] HBase - Common .................................... SUCCESS [1:55.178s]
[INFO] HBase - Protocol .................................. SUCCESS [17.482s]
[INFO] HBase - Client .................................... SUCCESS [1:23.345s]
[INFO] HBase - Hadoop Compatibility ...................... SUCCESS [10.708s]
[INFO] HBase - Hadoop Two Compatibility .................. SUCCESS [12.686s]
[INFO] HBase - Prefix Tree ............................... SUCCESS [19.381s]
[INFO] HBase - Server .................................... FAILURE [1:57:55.575s]
[INFO] HBase - Testing Util .............................. SKIPPED
[INFO] HBase - Thrift .................................... SKIPPED
[INFO] HBase - Shell ..................................... SKIPPED
[INFO] HBase - Integration Tests ......................... SKIPPED
[INFO] HBase - Examples .................................. SKIPPED
[INFO] HBase - Assembly .................................. SKIPPED
[INFO] ------------------------------------------------------------------------
[INFO] BUILD FAILURE
[INFO] ------------------------------------------------------------------------
[INFO] Total time: 2:02:23.522s
[INFO] Finished at: Tue Aug 26 20:06:59 UTC 2014
[INFO] Final Memory: 40M/458M
[INFO] ------------------------------------------------------------------------
[ERROR] Failed to execute goal org.apache.maven.plugins:maven-surefire-plugin:2.17:test (secondPartTestsExecution) on project hbase-server: ExecutionException: java.lang.RuntimeException: The forked VM terminated without properly saying goodbye. VM crash or System.exit called?
[ERROR] Command was /bin/sh -c cd <https://builds.apache.org/job/HBase-TRUNK/ws/hbase-server> && /home/jenkins/tools/java/jdk1.7.0_25-32/jre/bin/java -enableassertions -XX:MaxDirectMemorySize=1G -Xmx1900m -XX:MaxPermSize=256m -Djava.security.egd=file:/dev/./urandom -Djava.net.preferIPv4Stack=true -Djava.awt.headless=true -jar <https://builds.apache.org/job/HBase-TRUNK/ws/hbase-server/target/surefire/surefirebooter3778005466572954548.jar> <https://builds.apache.org/job/HBase-TRUNK/ws/hbase-server/target/surefire/surefire697642497185388215tmp> <https://builds.apache.org/job/HBase-TRUNK/ws/hbase-server/target/surefire/surefire_9047883857240445714581tmp>
[ERROR] -> [Help 1]
[ERROR]
[ERROR] To see the full stack trace of the errors, re-run Maven with the -e switch.
[ERROR] Re-run Maven using the -X switch to enable full debug logging.
[ERROR]
[ERROR] For more information about the errors and possible solutions, please read the following articles:
[ERROR] [Help 1] http://cwiki.apache.org/confluence/display/MAVEN/MojoFailureException
[ERROR]
[ERROR] After correcting the problems, you can resume the build with the command
[ERROR] mvn <goals> -rf :hbase-server
Build step 'Invoke top-level Maven targets' marked build as failure
Performing Post build task...
Match found for :.* : True
Logical operation result is TRUE
Running script : ZOMBIE_TESTS_COUNT=`jps | grep surefirebooter | wc -l`
if [[ $ZOMBIE_TESTS_COUNT != 0 ]] ; then
#It seems sometimes the tests are not dying immediately. Let's give them 10s
echo "Suspicious java process found - waiting 10s to see if there are just slow to stop"
sleep 10
ZOMBIE_TESTS_COUNT=`jps | grep surefirebooter | wc -l`
if [[ $ZOMBIE_TESTS_COUNT != 0 ]] ; then
echo "There are $ZOMBIE_TESTS_COUNT zombie tests, they should have been killed by surefire but survived"
echo "************ BEGIN zombies jstack extract"
ZB_STACK=`jps | grep surefirebooter | cut -d ' ' -f 1 | xargs -n 1 jstack | grep ".test" | grep "\.java"`
jps | grep surefirebooter | cut -d ' ' -f 1 | xargs -n 1 jstack
echo "************ END zombies jstack extract"
JIRA_COMMENT="$JIRA_COMMENT
{color:red}-1 core zombie tests{color}. There are ${ZOMBIE_TESTS_COUNT} zombie test(s): ${ZB_STACK}"
BAD=1
jps | grep surefirebooter | cut -d ' ' -f 1 | xargs kill -9
else
echo "We're ok: there is no zombie test, but some tests took some time to stop"
fi
else
echo "We're ok: there is no zombie test"
fi
[HBase-TRUNK] $ /bin/bash -xe /tmp/hudson7753676459011016451.sh
++ grep surefirebooter
++ wc -l
++ jps
+ ZOMBIE_TESTS_COUNT=1
+ [[ 1 != 0 ]]
+ echo 'Suspicious java process found - waiting 10s to see if there are just slow to stop'
Suspicious java process found - waiting 10s to see if there are just slow to stop
+ sleep 10
++ jps
++ grep surefirebooter
++ wc -l
+ ZOMBIE_TESTS_COUNT=1
+ [[ 1 != 0 ]]
+ echo 'There are 1 zombie tests, they should have been killed by surefire but survived'
There are 1 zombie tests, they should have been killed by surefire but survived
+ echo '************ BEGIN zombies jstack extract'
************ BEGIN zombies jstack extract
++ jps
++ grep surefirebooter
++ cut -d ' ' -f 1
++ xargs -n 1 jstack
++ grep .test
++ grep '\.java'
+ ZB_STACK=' at org.apache.hadoop.hbase.ResourceCheckerJUnitListener.testStarted(ResourceCheckerJUnitListener.java:179)'
+ jps
+ cut -d ' ' -f 1
+ grep surefirebooter
+ xargs -n 1 jstack
12630: No such process
POST BUILD TASK : FAILURE
END OF POST BUILD TASK : 0
Archiving artifacts
Sending artifact delta relative to HBase-TRUNK #5421
Archived 1771 artifacts
Archive block size is 32768
Received 76 blocks and 508188591 bytes
Compression is 0.5%
Took 5 min 3 sec
Recording test results
Updating HBASE-9746
Updating HBASE-7782