You are viewing a plain text version of this content. The canonical link for it is here.
Posted to commits@cayenne.apache.org by Apache Jenkins Server <je...@builds.apache.org> on 2014/05/25 23:41:34 UTC
Build failed in Jenkins: cayenne-master » derby,jdk-1.8.0,Ubuntu #4
See <https://builds.apache.org/job/cayenne-master/cayenneTestConnection=derby,jdk=jdk-1.8.0,label=Ubuntu/4/>
------------------------------------------
[...truncated 97639 lines...]
INFO: UPDATE AUTO_PK_SUPPORT SET NEXT_ID = NEXT_ID + 20 WHERE TABLE_NAME = 'COLLECTION_TO_MANY_TARGET'
May 25, 2014 9:40:58 PM org.apache.cayenne.log.CommonsJdbcEventLogger logUpdateCount
INFO: === updated 1 row.
May 25, 2014 9:40:58 PM org.apache.cayenne.log.CommonsJdbcEventLogger logQuery
INFO: INSERT INTO COLLECTION_TO_MANY_TARGET (COLLECTION_TO_MANY_ID, ID) VALUES (?, ?)
May 25, 2014 9:40:58 PM org.apache.cayenne.log.CommonsJdbcEventLogger logQueryParameters
INFO: [bind: 1->COLLECTION_TO_MANY_ID:1, 2->ID:200]
May 25, 2014 9:40:58 PM org.apache.cayenne.log.CommonsJdbcEventLogger logUpdateCount
INFO: === updated 1 row.
May 25, 2014 9:40:58 PM org.apache.cayenne.log.CommonsJdbcEventLogger logCommitTransaction
INFO: +++ transaction committed.
May 25, 2014 9:40:58 PM org.apache.cayenne.log.CommonsJdbcEventLogger logBeginTransaction
INFO: --- transaction started.
May 25, 2014 9:40:58 PM org.apache.cayenne.log.CommonsJdbcEventLogger logQuery
INFO: SELECT t0.ID FROM COLLECTION_TO_MANY t0 WHERE t0.ID = ? [bind: 1->ID:1]
May 25, 2014 9:40:58 PM org.apache.cayenne.log.CommonsJdbcEventLogger logSelectCount
INFO: === returned 1 row. - took 0 ms.
May 25, 2014 9:40:58 PM org.apache.cayenne.log.CommonsJdbcEventLogger logCommitTransaction
INFO: +++ transaction committed.
May 25, 2014 9:40:58 PM org.apache.cayenne.log.CommonsJdbcEventLogger logBeginTransaction
INFO: --- transaction started.
May 25, 2014 9:40:58 PM org.apache.cayenne.log.CommonsJdbcEventLogger logQuery
INFO: SELECT t0.COLLECTION_TO_MANY_ID, t0.ID FROM COLLECTION_TO_MANY_TARGET t0 WHERE t0.COLLECTION_TO_MANY_ID = ? [bind: 1->COLLECTION_TO_MANY_ID:1]
May 25, 2014 9:40:58 PM org.apache.cayenne.log.CommonsJdbcEventLogger logSelectCount
INFO: === returned 4 rows. - took 0 ms.
May 25, 2014 9:40:58 PM org.apache.cayenne.log.CommonsJdbcEventLogger logCommitTransaction
INFO: +++ transaction committed.
May 25, 2014 9:40:58 PM org.apache.cayenne.configuration.XMLDataChannelDescriptorLoader load
INFO: Loading XML configuration resource from <https://builds.apache.org/job/cayenne-master/cayenneTestConnection=derby,jdk=jdk-1.8.0,label=Ubuntu/ws/framework/cayenne-jdk1.5-unpublished/target/test-classes/cayenne-relationships.xml>
May 25, 2014 9:40:58 PM org.apache.cayenne.configuration.XMLDataChannelDescriptorLoader$DataChannelChildrenHandler createChildTagHandler
INFO: Loading XML DataMap resource from <https://builds.apache.org/job/cayenne-master/cayenneTestConnection=derby,jdk=jdk-1.8.0,label=Ubuntu/ws/framework/cayenne-jdk1.5-unpublished/target/test-classes/relationships.map.xml>
May 25, 2014 9:40:58 PM org.apache.cayenne.map.EntityResolver applyDBLayerDefaults
INFO: added runtime complimentary DbRelationship from DELETE_RULE_TEST3 to DELETE_RULE_TEST1
May 25, 2014 9:40:58 PM org.apache.cayenne.map.EntityResolver applyObjectLayerDefaults
INFO: added runtime complimentary ObjRelationship from FlattenedTest3 to FlattenedTest1
May 25, 2014 9:40:58 PM org.apache.cayenne.map.EntityResolver applyObjectLayerDefaults
INFO: added runtime complimentary ObjRelationship from FlattenedTest4 to FlattenedTest1
May 25, 2014 9:40:58 PM org.apache.cayenne.test.jdbc.UtilityLogger log
INFO: delete from COLLECTION_TO_MANY_TARGET
May 25, 2014 9:40:58 PM org.apache.cayenne.test.jdbc.UtilityLogger log
INFO: delete from COLLECTION_TO_MANY
May 25, 2014 9:40:58 PM org.apache.cayenne.test.jdbc.UtilityLogger log
INFO: INSERT INTO COLLECTION_TO_MANY (ID) VALUES (?)
May 25, 2014 9:40:58 PM org.apache.cayenne.test.jdbc.UtilityLogger log
INFO: INSERT INTO COLLECTION_TO_MANY (ID) VALUES (?)
May 25, 2014 9:40:58 PM org.apache.cayenne.test.jdbc.UtilityLogger log
INFO: INSERT INTO COLLECTION_TO_MANY_TARGET (ID, COLLECTION_TO_MANY_ID) VALUES (?, ?)
May 25, 2014 9:40:58 PM org.apache.cayenne.test.jdbc.UtilityLogger log
INFO: INSERT INTO COLLECTION_TO_MANY_TARGET (ID, COLLECTION_TO_MANY_ID) VALUES (?, ?)
May 25, 2014 9:40:58 PM org.apache.cayenne.test.jdbc.UtilityLogger log
INFO: INSERT INTO COLLECTION_TO_MANY_TARGET (ID, COLLECTION_TO_MANY_ID) VALUES (?, ?)
May 25, 2014 9:40:58 PM org.apache.cayenne.test.jdbc.UtilityLogger log
INFO: INSERT INTO COLLECTION_TO_MANY_TARGET (ID, COLLECTION_TO_MANY_ID) VALUES (?, ?)
May 25, 2014 9:40:58 PM org.apache.cayenne.log.CommonsJdbcEventLogger logBeginTransaction
INFO: --- transaction started.
May 25, 2014 9:40:58 PM org.apache.cayenne.log.CommonsJdbcEventLogger logQuery
INFO: SELECT t0.ID FROM COLLECTION_TO_MANY t0 WHERE t0.ID = ? [bind: 1->ID:1]
May 25, 2014 9:40:58 PM org.apache.cayenne.log.CommonsJdbcEventLogger logSelectCount
INFO: === returned 1 row. - took 1 ms.
May 25, 2014 9:40:58 PM org.apache.cayenne.log.CommonsJdbcEventLogger logCommitTransaction
INFO: +++ transaction committed.
May 25, 2014 9:40:58 PM org.apache.cayenne.log.CommonsJdbcEventLogger logBeginTransaction
INFO: --- transaction started.
May 25, 2014 9:40:58 PM org.apache.cayenne.log.CommonsJdbcEventLogger logQuery
INFO: SELECT t0.COLLECTION_TO_MANY_ID, t0.ID FROM COLLECTION_TO_MANY_TARGET t0 WHERE t0.COLLECTION_TO_MANY_ID = ? [bind: 1->COLLECTION_TO_MANY_ID:1]
May 25, 2014 9:40:58 PM org.apache.cayenne.log.CommonsJdbcEventLogger logSelectCount
INFO: === returned 3 rows. - took 0 ms.
May 25, 2014 9:40:58 PM org.apache.cayenne.log.CommonsJdbcEventLogger logCommitTransaction
INFO: +++ transaction committed.
May 25, 2014 9:40:58 PM org.apache.cayenne.log.CommonsJdbcEventLogger logBeginTransaction
INFO: --- transaction started.
May 25, 2014 9:40:58 PM org.apache.cayenne.log.CommonsJdbcEventLogger logQuery
INFO: UPDATE COLLECTION_TO_MANY_TARGET SET COLLECTION_TO_MANY_ID = ? WHERE ID = ?
May 25, 2014 9:40:58 PM org.apache.cayenne.log.CommonsJdbcEventLogger logQueryParameters
INFO: [bind: 1->COLLECTION_TO_MANY_ID:NULL, 2->ID:2]
May 25, 2014 9:40:58 PM org.apache.cayenne.log.CommonsJdbcEventLogger logUpdateCount
INFO: === updated 1 row.
May 25, 2014 9:40:58 PM org.apache.cayenne.log.CommonsJdbcEventLogger logCommitTransaction
INFO: +++ transaction committed.
May 25, 2014 9:40:58 PM org.apache.cayenne.log.CommonsJdbcEventLogger logBeginTransaction
INFO: --- transaction started.
May 25, 2014 9:40:58 PM org.apache.cayenne.log.CommonsJdbcEventLogger logQuery
INFO: SELECT t0.ID FROM COLLECTION_TO_MANY t0 WHERE t0.ID = ? [bind: 1->ID:1]
May 25, 2014 9:40:58 PM org.apache.cayenne.log.CommonsJdbcEventLogger logSelectCount
INFO: === returned 1 row. - took 0 ms.
May 25, 2014 9:40:58 PM org.apache.cayenne.log.CommonsJdbcEventLogger logCommitTransaction
INFO: +++ transaction committed.
May 25, 2014 9:40:58 PM org.apache.cayenne.log.CommonsJdbcEventLogger logBeginTransaction
INFO: --- transaction started.
May 25, 2014 9:40:58 PM org.apache.cayenne.log.CommonsJdbcEventLogger logQuery
INFO: SELECT t0.COLLECTION_TO_MANY_ID, t0.ID FROM COLLECTION_TO_MANY_TARGET t0 WHERE t0.COLLECTION_TO_MANY_ID = ? [bind: 1->COLLECTION_TO_MANY_ID:1]
May 25, 2014 9:40:58 PM org.apache.cayenne.log.CommonsJdbcEventLogger logSelectCount
INFO: === returned 2 rows. - took 0 ms.
May 25, 2014 9:40:58 PM org.apache.cayenne.log.CommonsJdbcEventLogger logCommitTransaction
INFO: +++ transaction committed.
May 25, 2014 9:40:58 PM org.apache.cayenne.configuration.XMLDataChannelDescriptorLoader load
INFO: Loading XML configuration resource from <https://builds.apache.org/job/cayenne-master/cayenneTestConnection=derby,jdk=jdk-1.8.0,label=Ubuntu/ws/framework/cayenne-jdk1.5-unpublished/target/test-classes/cayenne-relationships.xml>
May 25, 2014 9:40:58 PM org.apache.cayenne.configuration.XMLDataChannelDescriptorLoader$DataChannelChildrenHandler createChildTagHandler
INFO: Loading XML DataMap resource from <https://builds.apache.org/job/cayenne-master/cayenneTestConnection=derby,jdk=jdk-1.8.0,label=Ubuntu/ws/framework/cayenne-jdk1.5-unpublished/target/test-classes/relationships.map.xml>
May 25, 2014 9:40:58 PM org.apache.cayenne.map.EntityResolver applyDBLayerDefaults
INFO: added runtime complimentary DbRelationship from DELETE_RULE_TEST3 to DELETE_RULE_TEST1
May 25, 2014 9:40:58 PM org.apache.cayenne.map.EntityResolver applyObjectLayerDefaults
INFO: added runtime complimentary ObjRelationship from FlattenedTest3 to FlattenedTest1
May 25, 2014 9:40:58 PM org.apache.cayenne.map.EntityResolver applyObjectLayerDefaults
INFO: added runtime complimentary ObjRelationship from FlattenedTest4 to FlattenedTest1
May 25, 2014 9:40:58 PM org.apache.cayenne.test.jdbc.UtilityLogger log
INFO: delete from COLLECTION_TO_MANY_TARGET
May 25, 2014 9:40:58 PM org.apache.cayenne.test.jdbc.UtilityLogger log
INFO: delete from COLLECTION_TO_MANY
May 25, 2014 9:40:58 PM org.apache.cayenne.test.jdbc.UtilityLogger log
INFO: INSERT INTO COLLECTION_TO_MANY (ID) VALUES (?)
May 25, 2014 9:40:58 PM org.apache.cayenne.test.jdbc.UtilityLogger log
INFO: INSERT INTO COLLECTION_TO_MANY (ID) VALUES (?)
May 25, 2014 9:40:58 PM org.apache.cayenne.test.jdbc.UtilityLogger log
INFO: INSERT INTO COLLECTION_TO_MANY_TARGET (ID, COLLECTION_TO_MANY_ID) VALUES (?, ?)
May 25, 2014 9:40:58 PM org.apache.cayenne.test.jdbc.UtilityLogger log
INFO: INSERT INTO COLLECTION_TO_MANY_TARGET (ID, COLLECTION_TO_MANY_ID) VALUES (?, ?)
May 25, 2014 9:40:58 PM org.apache.cayenne.test.jdbc.UtilityLogger log
INFO: INSERT INTO COLLECTION_TO_MANY_TARGET (ID, COLLECTION_TO_MANY_ID) VALUES (?, ?)
May 25, 2014 9:40:58 PM org.apache.cayenne.test.jdbc.UtilityLogger log
INFO: INSERT INTO COLLECTION_TO_MANY_TARGET (ID, COLLECTION_TO_MANY_ID) VALUES (?, ?)
May 25, 2014 9:40:58 PM org.apache.cayenne.log.CommonsJdbcEventLogger logBeginTransaction
INFO: --- transaction started.
May 25, 2014 9:40:58 PM org.apache.cayenne.log.CommonsJdbcEventLogger logQuery
INFO: SELECT t0.ID FROM COLLECTION_TO_MANY t0 WHERE t0.ID = ? [bind: 1->ID:1]
May 25, 2014 9:40:58 PM org.apache.cayenne.log.CommonsJdbcEventLogger logSelectCount
INFO: === returned 1 row. - took 0 ms.
May 25, 2014 9:40:58 PM org.apache.cayenne.log.CommonsJdbcEventLogger logCommitTransaction
INFO: +++ transaction committed.
May 25, 2014 9:40:58 PM org.apache.cayenne.log.CommonsJdbcEventLogger logBeginTransaction
INFO: --- transaction started.
May 25, 2014 9:40:58 PM org.apache.cayenne.log.CommonsJdbcEventLogger logQuery
INFO: SELECT t0.COLLECTION_TO_MANY_ID, t0.ID FROM COLLECTION_TO_MANY_TARGET t0 WHERE t0.COLLECTION_TO_MANY_ID = ? [bind: 1->COLLECTION_TO_MANY_ID:1]
May 25, 2014 9:40:58 PM org.apache.cayenne.log.CommonsJdbcEventLogger logSelectCount
INFO: === returned 3 rows. - took 0 ms.
May 25, 2014 9:40:58 PM org.apache.cayenne.log.CommonsJdbcEventLogger logCommitTransaction
INFO: +++ transaction committed.
May 25, 2014 9:40:58 PM org.apache.cayenne.log.CommonsJdbcEventLogger logBeginTransaction
INFO: --- transaction started.
May 25, 2014 9:40:58 PM org.apache.cayenne.log.CommonsJdbcEventLogger logQuery
INFO: INSERT INTO COLLECTION_TO_MANY_TARGET (COLLECTION_TO_MANY_ID, ID) VALUES (?, ?)
May 25, 2014 9:40:58 PM org.apache.cayenne.log.CommonsJdbcEventLogger logQueryParameters
INFO: [bind: 1->COLLECTION_TO_MANY_ID:1, 2->ID:201]
May 25, 2014 9:40:58 PM org.apache.cayenne.log.CommonsJdbcEventLogger logUpdateCount
INFO: === updated 1 row.
May 25, 2014 9:40:58 PM org.apache.cayenne.log.CommonsJdbcEventLogger logCommitTransaction
INFO: +++ transaction committed.
May 25, 2014 9:40:58 PM org.apache.cayenne.log.CommonsJdbcEventLogger logBeginTransaction
INFO: --- transaction started.
May 25, 2014 9:40:58 PM org.apache.cayenne.log.CommonsJdbcEventLogger logQuery
INFO: SELECT t0.ID FROM COLLECTION_TO_MANY t0 WHERE t0.ID = ? [bind: 1->ID:1]
May 25, 2014 9:40:58 PM org.apache.cayenne.log.CommonsJdbcEventLogger logSelectCount
INFO: === returned 1 row. - took 0 ms.
May 25, 2014 9:40:58 PM org.apache.cayenne.log.CommonsJdbcEventLogger logCommitTransaction
INFO: +++ transaction committed.
May 25, 2014 9:40:58 PM org.apache.cayenne.log.CommonsJdbcEventLogger logBeginTransaction
INFO: --- transaction started.
May 25, 2014 9:40:58 PM org.apache.cayenne.log.CommonsJdbcEventLogger logQuery
INFO: SELECT t0.COLLECTION_TO_MANY_ID, t0.ID FROM COLLECTION_TO_MANY_TARGET t0 WHERE t0.COLLECTION_TO_MANY_ID = ? [bind: 1->COLLECTION_TO_MANY_ID:1]
May 25, 2014 9:40:58 PM org.apache.cayenne.log.CommonsJdbcEventLogger logSelectCount
INFO: === returned 4 rows. - took 0 ms.
May 25, 2014 9:40:58 PM org.apache.cayenne.log.CommonsJdbcEventLogger logCommitTransaction
INFO: +++ transaction committed.
[INFO] ------------------------------------------------------------------------
[INFO] Reactor Summary:
[INFO]
[INFO] Cayenne ........................................... SUCCESS [0.171s]
[INFO] Common Unit Test Utilities ........................ SUCCESS [1.562s]
[INFO] Cayenne Internal Build Plugin ..................... SUCCESS [1.368s]
[INFO] Cayenne Build Tools Parent ........................ SUCCESS [0.006s]
[INFO] Cayenne License and Notice Bundle ................. SUCCESS [0.647s]
[INFO] Cayenne Dependency Injection Container ............ SUCCESS [2.422s]
[INFO] Cayenne Java 1.5 Unpublished ...................... FAILURE [8:59.448s]
[INFO] Cayenne WebObjects Compatibility Library .......... SKIPPED
[INFO] Cayenne Aggregated Server Jar ..................... SKIPPED
[INFO] Cayenne Aggregated Client Jar ..................... SKIPPED
[INFO] Cayenne Project ................................... SKIPPED
[INFO] Cayenne Tools ..................................... SKIPPED
[INFO] Library: cayenne-lifecycle ........................ SKIPPED
[INFO] Cayenne Maven Plugin .............................. SKIPPED
[INFO] Cayenne Framework Aggregator Project .............. SKIPPED
[INFO] Cayenne Integration Tests Parent .................. SKIPPED
[INFO] Integration Tests - Cayenne Runtime ............... SKIPPED
[INFO] Integration Tests - Cayenne Tools ................. SKIPPED
[INFO] Cayenne Modeler ................................... SKIPPED
[INFO] Cayenne Modeler Maven Plugin ...................... SKIPPED
[INFO] Cayenne Modeler Parent ............................ SKIPPED
[INFO] Cayenne Tutorial .................................. SKIPPED
[INFO] Cayenne ROP Server Tutorial ....................... SKIPPED
[INFO] Cayenne ROP Client Tutorial ....................... SKIPPED
[INFO] Cayenne Tutorials ................................. SKIPPED
[INFO] Cayenne Documentation ............................. SKIPPED
[INFO] Cayenne Documenation Parent ....................... SKIPPED
[INFO] Cayenne Docbook Documentation ..................... SKIPPED
[INFO] Docbook: Cayenne Stylesheets ...................... SKIPPED
[INFO] Docbook: Cayenne Guide ............................ SKIPPED
[INFO] Docbook: Getting Started with Cayenne ............. SKIPPED
[INFO] Docbook: Getting Started with Cayenne ROP ......... SKIPPED
[INFO] Docbook: Cayenne New Features and Upgrade Guide ... SKIPPED
[INFO] ------------------------------------------------------------------------
[INFO] BUILD FAILURE
[INFO] ------------------------------------------------------------------------
[INFO] Total time: 9:06.370s
[INFO] Finished at: Sun May 25 21:40:59 UTC 2014
[INFO] Final Memory: 54M/257M
[INFO] ------------------------------------------------------------------------
[ERROR] Failed to execute goal org.apache.maven.plugins:maven-surefire-plugin:2.5:test (default-test) on project cayenne-jdk1.5-unpublished: There are test failures.
[ERROR]
[ERROR] Please refer to <https://builds.apache.org/job/cayenne-master/cayenneTestConnection=derby,jdk=jdk-1.8.0,label=Ubuntu/ws/framework/cayenne-jdk1.5-unpublished/target/surefire-reports> for the individual test results.
[ERROR] -> [Help 1]
org.apache.maven.lifecycle.LifecycleExecutionException: Failed to execute goal org.apache.maven.plugins:maven-surefire-plugin:2.5:test (default-test) on project cayenne-jdk1.5-unpublished: There are test failures.
Please refer to <https://builds.apache.org/job/cayenne-master/cayenneTestConnection=derby,jdk=jdk-1.8.0,label=Ubuntu/ws/framework/cayenne-jdk1.5-unpublished/target/surefire-reports> for the individual test results.
at org.apache.maven.lifecycle.internal.MojoExecutor.execute(MojoExecutor.java:213)
at org.apache.maven.lifecycle.internal.MojoExecutor.execute(MojoExecutor.java:153)
at org.apache.maven.lifecycle.internal.MojoExecutor.execute(MojoExecutor.java:145)
at org.apache.maven.lifecycle.internal.LifecycleModuleBuilder.buildProject(LifecycleModuleBuilder.java:84)
at org.apache.maven.lifecycle.internal.LifecycleModuleBuilder.buildProject(LifecycleModuleBuilder.java:59)
at org.apache.maven.lifecycle.internal.LifecycleStarter.singleThreadedBuild(LifecycleStarter.java:183)
at org.apache.maven.lifecycle.internal.LifecycleStarter.execute(LifecycleStarter.java:161)
at org.apache.maven.DefaultMaven.doExecute(DefaultMaven.java:320)
at org.apache.maven.DefaultMaven.execute(DefaultMaven.java:156)
at org.apache.maven.cli.MavenCli.execute(MavenCli.java:537)
at org.apache.maven.cli.MavenCli.doMain(MavenCli.java:196)
at org.apache.maven.cli.MavenCli.main(MavenCli.java:141)
at sun.reflect.NativeMethodAccessorImpl.invoke0(Native Method)
at sun.reflect.NativeMethodAccessorImpl.invoke(NativeMethodAccessorImpl.java:62)
at sun.reflect.DelegatingMethodAccessorImpl.invoke(DelegatingMethodAccessorImpl.java:43)
at java.lang.reflect.Method.invoke(Method.java:483)
at org.codehaus.plexus.classworlds.launcher.Launcher.launchEnhanced(Launcher.java:290)
at org.codehaus.plexus.classworlds.launcher.Launcher.launch(Launcher.java:230)
at org.codehaus.plexus.classworlds.launcher.Launcher.mainWithExitCode(Launcher.java:409)
at org.codehaus.plexus.classworlds.launcher.Launcher.main(Launcher.java:352)
Caused by: org.apache.maven.plugin.MojoFailureException: There are test failures.
Please refer to <https://builds.apache.org/job/cayenne-master/cayenneTestConnection=derby,jdk=jdk-1.8.0,label=Ubuntu/ws/framework/cayenne-jdk1.5-unpublished/target/surefire-reports> for the individual test results.
at org.apache.maven.plugin.surefire.SurefirePlugin.execute(SurefirePlugin.java:629)
at org.apache.maven.plugin.DefaultBuildPluginManager.executeMojo(DefaultBuildPluginManager.java:101)
at org.apache.maven.lifecycle.internal.MojoExecutor.execute(MojoExecutor.java:209)
... 19 more
[ERROR]
[ERROR] Re-run Maven using the -X switch to enable full debug logging.
[ERROR]
[ERROR] For more information about the errors and possible solutions, please read the following articles:
[ERROR] [Help 1] http://cwiki.apache.org/confluence/display/MAVEN/MojoFailureException
[ERROR]
[ERROR] After correcting the problems, you can resume the build with the command
[ERROR] mvn <goals> -rf :cayenne-jdk1.5-unpublished
Build step 'Invoke top-level Maven targets' marked build as failure
Build failed in Jenkins: cayenne-master » derby,jdk-1.8.0,Ubuntu #8
Posted by Apache Jenkins Server <je...@builds.apache.org>.
See <https://builds.apache.org/job/cayenne-master/cayenneTestConnection=derby,jdk=jdk-1.8.0,label=Ubuntu/8/>
------------------------------------------
[...truncated 65357 lines...]
May 26, 2014 2:37:13 AM org.apache.cayenne.configuration.XMLDataChannelDescriptorLoader$DataChannelChildrenHandler createChildTagHandler
INFO: Loading XML DataMap resource from <https://builds.apache.org/job/cayenne-master/cayenneTestConnection=derby,jdk=jdk-1.8.0,label=Ubuntu/ws/cayenne-server/target/test-classes/tstmap.map.xml>
May 26, 2014 2:37:13 AM org.apache.cayenne.map.EntityResolver applyDBLayerDefaults
INFO: added runtime complimentary DbRelationship from ARTIST to PAINTING1
Tests run: 2, Failures: 0, Errors: 0, Skipped: 0, Time elapsed: 0.019 sec
Running org.apache.cayenne.access.DataContextObjectIdQueryTest
May 26, 2014 2:37:13 AM org.apache.cayenne.configuration.XMLDataChannelDescriptorLoader load
INFO: Loading XML configuration resource from <https://builds.apache.org/job/cayenne-master/cayenneTestConnection=derby,jdk=jdk-1.8.0,label=Ubuntu/ws/cayenne-server/target/test-classes/cayenne-testmap.xml>
May 26, 2014 2:37:13 AM org.apache.cayenne.configuration.XMLDataChannelDescriptorLoader$DataChannelChildrenHandler createChildTagHandler
INFO: Loading XML DataMap resource from <https://builds.apache.org/job/cayenne-master/cayenneTestConnection=derby,jdk=jdk-1.8.0,label=Ubuntu/ws/cayenne-server/target/test-classes/tstmap.map.xml>
May 26, 2014 2:37:13 AM org.apache.cayenne.map.EntityResolver applyDBLayerDefaults
INFO: added runtime complimentary DbRelationship from ARTIST to PAINTING1
May 26, 2014 2:37:13 AM org.apache.cayenne.test.jdbc.UtilityLogger log
INFO: delete from PAINTING_INFO
May 26, 2014 2:37:13 AM org.apache.cayenne.test.jdbc.UtilityLogger log
INFO: delete from PAINTING
May 26, 2014 2:37:13 AM org.apache.cayenne.test.jdbc.UtilityLogger log
INFO: delete from PAINTING1
May 26, 2014 2:37:13 AM org.apache.cayenne.test.jdbc.UtilityLogger log
INFO: delete from ARTIST_EXHIBIT
May 26, 2014 2:37:13 AM org.apache.cayenne.test.jdbc.UtilityLogger log
INFO: delete from ARTIST_GROUP
May 26, 2014 2:37:13 AM org.apache.cayenne.test.jdbc.UtilityLogger log
INFO: delete from ARTIST
May 26, 2014 2:37:13 AM org.apache.cayenne.log.CommonsJdbcEventLogger logBeginTransaction
INFO: --- transaction started.
May 26, 2014 2:37:13 AM org.apache.cayenne.log.CommonsJdbcEventLogger logQuery
INFO: INSERT INTO ARTIST (ARTIST_ID, ARTIST_NAME, DATE_OF_BIRTH) VALUES (44, 'X', ?) [bind: 1:'2014-05-26 02:37:13.996']
May 26, 2014 2:37:14 AM org.apache.cayenne.log.CommonsJdbcEventLogger logUpdateCount
INFO: === updated 1 row.
May 26, 2014 2:37:14 AM org.apache.cayenne.log.CommonsJdbcEventLogger logCommitTransaction
INFO: +++ transaction committed.
May 26, 2014 2:37:14 AM org.apache.cayenne.log.CommonsJdbcEventLogger logBeginTransaction
INFO: --- transaction started.
May 26, 2014 2:37:14 AM org.apache.cayenne.log.CommonsJdbcEventLogger logQuery
INFO: SELECT t0.ARTIST_NAME, t0.DATE_OF_BIRTH, t0.ARTIST_ID FROM ARTIST t0 WHERE t0.ARTIST_ID = ? [bind: 1->ARTIST_ID:44]
May 26, 2014 2:37:14 AM org.apache.cayenne.log.CommonsJdbcEventLogger logSelectCount
INFO: === returned 1 row. - took 4 ms.
May 26, 2014 2:37:14 AM org.apache.cayenne.log.CommonsJdbcEventLogger logCommitTransaction
INFO: +++ transaction committed.
May 26, 2014 2:37:14 AM org.apache.cayenne.log.CommonsJdbcEventLogger logBeginTransaction
INFO: --- transaction started.
May 26, 2014 2:37:14 AM org.apache.cayenne.log.CommonsJdbcEventLogger logQuery
INFO: UPDATE ARTIST SET DATE_OF_BIRTH = NULL
May 26, 2014 2:37:14 AM org.apache.cayenne.log.CommonsJdbcEventLogger logUpdateCount
INFO: === updated 1 row.
May 26, 2014 2:37:14 AM org.apache.cayenne.log.CommonsJdbcEventLogger logCommitTransaction
INFO: +++ transaction committed.
May 26, 2014 2:37:14 AM org.apache.cayenne.log.CommonsJdbcEventLogger logBeginTransaction
INFO: --- transaction started.
May 26, 2014 2:37:14 AM org.apache.cayenne.log.CommonsJdbcEventLogger logQuery
INFO: SELECT t0.ARTIST_NAME, t0.DATE_OF_BIRTH, t0.ARTIST_ID FROM ARTIST t0 WHERE t0.ARTIST_ID = ? [bind: 1->ARTIST_ID:44]
May 26, 2014 2:37:14 AM org.apache.cayenne.log.CommonsJdbcEventLogger logSelectCount
INFO: === returned 1 row. - took 1 ms.
May 26, 2014 2:37:14 AM org.apache.cayenne.log.CommonsJdbcEventLogger logCommitTransaction
INFO: +++ transaction committed.
May 26, 2014 2:37:14 AM org.apache.cayenne.configuration.XMLDataChannelDescriptorLoader load
INFO: Loading XML configuration resource from <https://builds.apache.org/job/cayenne-master/cayenneTestConnection=derby,jdk=jdk-1.8.0,label=Ubuntu/ws/cayenne-server/target/test-classes/cayenne-testmap.xml>
May 26, 2014 2:37:14 AM org.apache.cayenne.configuration.XMLDataChannelDescriptorLoader$DataChannelChildrenHandler createChildTagHandler
INFO: Loading XML DataMap resource from <https://builds.apache.org/job/cayenne-master/cayenneTestConnection=derby,jdk=jdk-1.8.0,label=Ubuntu/ws/cayenne-server/target/test-classes/tstmap.map.xml>
May 26, 2014 2:37:14 AM org.apache.cayenne.map.EntityResolver applyDBLayerDefaults
INFO: added runtime complimentary DbRelationship from ARTIST to PAINTING1
May 26, 2014 2:37:14 AM org.apache.cayenne.test.jdbc.UtilityLogger log
INFO: delete from PAINTING_INFO
May 26, 2014 2:37:14 AM org.apache.cayenne.test.jdbc.UtilityLogger log
INFO: delete from PAINTING
May 26, 2014 2:37:14 AM org.apache.cayenne.test.jdbc.UtilityLogger log
INFO: delete from PAINTING1
May 26, 2014 2:37:14 AM org.apache.cayenne.test.jdbc.UtilityLogger log
INFO: delete from ARTIST_EXHIBIT
May 26, 2014 2:37:14 AM org.apache.cayenne.test.jdbc.UtilityLogger log
INFO: delete from ARTIST_GROUP
May 26, 2014 2:37:14 AM org.apache.cayenne.test.jdbc.UtilityLogger log
INFO: delete from ARTIST
May 26, 2014 2:37:14 AM org.apache.cayenne.log.CommonsJdbcEventLogger logBeginTransaction
INFO: --- transaction started.
May 26, 2014 2:37:14 AM org.apache.cayenne.log.CommonsJdbcEventLogger logQuery
INFO: INSERT INTO ARTIST (ARTIST_ID, ARTIST_NAME, DATE_OF_BIRTH) VALUES (?, ?, ?)
May 26, 2014 2:37:14 AM org.apache.cayenne.log.CommonsJdbcEventLogger logQueryParameters
INFO: [batch bind: 1->ARTIST_ID:271, 2->ARTIST_NAME:'X', 3->DATE_OF_BIRTH:'2014-05-26 02:37:14.435']
May 26, 2014 2:37:14 AM org.apache.cayenne.log.CommonsJdbcEventLogger logUpdateCount
INFO: === updated 1 row.
May 26, 2014 2:37:14 AM org.apache.cayenne.log.CommonsJdbcEventLogger logCommitTransaction
INFO: +++ transaction committed.
May 26, 2014 2:37:14 AM org.apache.cayenne.log.CommonsJdbcEventLogger logBeginTransaction
INFO: --- transaction started.
May 26, 2014 2:37:14 AM org.apache.cayenne.log.CommonsJdbcEventLogger logQuery
INFO: UPDATE ARTIST SET DATE_OF_BIRTH = NULL
May 26, 2014 2:37:14 AM org.apache.cayenne.log.CommonsJdbcEventLogger logUpdateCount
INFO: === updated 1 row.
May 26, 2014 2:37:14 AM org.apache.cayenne.log.CommonsJdbcEventLogger logCommitTransaction
INFO: +++ transaction committed.
May 26, 2014 2:37:14 AM org.apache.cayenne.log.CommonsJdbcEventLogger logBeginTransaction
INFO: --- transaction started.
May 26, 2014 2:37:14 AM org.apache.cayenne.log.CommonsJdbcEventLogger logQuery
INFO: SELECT t0.ARTIST_NAME, t0.DATE_OF_BIRTH, t0.ARTIST_ID FROM ARTIST t0 WHERE t0.ARTIST_ID = ? [bind: 1->ARTIST_ID:271]
May 26, 2014 2:37:14 AM org.apache.cayenne.log.CommonsJdbcEventLogger logSelectCount
INFO: === returned 1 row. - took 1 ms.
May 26, 2014 2:37:14 AM org.apache.cayenne.log.CommonsJdbcEventLogger logCommitTransaction
INFO: +++ transaction committed.
May 26, 2014 2:37:14 AM org.apache.cayenne.configuration.XMLDataChannelDescriptorLoader load
INFO: Loading XML configuration resource from <https://builds.apache.org/job/cayenne-master/cayenneTestConnection=derby,jdk=jdk-1.8.0,label=Ubuntu/ws/cayenne-server/target/test-classes/cayenne-testmap.xml>
May 26, 2014 2:37:14 AM org.apache.cayenne.configuration.XMLDataChannelDescriptorLoader$DataChannelChildrenHandler createChildTagHandler
INFO: Loading XML DataMap resource from <https://builds.apache.org/job/cayenne-master/cayenneTestConnection=derby,jdk=jdk-1.8.0,label=Ubuntu/ws/cayenne-server/target/test-classes/tstmap.map.xml>
May 26, 2014 2:37:14 AM org.apache.cayenne.map.EntityResolver applyDBLayerDefaults
INFO: added runtime complimentary DbRelationship from ARTIST to PAINTING1
May 26, 2014 2:37:14 AM org.apache.cayenne.test.jdbc.UtilityLogger log
INFO: delete from PAINTING_INFO
May 26, 2014 2:37:14 AM org.apache.cayenne.test.jdbc.UtilityLogger log
INFO: delete from PAINTING
May 26, 2014 2:37:14 AM org.apache.cayenne.test.jdbc.UtilityLogger log
INFO: delete from PAINTING1
May 26, 2014 2:37:14 AM org.apache.cayenne.test.jdbc.UtilityLogger log
INFO: delete from ARTIST_EXHIBIT
May 26, 2014 2:37:14 AM org.apache.cayenne.test.jdbc.UtilityLogger log
INFO: delete from ARTIST_GROUP
May 26, 2014 2:37:14 AM org.apache.cayenne.test.jdbc.UtilityLogger log
INFO: delete from ARTIST
May 26, 2014 2:37:14 AM org.apache.cayenne.log.CommonsJdbcEventLogger logBeginTransaction
INFO: --- transaction started.
May 26, 2014 2:37:14 AM org.apache.cayenne.log.CommonsJdbcEventLogger logQuery
INFO: INSERT INTO ARTIST (ARTIST_ID, ARTIST_NAME, DATE_OF_BIRTH) VALUES (?, ?, ?)
May 26, 2014 2:37:14 AM org.apache.cayenne.log.CommonsJdbcEventLogger logQueryParameters
INFO: [batch bind: 1->ARTIST_ID:272, 2->ARTIST_NAME:'X', 3->DATE_OF_BIRTH:NULL]
May 26, 2014 2:37:14 AM org.apache.cayenne.log.CommonsJdbcEventLogger logUpdateCount
INFO: === updated 1 row.
May 26, 2014 2:37:14 AM org.apache.cayenne.log.CommonsJdbcEventLogger logCommitTransaction
INFO: +++ transaction committed.
May 26, 2014 2:37:14 AM org.apache.cayenne.log.CommonsJdbcEventLogger logBeginTransaction
INFO: --- transaction started.
May 26, 2014 2:37:14 AM org.apache.cayenne.log.CommonsJdbcEventLogger logQuery
INFO: UPDATE ARTIST SET ARTIST_NAME = 'Y'
May 26, 2014 2:37:14 AM org.apache.cayenne.log.CommonsJdbcEventLogger logUpdateCount
INFO: === updated 1 row.
May 26, 2014 2:37:14 AM org.apache.cayenne.log.CommonsJdbcEventLogger logCommitTransaction
INFO: +++ transaction committed.
Tests run: 3, Failures: 0, Errors: 0, Skipped: 0, Time elapsed: 0.957 sec
Running org.apache.cayenne.cache.MapQueryCacheTest
Tests run: 1, Failures: 0, Errors: 0, Skipped: 0, Time elapsed: 0.004 sec
Running org.apache.cayenne.reflect.PropertyUtilsTest
Tests run: 10, Failures: 0, Errors: 0, Skipped: 0, Time elapsed: 0.014 sec
Results :
Tests in error:
testNullifyToOne(org.apache.cayenne.access.DataContextDeleteRulesTest)
testDenyToMany(org.apache.cayenne.access.DataContextDeleteRulesTest)
testCascadeToManyFlattened(org.apache.cayenne.access.DataContextDeleteRulesTest)
testNullifyToMany(org.apache.cayenne.access.DataContextDeleteRulesTest)
testNullifyToManyFlattened(org.apache.cayenne.access.DataContextDeleteRulesTest)
testCascadeToMany(org.apache.cayenne.access.DataContextDeleteRulesTest)
testCascadeToOne(org.apache.cayenne.access.DataContextDeleteRulesTest)
testSelectWithOuterJoinFromString(org.apache.cayenne.access.DataContextOuterJoinsTest)
testSelectWithOuterJoinFlattened(org.apache.cayenne.access.DataContextOuterJoinsTest)
testSelectWithOuterOrdering(org.apache.cayenne.access.DataContextOuterJoinsTest)
testSelectWithOuterJoin(org.apache.cayenne.access.DataContextOuterJoinsTest)
testNullClob(org.apache.cayenne.access.DataContextClobTest)
testEmptyClob(org.apache.cayenne.access.DataContextClobTest)
test5KByteClob(org.apache.cayenne.access.DataContextClobTest)
test5ByteClob(org.apache.cayenne.access.DataContextClobTest)
test1MBClob(org.apache.cayenne.access.DataContextClobTest)
testReadRelationship(org.apache.cayenne.CDOOneToManyFKTest)
Tests run: 2053, Failures: 0, Errors: 17, Skipped: 0
[INFO] ------------------------------------------------------------------------
[INFO] Reactor Summary:
[INFO]
[INFO] Cayenne ........................................... SUCCESS [0.325s]
[INFO] Cayenne Build Tools Parent ........................ SUCCESS [0.010s]
[INFO] Cayenne License and Notice Bundle ................. SUCCESS [1.292s]
[INFO] Common Unit Test Utilities ........................ SUCCESS [1.067s]
[INFO] Cayenne Dependency Injection Container ............ SUCCESS [3.359s]
[INFO] Cayenne Server .................................... FAILURE [11:28.149s]
[INFO] Cayenne ROP Client ................................ SKIPPED
[INFO] Cayenne Project ................................... SKIPPED
[INFO] Cayenne Tools ..................................... SKIPPED
[INFO] Cayenne Lifecycle Utilities ....................... SKIPPED
[INFO] Cayenne Maven Plugins ............................. SKIPPED
[INFO] Cayenne Maven Plugin .............................. SKIPPED
[INFO] Cayenne Cryptography Extensions ................... SKIPPED
[INFO] Cayenne Integration Tests Parent .................. SKIPPED
[INFO] Integration Tests - Cayenne Tools ................. SKIPPED
[INFO] Cayenne Modeler Parent ............................ SKIPPED
[INFO] Cayenne WebObjects Compatibility Library .......... SKIPPED
[INFO] Cayenne Modeler ................................... SKIPPED
[INFO] Cayenne Modeler Maven Plugin ...................... SKIPPED
[INFO] Cayenne Tutorial .................................. SKIPPED
[INFO] Cayenne ROP Server Tutorial ....................... SKIPPED
[INFO] Cayenne ROP Client Tutorial ....................... SKIPPED
[INFO] Cayenne Tutorials ................................. SKIPPED
[INFO] Cayenne Documenation Parent ....................... SKIPPED
[INFO] Cayenne Documentation ............................. SKIPPED
[INFO] Cayenne Docbook Documentation ..................... SKIPPED
[INFO] Docbook: Cayenne Stylesheets ...................... SKIPPED
[INFO] Docbook: Cayenne Guide ............................ SKIPPED
[INFO] Docbook: Getting Started with Cayenne ............. SKIPPED
[INFO] Docbook: Getting Started with Cayenne ROP ......... SKIPPED
[INFO] Docbook: Cayenne New Features and Upgrade Guide ... SKIPPED
[INFO] ------------------------------------------------------------------------
[INFO] BUILD FAILURE
[INFO] ------------------------------------------------------------------------
[INFO] Total time: 11:34.831s
[INFO] Finished at: Mon May 26 02:37:15 UTC 2014
[INFO] Final Memory: 50M/219M
[INFO] ------------------------------------------------------------------------
[ERROR] Failed to execute goal org.apache.maven.plugins:maven-surefire-plugin:2.5:test (default-test) on project cayenne-server: There are test failures.
[ERROR]
[ERROR] Please refer to <https://builds.apache.org/job/cayenne-master/cayenneTestConnection=derby,jdk=jdk-1.8.0,label=Ubuntu/ws/cayenne-server/target/surefire-reports> for the individual test results.
[ERROR] -> [Help 1]
org.apache.maven.lifecycle.LifecycleExecutionException: Failed to execute goal org.apache.maven.plugins:maven-surefire-plugin:2.5:test (default-test) on project cayenne-server: There are test failures.
Please refer to <https://builds.apache.org/job/cayenne-master/cayenneTestConnection=derby,jdk=jdk-1.8.0,label=Ubuntu/ws/cayenne-server/target/surefire-reports> for the individual test results.
at org.apache.maven.lifecycle.internal.MojoExecutor.execute(MojoExecutor.java:213)
at org.apache.maven.lifecycle.internal.MojoExecutor.execute(MojoExecutor.java:153)
at org.apache.maven.lifecycle.internal.MojoExecutor.execute(MojoExecutor.java:145)
at org.apache.maven.lifecycle.internal.LifecycleModuleBuilder.buildProject(LifecycleModuleBuilder.java:84)
at org.apache.maven.lifecycle.internal.LifecycleModuleBuilder.buildProject(LifecycleModuleBuilder.java:59)
at org.apache.maven.lifecycle.internal.LifecycleStarter.singleThreadedBuild(LifecycleStarter.java:183)
at org.apache.maven.lifecycle.internal.LifecycleStarter.execute(LifecycleStarter.java:161)
at org.apache.maven.DefaultMaven.doExecute(DefaultMaven.java:320)
at org.apache.maven.DefaultMaven.execute(DefaultMaven.java:156)
at org.apache.maven.cli.MavenCli.execute(MavenCli.java:537)
at org.apache.maven.cli.MavenCli.doMain(MavenCli.java:196)
at org.apache.maven.cli.MavenCli.main(MavenCli.java:141)
at sun.reflect.NativeMethodAccessorImpl.invoke0(Native Method)
at sun.reflect.NativeMethodAccessorImpl.invoke(NativeMethodAccessorImpl.java:62)
at sun.reflect.DelegatingMethodAccessorImpl.invoke(DelegatingMethodAccessorImpl.java:43)
at java.lang.reflect.Method.invoke(Method.java:483)
at org.codehaus.plexus.classworlds.launcher.Launcher.launchEnhanced(Launcher.java:290)
at org.codehaus.plexus.classworlds.launcher.Launcher.launch(Launcher.java:230)
at org.codehaus.plexus.classworlds.launcher.Launcher.mainWithExitCode(Launcher.java:409)
at org.codehaus.plexus.classworlds.launcher.Launcher.main(Launcher.java:352)
Caused by: org.apache.maven.plugin.MojoFailureException: There are test failures.
Please refer to <https://builds.apache.org/job/cayenne-master/cayenneTestConnection=derby,jdk=jdk-1.8.0,label=Ubuntu/ws/cayenne-server/target/surefire-reports> for the individual test results.
at org.apache.maven.plugin.surefire.SurefirePlugin.execute(SurefirePlugin.java:629)
at org.apache.maven.plugin.DefaultBuildPluginManager.executeMojo(DefaultBuildPluginManager.java:101)
at org.apache.maven.lifecycle.internal.MojoExecutor.execute(MojoExecutor.java:209)
... 19 more
[ERROR]
[ERROR] Re-run Maven using the -X switch to enable full debug logging.
[ERROR]
[ERROR] For more information about the errors and possible solutions, please read the following articles:
[ERROR] [Help 1] http://cwiki.apache.org/confluence/display/MAVEN/MojoFailureException
[ERROR]
[ERROR] After correcting the problems, you can resume the build with the command
[ERROR] mvn <goals> -rf :cayenne-server
Build step 'Invoke top-level Maven targets' marked build as failure
Build failed in Jenkins: cayenne-master » derby,jdk-1.8.0,Ubuntu #7
Posted by Apache Jenkins Server <je...@builds.apache.org>.
See <https://builds.apache.org/job/cayenne-master/cayenneTestConnection=derby,jdk=jdk-1.8.0,label=Ubuntu/7/>
------------------------------------------
[...truncated 65128 lines...]
May 26, 2014 1:54:23 AM org.apache.cayenne.log.CommonsJdbcEventLogger logBeginTransaction
INFO: --- transaction started.
May 26, 2014 1:54:23 AM org.apache.cayenne.log.CommonsJdbcEventLogger logQuery
INFO: INSERT INTO ARTIST (ARTIST_ID, ARTIST_NAME, DATE_OF_BIRTH) VALUES (44, 'X', ?) [bind: 1:'2014-05-26 01:54:23.107']
May 26, 2014 1:54:23 AM org.apache.cayenne.log.CommonsJdbcEventLogger logUpdateCount
INFO: === updated 1 row.
May 26, 2014 1:54:23 AM org.apache.cayenne.log.CommonsJdbcEventLogger logCommitTransaction
INFO: +++ transaction committed.
May 26, 2014 1:54:23 AM org.apache.cayenne.log.CommonsJdbcEventLogger logBeginTransaction
INFO: --- transaction started.
May 26, 2014 1:54:23 AM org.apache.cayenne.log.CommonsJdbcEventLogger logQuery
INFO: SELECT t0.ARTIST_NAME, t0.DATE_OF_BIRTH, t0.ARTIST_ID FROM ARTIST t0 WHERE t0.ARTIST_ID = ? [bind: 1->ARTIST_ID:44]
May 26, 2014 1:54:23 AM org.apache.cayenne.log.CommonsJdbcEventLogger logSelectCount
INFO: === returned 1 row. - took 3 ms.
May 26, 2014 1:54:23 AM org.apache.cayenne.log.CommonsJdbcEventLogger logCommitTransaction
INFO: +++ transaction committed.
May 26, 2014 1:54:23 AM org.apache.cayenne.log.CommonsJdbcEventLogger logBeginTransaction
INFO: --- transaction started.
May 26, 2014 1:54:23 AM org.apache.cayenne.log.CommonsJdbcEventLogger logQuery
INFO: UPDATE ARTIST SET DATE_OF_BIRTH = NULL
May 26, 2014 1:54:23 AM org.apache.cayenne.log.CommonsJdbcEventLogger logUpdateCount
INFO: === updated 1 row.
May 26, 2014 1:54:23 AM org.apache.cayenne.log.CommonsJdbcEventLogger logCommitTransaction
INFO: +++ transaction committed.
May 26, 2014 1:54:23 AM org.apache.cayenne.log.CommonsJdbcEventLogger logBeginTransaction
INFO: --- transaction started.
May 26, 2014 1:54:23 AM org.apache.cayenne.log.CommonsJdbcEventLogger logQuery
INFO: SELECT t0.ARTIST_NAME, t0.DATE_OF_BIRTH, t0.ARTIST_ID FROM ARTIST t0 WHERE t0.ARTIST_ID = ? [bind: 1->ARTIST_ID:44]
May 26, 2014 1:54:23 AM org.apache.cayenne.log.CommonsJdbcEventLogger logSelectCount
INFO: === returned 1 row. - took 1 ms.
May 26, 2014 1:54:23 AM org.apache.cayenne.log.CommonsJdbcEventLogger logCommitTransaction
INFO: +++ transaction committed.
May 26, 2014 1:54:23 AM org.apache.cayenne.configuration.XMLDataChannelDescriptorLoader load
INFO: Loading XML configuration resource from file:/home/hudson/jenkins-slave/workspace/cayenne-master/cayenneTestConnection/derby/jdk/jdk-1.8.0/label/Ubuntu/cayenne-server/target/test-classes/cayenne-testmap.xml
May 26, 2014 1:54:23 AM org.apache.cayenne.configuration.XMLDataChannelDescriptorLoader$DataChannelChildrenHandler createChildTagHandler
INFO: Loading XML DataMap resource from file:/home/hudson/jenkins-slave/workspace/cayenne-master/cayenneTestConnection/derby/jdk/jdk-1.8.0/label/Ubuntu/cayenne-server/target/test-classes/tstmap.map.xml
May 26, 2014 1:54:23 AM org.apache.cayenne.map.EntityResolver applyDBLayerDefaults
INFO: added runtime complimentary DbRelationship from ARTIST to PAINTING1
May 26, 2014 1:54:23 AM org.apache.cayenne.test.jdbc.UtilityLogger log
INFO: delete from PAINTING_INFO
May 26, 2014 1:54:23 AM org.apache.cayenne.test.jdbc.UtilityLogger log
INFO: delete from PAINTING
May 26, 2014 1:54:23 AM org.apache.cayenne.test.jdbc.UtilityLogger log
INFO: delete from PAINTING1
May 26, 2014 1:54:23 AM org.apache.cayenne.test.jdbc.UtilityLogger log
INFO: delete from ARTIST_EXHIBIT
May 26, 2014 1:54:23 AM org.apache.cayenne.test.jdbc.UtilityLogger log
INFO: delete from ARTIST_GROUP
May 26, 2014 1:54:23 AM org.apache.cayenne.test.jdbc.UtilityLogger log
INFO: delete from ARTIST
May 26, 2014 1:54:23 AM org.apache.cayenne.log.CommonsJdbcEventLogger logBeginTransaction
INFO: --- transaction started.
May 26, 2014 1:54:23 AM org.apache.cayenne.log.CommonsJdbcEventLogger logQuery
INFO: INSERT INTO ARTIST (ARTIST_ID, ARTIST_NAME, DATE_OF_BIRTH) VALUES (?, ?, ?)
May 26, 2014 1:54:23 AM org.apache.cayenne.log.CommonsJdbcEventLogger logQueryParameters
INFO: [batch bind: 1->ARTIST_ID:271, 2->ARTIST_NAME:'X', 3->DATE_OF_BIRTH:'2014-05-26 01:54:23.185']
May 26, 2014 1:54:23 AM org.apache.cayenne.log.CommonsJdbcEventLogger logUpdateCount
INFO: === updated 1 row.
May 26, 2014 1:54:23 AM org.apache.cayenne.log.CommonsJdbcEventLogger logCommitTransaction
INFO: +++ transaction committed.
May 26, 2014 1:54:23 AM org.apache.cayenne.log.CommonsJdbcEventLogger logBeginTransaction
INFO: --- transaction started.
May 26, 2014 1:54:23 AM org.apache.cayenne.log.CommonsJdbcEventLogger logQuery
INFO: UPDATE ARTIST SET DATE_OF_BIRTH = NULL
May 26, 2014 1:54:23 AM org.apache.cayenne.log.CommonsJdbcEventLogger logUpdateCount
INFO: === updated 1 row.
May 26, 2014 1:54:23 AM org.apache.cayenne.log.CommonsJdbcEventLogger logCommitTransaction
INFO: +++ transaction committed.
May 26, 2014 1:54:23 AM org.apache.cayenne.log.CommonsJdbcEventLogger logBeginTransaction
INFO: --- transaction started.
May 26, 2014 1:54:23 AM org.apache.cayenne.log.CommonsJdbcEventLogger logQuery
INFO: SELECT t0.ARTIST_NAME, t0.DATE_OF_BIRTH, t0.ARTIST_ID FROM ARTIST t0 WHERE t0.ARTIST_ID = ? [bind: 1->ARTIST_ID:271]
May 26, 2014 1:54:23 AM org.apache.cayenne.log.CommonsJdbcEventLogger logSelectCount
INFO: === returned 1 row. - took 1 ms.
May 26, 2014 1:54:23 AM org.apache.cayenne.log.CommonsJdbcEventLogger logCommitTransaction
INFO: +++ transaction committed.
May 26, 2014 1:54:23 AM org.apache.cayenne.configuration.XMLDataChannelDescriptorLoader load
INFO: Loading XML configuration resource from file:/home/hudson/jenkins-slave/workspace/cayenne-master/cayenneTestConnection/derby/jdk/jdk-1.8.0/label/Ubuntu/cayenne-server/target/test-classes/cayenne-testmap.xml
May 26, 2014 1:54:23 AM org.apache.cayenne.configuration.XMLDataChannelDescriptorLoader$DataChannelChildrenHandler createChildTagHandler
INFO: Loading XML DataMap resource from file:/home/hudson/jenkins-slave/workspace/cayenne-master/cayenneTestConnection/derby/jdk/jdk-1.8.0/label/Ubuntu/cayenne-server/target/test-classes/tstmap.map.xml
May 26, 2014 1:54:23 AM org.apache.cayenne.map.EntityResolver applyDBLayerDefaults
INFO: added runtime complimentary DbRelationship from ARTIST to PAINTING1
May 26, 2014 1:54:23 AM org.apache.cayenne.test.jdbc.UtilityLogger log
INFO: delete from PAINTING_INFO
May 26, 2014 1:54:23 AM org.apache.cayenne.test.jdbc.UtilityLogger log
INFO: delete from PAINTING
May 26, 2014 1:54:23 AM org.apache.cayenne.test.jdbc.UtilityLogger log
INFO: delete from PAINTING1
May 26, 2014 1:54:23 AM org.apache.cayenne.test.jdbc.UtilityLogger log
INFO: delete from ARTIST_EXHIBIT
May 26, 2014 1:54:23 AM org.apache.cayenne.test.jdbc.UtilityLogger log
INFO: delete from ARTIST_GROUP
May 26, 2014 1:54:23 AM org.apache.cayenne.test.jdbc.UtilityLogger log
INFO: delete from ARTIST
May 26, 2014 1:54:23 AM org.apache.cayenne.log.CommonsJdbcEventLogger logBeginTransaction
INFO: --- transaction started.
May 26, 2014 1:54:23 AM org.apache.cayenne.log.CommonsJdbcEventLogger logQuery
INFO: INSERT INTO ARTIST (ARTIST_ID, ARTIST_NAME, DATE_OF_BIRTH) VALUES (?, ?, ?)
May 26, 2014 1:54:23 AM org.apache.cayenne.log.CommonsJdbcEventLogger logQueryParameters
INFO: [batch bind: 1->ARTIST_ID:272, 2->ARTIST_NAME:'X', 3->DATE_OF_BIRTH:NULL]
May 26, 2014 1:54:23 AM org.apache.cayenne.log.CommonsJdbcEventLogger logUpdateCount
INFO: === updated 1 row.
May 26, 2014 1:54:23 AM org.apache.cayenne.log.CommonsJdbcEventLogger logCommitTransaction
INFO: +++ transaction committed.
May 26, 2014 1:54:23 AM org.apache.cayenne.log.CommonsJdbcEventLogger logBeginTransaction
INFO: --- transaction started.
May 26, 2014 1:54:23 AM org.apache.cayenne.log.CommonsJdbcEventLogger logQuery
INFO: UPDATE ARTIST SET ARTIST_NAME = 'Y'
May 26, 2014 1:54:23 AM org.apache.cayenne.log.CommonsJdbcEventLogger logUpdateCount
INFO: === updated 1 row.
May 26, 2014 1:54:23 AM org.apache.cayenne.log.CommonsJdbcEventLogger logCommitTransaction
INFO: +++ transaction committed.
Tests run: 3, Failures: 0, Errors: 0, Skipped: 0, Time elapsed: 0.485 sec
Running org.apache.cayenne.access.DataContextBinaryPKTest
May 26, 2014 1:54:23 AM org.apache.cayenne.configuration.XMLDataChannelDescriptorLoader load
INFO: Loading XML configuration resource from file:/home/hudson/jenkins-slave/workspace/cayenne-master/cayenneTestConnection/derby/jdk/jdk-1.8.0/label/Ubuntu/cayenne-server/target/test-classes/cayenne-testmap.xml
May 26, 2014 1:54:23 AM org.apache.cayenne.configuration.XMLDataChannelDescriptorLoader$DataChannelChildrenHandler createChildTagHandler
INFO: Loading XML DataMap resource from file:/home/hudson/jenkins-slave/workspace/cayenne-master/cayenneTestConnection/derby/jdk/jdk-1.8.0/label/Ubuntu/cayenne-server/target/test-classes/tstmap.map.xml
May 26, 2014 1:54:23 AM org.apache.cayenne.map.EntityResolver applyDBLayerDefaults
INFO: added runtime complimentary DbRelationship from ARTIST to PAINTING1
May 26, 2014 1:54:23 AM org.apache.cayenne.configuration.XMLDataChannelDescriptorLoader load
INFO: Loading XML configuration resource from file:/home/hudson/jenkins-slave/workspace/cayenne-master/cayenneTestConnection/derby/jdk/jdk-1.8.0/label/Ubuntu/cayenne-server/target/test-classes/cayenne-testmap.xml
May 26, 2014 1:54:23 AM org.apache.cayenne.configuration.XMLDataChannelDescriptorLoader$DataChannelChildrenHandler createChildTagHandler
INFO: Loading XML DataMap resource from file:/home/hudson/jenkins-slave/workspace/cayenne-master/cayenneTestConnection/derby/jdk/jdk-1.8.0/label/Ubuntu/cayenne-server/target/test-classes/tstmap.map.xml
May 26, 2014 1:54:23 AM org.apache.cayenne.map.EntityResolver applyDBLayerDefaults
INFO: added runtime complimentary DbRelationship from ARTIST to PAINTING1
Tests run: 2, Failures: 0, Errors: 0, Skipped: 0, Time elapsed: 0.016 sec
Running org.apache.cayenne.reflect.PropertyUtilsTest
Tests run: 10, Failures: 0, Errors: 0, Skipped: 0, Time elapsed: 0.02 sec
Results :
Tests in error:
testPostRemove_InsertedUpdatedDeleted(org.apache.cayenne.access.DataDomainCallbacksTest)
testPreUpdate(org.apache.cayenne.access.DataDomainCallbacksTest)
testPostPersist(org.apache.cayenne.access.DataDomainCallbacksTest)
testPostLoad_Relationship(org.apache.cayenne.access.DataDomainCallbacksTest)
testPostLoad_ThatModifiesObject(org.apache.cayenne.access.DataDomainCallbacksTest)
testPostLoad_Prefetch(org.apache.cayenne.access.DataDomainCallbacksTest)
testPostRemove_UpdatedDeleted(org.apache.cayenne.access.DataDomainCallbacksTest)
testPostRemove(org.apache.cayenne.access.DataDomainCallbacksTest)
testPostUpdate(org.apache.cayenne.access.DataDomainCallbacksTest)
testPostLoad_LocalObject(org.apache.cayenne.access.DataDomainCallbacksTest)
testPostLoad_MixedResult(org.apache.cayenne.access.DataDomainCallbacksTest)
testPostLoad(org.apache.cayenne.access.DataDomainCallbacksTest)
testNullifyToOne(org.apache.cayenne.access.DataContextDeleteRulesTest)
testDenyToMany(org.apache.cayenne.access.DataContextDeleteRulesTest)
testCascadeToManyFlattened(org.apache.cayenne.access.DataContextDeleteRulesTest)
testNullifyToMany(org.apache.cayenne.access.DataContextDeleteRulesTest)
testNullifyToManyFlattened(org.apache.cayenne.access.DataContextDeleteRulesTest)
testCascadeToMany(org.apache.cayenne.access.DataContextDeleteRulesTest)
testCascadeToOne(org.apache.cayenne.access.DataContextDeleteRulesTest)
testSelectWithOuterJoinFromString(org.apache.cayenne.access.DataContextOuterJoinsTest)
testSelectWithOuterJoinFlattened(org.apache.cayenne.access.DataContextOuterJoinsTest)
testSelectWithOuterOrdering(org.apache.cayenne.access.DataContextOuterJoinsTest)
testSelectWithOuterJoin(org.apache.cayenne.access.DataContextOuterJoinsTest)
testNullClob(org.apache.cayenne.access.DataContextClobTest)
testEmptyClob(org.apache.cayenne.access.DataContextClobTest)
test5KByteClob(org.apache.cayenne.access.DataContextClobTest)
test5ByteClob(org.apache.cayenne.access.DataContextClobTest)
test1MBClob(org.apache.cayenne.access.DataContextClobTest)
testReadRelationship(org.apache.cayenne.CDOOneToManyFKTest)
Tests run: 2053, Failures: 0, Errors: 29, Skipped: 0
[INFO] ------------------------------------------------------------------------
[INFO] Reactor Summary:
[INFO]
[INFO] Cayenne ........................................... SUCCESS [0.359s]
[INFO] Cayenne Build Tools Parent ........................ SUCCESS [0.034s]
[INFO] Cayenne License and Notice Bundle ................. SUCCESS [0.994s]
[INFO] Common Unit Test Utilities ........................ SUCCESS [1.641s]
[INFO] Cayenne Dependency Injection Container ............ SUCCESS [3.794s]
[INFO] Cayenne Server .................................... FAILURE [5:14.374s]
[INFO] Cayenne ROP Client ................................ SKIPPED
[INFO] Cayenne Project ................................... SKIPPED
[INFO] Cayenne Tools ..................................... SKIPPED
[INFO] Cayenne Lifecycle Utilities ....................... SKIPPED
[INFO] Cayenne Maven Plugins ............................. SKIPPED
[INFO] Cayenne Maven Plugin .............................. SKIPPED
[INFO] Cayenne Cryptography Extensions ................... SKIPPED
[INFO] Cayenne Integration Tests Parent .................. SKIPPED
[INFO] Integration Tests - Cayenne Tools ................. SKIPPED
[INFO] Cayenne Modeler Parent ............................ SKIPPED
[INFO] Cayenne WebObjects Compatibility Library .......... SKIPPED
[INFO] Cayenne Modeler ................................... SKIPPED
[INFO] Cayenne Modeler Maven Plugin ...................... SKIPPED
[INFO] Cayenne Tutorial .................................. SKIPPED
[INFO] Cayenne ROP Server Tutorial ....................... SKIPPED
[INFO] Cayenne ROP Client Tutorial ....................... SKIPPED
[INFO] Cayenne Tutorials ................................. SKIPPED
[INFO] Cayenne Documenation Parent ....................... SKIPPED
[INFO] Cayenne Documentation ............................. SKIPPED
[INFO] Cayenne Docbook Documentation ..................... SKIPPED
[INFO] Docbook: Cayenne Stylesheets ...................... SKIPPED
[INFO] Docbook: Cayenne Guide ............................ SKIPPED
[INFO] Docbook: Getting Started with Cayenne ............. SKIPPED
[INFO] Docbook: Getting Started with Cayenne ROP ......... SKIPPED
[INFO] Docbook: Cayenne New Features and Upgrade Guide ... SKIPPED
[INFO] ------------------------------------------------------------------------
[INFO] BUILD FAILURE
[INFO] ------------------------------------------------------------------------
[INFO] Total time: 5:21.874s
[INFO] Finished at: Mon May 26 01:54:23 UTC 2014
[INFO] Final Memory: 50M/235M
[INFO] ------------------------------------------------------------------------
[ERROR] Failed to execute goal org.apache.maven.plugins:maven-surefire-plugin:2.5:test (default-test) on project cayenne-server: There are test failures.
[ERROR]
[ERROR] Please refer to /home/hudson/jenkins-slave/workspace/cayenne-master/cayenneTestConnection/derby/jdk/jdk-1.8.0/label/Ubuntu/cayenne-server/target/surefire-reports for the individual test results.
[ERROR] -> [Help 1]
org.apache.maven.lifecycle.LifecycleExecutionException: Failed to execute goal org.apache.maven.plugins:maven-surefire-plugin:2.5:test (default-test) on project cayenne-server: There are test failures.
Please refer to /home/hudson/jenkins-slave/workspace/cayenne-master/cayenneTestConnection/derby/jdk/jdk-1.8.0/label/Ubuntu/cayenne-server/target/surefire-reports for the individual test results.
at org.apache.maven.lifecycle.internal.MojoExecutor.execute(MojoExecutor.java:213)
at org.apache.maven.lifecycle.internal.MojoExecutor.execute(MojoExecutor.java:153)
at org.apache.maven.lifecycle.internal.MojoExecutor.execute(MojoExecutor.java:145)
at org.apache.maven.lifecycle.internal.LifecycleModuleBuilder.buildProject(LifecycleModuleBuilder.java:84)
at org.apache.maven.lifecycle.internal.LifecycleModuleBuilder.buildProject(LifecycleModuleBuilder.java:59)
at org.apache.maven.lifecycle.internal.LifecycleStarter.singleThreadedBuild(LifecycleStarter.java:183)
at org.apache.maven.lifecycle.internal.LifecycleStarter.execute(LifecycleStarter.java:161)
at org.apache.maven.DefaultMaven.doExecute(DefaultMaven.java:320)
at org.apache.maven.DefaultMaven.execute(DefaultMaven.java:156)
at org.apache.maven.cli.MavenCli.execute(MavenCli.java:537)
at org.apache.maven.cli.MavenCli.doMain(MavenCli.java:196)
at org.apache.maven.cli.MavenCli.main(MavenCli.java:141)
at sun.reflect.NativeMethodAccessorImpl.invoke0(Native Method)
at sun.reflect.NativeMethodAccessorImpl.invoke(NativeMethodAccessorImpl.java:62)
at sun.reflect.DelegatingMethodAccessorImpl.invoke(DelegatingMethodAccessorImpl.java:43)
at java.lang.reflect.Method.invoke(Method.java:483)
at org.codehaus.plexus.classworlds.launcher.Launcher.launchEnhanced(Launcher.java:290)
at org.codehaus.plexus.classworlds.launcher.Launcher.launch(Launcher.java:230)
at org.codehaus.plexus.classworlds.launcher.Launcher.mainWithExitCode(Launcher.java:409)
at org.codehaus.plexus.classworlds.launcher.Launcher.main(Launcher.java:352)
Caused by: org.apache.maven.plugin.MojoFailureException: There are test failures.
Please refer to /home/hudson/jenkins-slave/workspace/cayenne-master/cayenneTestConnection/derby/jdk/jdk-1.8.0/label/Ubuntu/cayenne-server/target/surefire-reports for the individual test results.
at org.apache.maven.plugin.surefire.SurefirePlugin.execute(SurefirePlugin.java:629)
at org.apache.maven.plugin.DefaultBuildPluginManager.executeMojo(DefaultBuildPluginManager.java:101)
at org.apache.maven.lifecycle.internal.MojoExecutor.execute(MojoExecutor.java:209)
... 19 more
[ERROR]
[ERROR] Re-run Maven using the -X switch to enable full debug logging.
[ERROR]
[ERROR] For more information about the errors and possible solutions, please read the following articles:
[ERROR] [Help 1] http://cwiki.apache.org/confluence/display/MAVEN/MojoFailureException
[ERROR]
[ERROR] After correcting the problems, you can resume the build with the command
[ERROR] mvn <goals> -rf :cayenne-server
Build step 'Invoke top-level Maven targets' marked build as failure
Build failed in Jenkins: cayenne-master » derby,jdk-1.8.0,Ubuntu #6
Posted by Apache Jenkins Server <je...@builds.apache.org>.
See <https://builds.apache.org/job/cayenne-master/cayenneTestConnection=derby,jdk=jdk-1.8.0,label=Ubuntu/6/>
------------------------------------------
[...truncated 383 lines...]
[INFO] Using 'UTF-8' encoding to copy filtered resources.
[INFO] Copying 1 resource
[INFO]
[INFO] --- maven-compiler-plugin:2.3.2:compile (default-compile) @ maven-cayenne-doc-plugin ---
[WARNING] File encoding has not been set, using platform encoding ANSI_X3.4-1968, i.e. build is platform dependent!
[INFO] Compiling 6 source files to <https://builds.apache.org/job/cayenne-master/cayenneTestConnection=derby,jdk=jdk-1.8.0,label=Ubuntu/ws/build-tools/maven-cayenne-doc-plugin/target/classes>
[INFO]
[INFO] --- maven-resources-plugin:2.4.3:testResources (default-testResources) @ maven-cayenne-doc-plugin ---
[INFO] Using 'UTF-8' encoding to copy filtered resources.
[INFO] skip non existing resourceDirectory <https://builds.apache.org/job/cayenne-master/cayenneTestConnection=derby,jdk=jdk-1.8.0,label=Ubuntu/ws/build-tools/maven-cayenne-doc-plugin/src/test/resources>
[INFO]
[INFO] --- maven-compiler-plugin:2.3.2:testCompile (default-testCompile) @ maven-cayenne-doc-plugin ---
[WARNING] File encoding has not been set, using platform encoding ANSI_X3.4-1968, i.e. build is platform dependent!
[INFO] Compiling 1 source file to <https://builds.apache.org/job/cayenne-master/cayenneTestConnection=derby,jdk=jdk-1.8.0,label=Ubuntu/ws/build-tools/maven-cayenne-doc-plugin/target/test-classes>
[INFO]
[INFO] --- maven-surefire-plugin:2.5:test (default-test) @ maven-cayenne-doc-plugin ---
[INFO] Surefire report directory: <https://builds.apache.org/job/cayenne-master/cayenneTestConnection=derby,jdk=jdk-1.8.0,label=Ubuntu/ws/build-tools/maven-cayenne-doc-plugin/target/surefire-reports>
-------------------------------------------------------
T E S T S
-------------------------------------------------------
Running org.apache.cayenne.maven.plugin.confluence.DocPageTest
Tests run: 5, Failures: 0, Errors: 0, Skipped: 0, Time elapsed: 0.041 sec
Results :
Tests run: 5, Failures: 0, Errors: 0, Skipped: 0
[INFO]
[INFO] --- maven-jar-plugin:2.3.1:jar (default-jar) @ maven-cayenne-doc-plugin ---
[INFO] Building jar: <https://builds.apache.org/job/cayenne-master/cayenneTestConnection=derby,jdk=jdk-1.8.0,label=Ubuntu/ws/build-tools/maven-cayenne-doc-plugin/target/maven-cayenne-doc-plugin-3.0-SNAPSHOT.jar>
[INFO]
[INFO] --- maven-plugin-plugin:2.9:addPluginArtifactMetadata (default-addPluginArtifactMetadata) @ maven-cayenne-doc-plugin ---
[INFO]
[INFO] --- maven-install-plugin:2.3.1:install (default-install) @ maven-cayenne-doc-plugin ---
[INFO] Installing <https://builds.apache.org/job/cayenne-master/cayenneTestConnection=derby,jdk=jdk-1.8.0,label=Ubuntu/ws/build-tools/maven-cayenne-doc-plugin/target/maven-cayenne-doc-plugin-3.0-SNAPSHOT.jar> to /home/jenkins/.m2/repository/org/apache/cayenne/build-tools/maven-cayenne-doc-plugin/3.0-SNAPSHOT/maven-cayenne-doc-plugin-3.0-SNAPSHOT.jar
[INFO] Installing <https://builds.apache.org/job/cayenne-master/cayenneTestConnection=derby,jdk=jdk-1.8.0,label=Ubuntu/ws/build-tools/maven-cayenne-doc-plugin/pom.xml> to /home/jenkins/.m2/repository/org/apache/cayenne/build-tools/maven-cayenne-doc-plugin/3.0-SNAPSHOT/maven-cayenne-doc-plugin-3.0-SNAPSHOT.pom
[INFO]
[INFO] ------------------------------------------------------------------------
[INFO] Building Cayenne Build Tools Parent 3.0-SNAPSHOT
[INFO] ------------------------------------------------------------------------
[INFO]
[INFO] --- maven-clean-plugin:2.4.1:clean (default-clean) @ cayenne-build-tools ---
[INFO]
[INFO] --- maven-install-plugin:2.3.1:install (default-install) @ cayenne-build-tools ---
[INFO] Installing <https://builds.apache.org/job/cayenne-master/cayenneTestConnection=derby,jdk=jdk-1.8.0,label=Ubuntu/ws/build-tools/pom.xml> to /home/jenkins/.m2/repository/org/apache/cayenne/parents/cayenne-build-tools/3.0-SNAPSHOT/cayenne-build-tools-3.0-SNAPSHOT.pom
[INFO]
[INFO] ------------------------------------------------------------------------
[INFO] Building Cayenne License and Notice Bundle 3.0-SNAPSHOT
[INFO] ------------------------------------------------------------------------
Downloading: http://maven.objectstyle.org/nexus/content/groups/cayenne-deps/org/apache/cayenne/build-tools/maven-cayenne-build-plugin/maven-metadata.xml
Downloading: http://maven.objectstyle.org/nexus/content/groups/cayenne-deps/org/apache/maven/plugins/maven-source-plugin/maven-metadata.xml
692/692 B
Downloaded: http://maven.objectstyle.org/nexus/content/groups/cayenne-deps/org/apache/maven/plugins/maven-source-plugin/maven-metadata.xml (692 B at 2.7 KB/sec)
[INFO]
[INFO] --- maven-clean-plugin:2.4.1:clean (default-clean) @ cayenne-legal-unpublished ---
[INFO]
[INFO] --- maven-cayenne-build-plugin:3.0-SNAPSHOT:date (date) @ cayenne-legal-unpublished ---
[INFO]
[INFO] --- maven-remote-resources-plugin:1.4:bundle (default) @ cayenne-legal-unpublished ---
[INFO]
[INFO] --- maven-resources-plugin:2.4.3:resources (default-resources) @ cayenne-legal-unpublished ---
[INFO] Using 'UTF-8' encoding to copy filtered resources.
[INFO] Copying 2 resources
[INFO]
[INFO] --- maven-compiler-plugin:2.3.2:compile (default-compile) @ cayenne-legal-unpublished ---
[INFO] No sources to compile
[INFO]
[INFO] --- maven-resources-plugin:2.4.3:testResources (default-testResources) @ cayenne-legal-unpublished ---
[INFO] Using 'UTF-8' encoding to copy filtered resources.
[INFO] skip non existing resourceDirectory <https://builds.apache.org/job/cayenne-master/cayenneTestConnection=derby,jdk=jdk-1.8.0,label=Ubuntu/ws/framework/cayenne-legal-unpublished/src/test/resources>
[INFO]
[INFO] --- maven-compiler-plugin:2.3.2:testCompile (default-testCompile) @ cayenne-legal-unpublished ---
[INFO] No sources to compile
[INFO]
[INFO] --- maven-surefire-plugin:2.5:test (default-test) @ cayenne-legal-unpublished ---
[INFO] No tests to run.
[INFO]
[INFO] --- maven-jar-plugin:2.3.2:jar (default-jar) @ cayenne-legal-unpublished ---
[INFO] Building jar: <https://builds.apache.org/job/cayenne-master/cayenneTestConnection=derby,jdk=jdk-1.8.0,label=Ubuntu/ws/framework/cayenne-legal-unpublished/target/cayenne-legal-unpublished-3.0-SNAPSHOT.jar>
[INFO]
[INFO] >>> maven-source-plugin:2.2.1:jar (bundle-source-jar) @ cayenne-legal-unpublished >>>
[INFO]
[INFO] --- maven-cayenne-build-plugin:3.0-SNAPSHOT:date (date) @ cayenne-legal-unpublished ---
[INFO]
[INFO] <<< maven-source-plugin:2.2.1:jar (bundle-source-jar) @ cayenne-legal-unpublished <<<
[INFO]
[INFO] --- maven-source-plugin:2.2.1:jar (bundle-source-jar) @ cayenne-legal-unpublished ---
[INFO] Building jar: <https://builds.apache.org/job/cayenne-master/cayenneTestConnection=derby,jdk=jdk-1.8.0,label=Ubuntu/ws/framework/cayenne-legal-unpublished/target/cayenne-legal-unpublished-3.0-SNAPSHOT-sources.jar>
[INFO]
[INFO] --- maven-install-plugin:2.3.1:install (default-install) @ cayenne-legal-unpublished ---
[INFO] Installing <https://builds.apache.org/job/cayenne-master/cayenneTestConnection=derby,jdk=jdk-1.8.0,label=Ubuntu/ws/framework/cayenne-legal-unpublished/target/cayenne-legal-unpublished-3.0-SNAPSHOT.jar> to /home/jenkins/.m2/repository/org/apache/cayenne/unpublished/cayenne-legal-unpublished/3.0-SNAPSHOT/cayenne-legal-unpublished-3.0-SNAPSHOT.jar
[INFO] Installing <https://builds.apache.org/job/cayenne-master/cayenneTestConnection=derby,jdk=jdk-1.8.0,label=Ubuntu/ws/framework/cayenne-legal-unpublished/pom.xml> to /home/jenkins/.m2/repository/org/apache/cayenne/unpublished/cayenne-legal-unpublished/3.0-SNAPSHOT/cayenne-legal-unpublished-3.0-SNAPSHOT.pom
[INFO] Installing <https://builds.apache.org/job/cayenne-master/cayenneTestConnection=derby,jdk=jdk-1.8.0,label=Ubuntu/ws/framework/cayenne-legal-unpublished/target/cayenne-legal-unpublished-3.0-SNAPSHOT-sources.jar> to /home/jenkins/.m2/repository/org/apache/cayenne/unpublished/cayenne-legal-unpublished/3.0-SNAPSHOT/cayenne-legal-unpublished-3.0-SNAPSHOT-sources.jar
[INFO]
[INFO] ------------------------------------------------------------------------
[INFO] Building Cayenne Java 1.5 Unpublished 3.0-SNAPSHOT
[INFO] ------------------------------------------------------------------------
[INFO]
[INFO] --- maven-clean-plugin:2.4.1:clean (default-clean) @ cayenne-jdk1.5-unpublished ---
[INFO]
[INFO] --- maven-cayenne-build-plugin:3.0-SNAPSHOT:date (date) @ cayenne-jdk1.5-unpublished ---
[INFO]
[INFO] --- javacc-maven-plugin:2.5:jjtree (jjtree-ejbql) @ cayenne-jdk1.5-unpublished ---
[WARNING] This goal has been deprecated. Please update your plugin configuration.
Java Compiler Compiler Version 4.1 (Tree Builder)
(type "jjtree" with no arguments for help)
Reading from file <https://builds.apache.org/job/cayenne-master/cayenneTestConnection=derby,jdk=jdk-1.8.0,label=Ubuntu/ws/framework/cayenne-jdk1.5-unpublished/src/main/jjtree/org/apache/cayenne/ejbql/EJBQLParser.jjt> . . .
File "Node.java" does not exist. Will create one.
File "EJBQLTreeConstants.java" does not exist. Will create one.
File "JJTEJBQLState.java" does not exist. Will create one.
Annotated grammar generated successfully in <https://builds.apache.org/job/cayenne-master/cayenneTestConnection=derby,jdk=jdk-1.8.0,label=Ubuntu/ws/framework/cayenne-jdk1.5-unpublished/target/generated-sources/jjtree/org/apache/cayenne/ejbql/org/apache/cayenne/ejbql/parser/EJBQLParser.jj>
[INFO] Processed 1 grammar
[INFO]
[INFO] --- javacc-maven-plugin:2.5:javacc (javacc-ejbql) @ cayenne-jdk1.5-unpublished ---
Java Compiler Compiler Version 4.1 (Parser Generator)
(type "javacc" with no arguments for help)
Reading from file <https://builds.apache.org/job/cayenne-master/cayenneTestConnection=derby,jdk=jdk-1.8.0,label=Ubuntu/ws/framework/cayenne-jdk1.5-unpublished/target/generated-sources/jjtree/org/apache/cayenne/ejbql/org/apache/cayenne/ejbql/parser/EJBQLParser.jj> . . .
Warning: Choice conflict in (...)* construct at line 840, column 17.
Expansion nested within construct and expansion following construct
have common prefixes, one of which is: "+"
Consider using a lookahead of 2 or more for nested expansion.
Warning: Choice conflict in (...)* construct at line 849, column 17.
Expansion nested within construct and expansion following construct
have common prefixes, one of which is: "*"
Consider using a lookahead of 2 or more for nested expansion.
File "TokenMgrError.java" does not exist. Will create one.
File "ParseException.java" does not exist. Will create one.
File "Token.java" does not exist. Will create one.
File "JavaCharStream.java" does not exist. Will create one.
Parser generated with 0 errors and 2 warnings.
[INFO] Processed 1 grammar
[INFO]
[INFO] --- maven-antrun-plugin:1.3:run (default) @ cayenne-jdk1.5-unpublished ---
[INFO] Executing tasks
[INFO] Executed tasks
[INFO]
[INFO] --- maven-resources-plugin:2.4.3:resources (default-resources) @ cayenne-jdk1.5-unpublished ---
[INFO] Using 'UTF-8' encoding to copy filtered resources.
[INFO] Copying 18 resources
[INFO] Copying 17 resources
[INFO]
[INFO] --- maven-compiler-plugin:2.3.2:compile (default-compile) @ cayenne-jdk1.5-unpublished ---
[WARNING] File encoding has not been set, using platform encoding ANSI_X3.4-1968, i.e. build is platform dependent!
[INFO] Compiling 997 source files to <https://builds.apache.org/job/cayenne-master/cayenneTestConnection=derby,jdk=jdk-1.8.0,label=Ubuntu/ws/framework/cayenne-jdk1.5-unpublished/target/classes>
[INFO] -------------------------------------------------------------
[ERROR] COMPILATION ERROR :
[INFO] -------------------------------------------------------------
[ERROR] <https://builds.apache.org/job/cayenne-master/cayenneTestConnection=derby,jdk=jdk-1.8.0,label=Ubuntu/ws/framework/cayenne-jdk1.5-unpublished/src/main/java/org/apache/cayenne/access/DataNode.java>:[349,10] error: DataNode.TransactionDataSource is not abstract and does not override abstract method getParentLogger() in CommonDataSource
[ERROR] <https://builds.apache.org/job/cayenne-master/cayenneTestConnection=derby,jdk=jdk-1.8.0,label=Ubuntu/ws/framework/cayenne-jdk1.5-unpublished/src/main/java/org/apache/cayenne/project/ProjectDataSource.java>:[33,7] error: ProjectDataSource is not abstract and does not override abstract method getParentLogger() in CommonDataSource
[ERROR] <https://builds.apache.org/job/cayenne-master/cayenneTestConnection=derby,jdk=jdk-1.8.0,label=Ubuntu/ws/framework/cayenne-jdk1.5-unpublished/src/main/java/org/apache/cayenne/conn/PoolDataSource.java>:[39,7] error: PoolDataSource is not abstract and does not override abstract method getParentLogger() in CommonDataSource
[ERROR] <https://builds.apache.org/job/cayenne-master/cayenneTestConnection=derby,jdk=jdk-1.8.0,label=Ubuntu/ws/framework/cayenne-jdk1.5-unpublished/src/main/java/org/apache/cayenne/conf/NodeDataSource.java>:[37,0] error: NodeDataSource is not abstract and does not override abstract method getParentLogger() in CommonDataSource
[ERROR] <https://builds.apache.org/job/cayenne-master/cayenneTestConnection=derby,jdk=jdk-1.8.0,label=Ubuntu/ws/framework/cayenne-jdk1.5-unpublished/src/main/java/org/apache/cayenne/access/TransactionConnectionDecorator.java>:[48,0] error: TransactionConnectionDecorator is not abstract and does not override abstract method getNetworkTimeout() in Connection
[ERROR] <https://builds.apache.org/job/cayenne-master/cayenneTestConnection=derby,jdk=jdk-1.8.0,label=Ubuntu/ws/framework/cayenne-jdk1.5-unpublished/src/main/java/org/apache/cayenne/conn/PoolManager.java>:[40,7] error: PoolManager is not abstract and does not override abstract method getParentLogger() in CommonDataSource
[ERROR] <https://builds.apache.org/job/cayenne-master/cayenneTestConnection=derby,jdk=jdk-1.8.0,label=Ubuntu/ws/framework/cayenne-jdk1.5-unpublished/src/main/java/org/apache/cayenne/conn/DriverDataSource.java>:[37,7] error: DriverDataSource is not abstract and does not override abstract method getParentLogger() in CommonDataSource
[ERROR] <https://builds.apache.org/job/cayenne-master/cayenneTestConnection=derby,jdk=jdk-1.8.0,label=Ubuntu/ws/framework/cayenne-jdk1.5-unpublished/src/main/java/org/apache/cayenne/conn/ConnectionWrapper.java>:[47,7] error: ConnectionWrapper is not abstract and does not override abstract method getNetworkTimeout() in Connection
[ERROR] <https://builds.apache.org/job/cayenne-master/cayenneTestConnection=derby,jdk=jdk-1.8.0,label=Ubuntu/ws/framework/cayenne-jdk1.5-unpublished/src/main/java/org/apache/cayenne/dba/oracle/OracleSQLTemplateAction.java>:[107,10] error: OracleSQLTemplateAction.OracleResultSetWrapper is not abstract and does not override abstract method <T>getObject(String,Class<T>) in ResultSet
[INFO] 9 errors
[INFO] -------------------------------------------------------------
[INFO] ------------------------------------------------------------------------
[INFO] Reactor Summary:
[INFO]
[INFO] Cayenne ........................................... SUCCESS [0.259s]
[INFO] Cayenne Internal Build Plugin ..................... SUCCESS [2.705s]
[INFO] Cayenne Internal Documentation Build Plugin ....... SUCCESS [2.444s]
[INFO] Cayenne Build Tools Parent ........................ SUCCESS [0.027s]
[INFO] Cayenne License and Notice Bundle ................. SUCCESS [2.252s]
[INFO] Cayenne Java 1.5 Unpublished ...................... FAILURE [7.847s]
[INFO] Cayenne JPA Unpublished ........................... SKIPPED
[INFO] Cayenne Enhancer Bootstrap Agent .................. SKIPPED
[INFO] Cayenne Aggregated Server Jar ..................... SKIPPED
[INFO] Cayenne Aggregated Client Jar ..................... SKIPPED
[INFO] Cayenne Tools ..................................... SKIPPED
[INFO] Cayenne Modeler ................................... SKIPPED
[INFO] Cayenne Maven Plugin .............................. SKIPPED
[INFO] Cayenne Modeler Maven Plugin ...................... SKIPPED
[INFO] Cayenne Framework Aggregator Project .............. SKIPPED
[INFO] Cayenne Integration Tests Parent .................. SKIPPED
[INFO] Integration Tests Commons ......................... SKIPPED
[INFO] Integration Tests - Cayenne API ................... SKIPPED
[INFO] Integration Tests - POJO .......................... SKIPPED
[INFO] Integration Tests - JPA Chapter 2 ................. SKIPPED
[INFO] Integration Tests - JPA Chapter 3 ................. SKIPPED
[INFO] Integration Tests - JPA Chapter 5 ................. SKIPPED
[INFO] Integration Tests - JPA Chapter 6 ................. SKIPPED
[INFO] Integration Tests - JPA Chapter 9 ................. SKIPPED
[INFO] Cayenne Modeler Parent ............................ SKIPPED
[INFO] Cayenne Tutorial .................................. SKIPPED
[INFO] Cayenne ROP Server Tutorial ....................... SKIPPED
[INFO] Cayenne ROP Client Tutorial ....................... SKIPPED
[INFO] Cayenne Tutorials ................................. SKIPPED
[INFO] Cayenne Documentation ............................. SKIPPED
[INFO] Cayenne Documenation Parent ....................... SKIPPED
[INFO] ------------------------------------------------------------------------
[INFO] BUILD FAILURE
[INFO] ------------------------------------------------------------------------
[INFO] Total time: 16.147s
[INFO] Finished at: Mon May 26 01:00:36 UTC 2014
[INFO] Final Memory: 42M/199M
[INFO] ------------------------------------------------------------------------
[ERROR] Failed to execute goal org.apache.maven.plugins:maven-compiler-plugin:2.3.2:compile (default-compile) on project cayenne-jdk1.5-unpublished: Compilation failure: Compilation failure:
[ERROR] <https://builds.apache.org/job/cayenne-master/cayenneTestConnection=derby,jdk=jdk-1.8.0,label=Ubuntu/ws/framework/cayenne-jdk1.5-unpublished/src/main/java/org/apache/cayenne/access/DataNode.java>:[349,10] error: DataNode.TransactionDataSource is not abstract and does not override abstract method getParentLogger() in CommonDataSource
[ERROR] <https://builds.apache.org/job/cayenne-master/cayenneTestConnection=derby,jdk=jdk-1.8.0,label=Ubuntu/ws/framework/cayenne-jdk1.5-unpublished/src/main/java/org/apache/cayenne/project/ProjectDataSource.java>:[33,7] error: ProjectDataSource is not abstract and does not override abstract method getParentLogger() in CommonDataSource
[ERROR] <https://builds.apache.org/job/cayenne-master/cayenneTestConnection=derby,jdk=jdk-1.8.0,label=Ubuntu/ws/framework/cayenne-jdk1.5-unpublished/src/main/java/org/apache/cayenne/conn/PoolDataSource.java>:[39,7] error: PoolDataSource is not abstract and does not override abstract method getParentLogger() in CommonDataSource
[ERROR] <https://builds.apache.org/job/cayenne-master/cayenneTestConnection=derby,jdk=jdk-1.8.0,label=Ubuntu/ws/framework/cayenne-jdk1.5-unpublished/src/main/java/org/apache/cayenne/conf/NodeDataSource.java>:[37,0] error: NodeDataSource is not abstract and does not override abstract method getParentLogger() in CommonDataSource
[ERROR] <https://builds.apache.org/job/cayenne-master/cayenneTestConnection=derby,jdk=jdk-1.8.0,label=Ubuntu/ws/framework/cayenne-jdk1.5-unpublished/src/main/java/org/apache/cayenne/access/TransactionConnectionDecorator.java>:[48,0] error: TransactionConnectionDecorator is not abstract and does not override abstract method getNetworkTimeout() in Connection
[ERROR] <https://builds.apache.org/job/cayenne-master/cayenneTestConnection=derby,jdk=jdk-1.8.0,label=Ubuntu/ws/framework/cayenne-jdk1.5-unpublished/src/main/java/org/apache/cayenne/conn/PoolManager.java>:[40,7] error: PoolManager is not abstract and does not override abstract method getParentLogger() in CommonDataSource
[ERROR] <https://builds.apache.org/job/cayenne-master/cayenneTestConnection=derby,jdk=jdk-1.8.0,label=Ubuntu/ws/framework/cayenne-jdk1.5-unpublished/src/main/java/org/apache/cayenne/conn/DriverDataSource.java>:[37,7] error: DriverDataSource is not abstract and does not override abstract method getParentLogger() in CommonDataSource
[ERROR] <https://builds.apache.org/job/cayenne-master/cayenneTestConnection=derby,jdk=jdk-1.8.0,label=Ubuntu/ws/framework/cayenne-jdk1.5-unpublished/src/main/java/org/apache/cayenne/conn/ConnectionWrapper.java>:[47,7] error: ConnectionWrapper is not abstract and does not override abstract method getNetworkTimeout() in Connection
[ERROR] <https://builds.apache.org/job/cayenne-master/cayenneTestConnection=derby,jdk=jdk-1.8.0,label=Ubuntu/ws/framework/cayenne-jdk1.5-unpublished/src/main/java/org/apache/cayenne/dba/oracle/OracleSQLTemplateAction.java>:[107,10] error: OracleSQLTemplateAction.OracleResultSetWrapper is not abstract and does not override abstract method <T>getObject(String,Class<T>) in ResultSet
[ERROR] -> [Help 1]
org.apache.maven.lifecycle.LifecycleExecutionException: Failed to execute goal org.apache.maven.plugins:maven-compiler-plugin:2.3.2:compile (default-compile) on project cayenne-jdk1.5-unpublished: Compilation failure
at org.apache.maven.lifecycle.internal.MojoExecutor.execute(MojoExecutor.java:213)
at org.apache.maven.lifecycle.internal.MojoExecutor.execute(MojoExecutor.java:153)
at org.apache.maven.lifecycle.internal.MojoExecutor.execute(MojoExecutor.java:145)
at org.apache.maven.lifecycle.internal.LifecycleModuleBuilder.buildProject(LifecycleModuleBuilder.java:84)
at org.apache.maven.lifecycle.internal.LifecycleModuleBuilder.buildProject(LifecycleModuleBuilder.java:59)
at org.apache.maven.lifecycle.internal.LifecycleStarter.singleThreadedBuild(LifecycleStarter.java:183)
at org.apache.maven.lifecycle.internal.LifecycleStarter.execute(LifecycleStarter.java:161)
at org.apache.maven.DefaultMaven.doExecute(DefaultMaven.java:320)
at org.apache.maven.DefaultMaven.execute(DefaultMaven.java:156)
at org.apache.maven.cli.MavenCli.execute(MavenCli.java:537)
at org.apache.maven.cli.MavenCli.doMain(MavenCli.java:196)
at org.apache.maven.cli.MavenCli.main(MavenCli.java:141)
at sun.reflect.NativeMethodAccessorImpl.invoke0(Native Method)
at sun.reflect.NativeMethodAccessorImpl.invoke(NativeMethodAccessorImpl.java:62)
at sun.reflect.DelegatingMethodAccessorImpl.invoke(DelegatingMethodAccessorImpl.java:43)
at java.lang.reflect.Method.invoke(Method.java:483)
at org.codehaus.plexus.classworlds.launcher.Launcher.launchEnhanced(Launcher.java:290)
at org.codehaus.plexus.classworlds.launcher.Launcher.launch(Launcher.java:230)
at org.codehaus.plexus.classworlds.launcher.Launcher.mainWithExitCode(Launcher.java:409)
at org.codehaus.plexus.classworlds.launcher.Launcher.main(Launcher.java:352)
Caused by: org.apache.maven.plugin.CompilationFailureException: Compilation failure
at org.apache.maven.plugin.AbstractCompilerMojo.execute(AbstractCompilerMojo.java:656)
at org.apache.maven.plugin.CompilerMojo.execute(CompilerMojo.java:128)
at org.apache.maven.plugin.DefaultBuildPluginManager.executeMojo(DefaultBuildPluginManager.java:101)
at org.apache.maven.lifecycle.internal.MojoExecutor.execute(MojoExecutor.java:209)
... 19 more
[ERROR]
[ERROR] Re-run Maven using the -X switch to enable full debug logging.
[ERROR]
[ERROR] For more information about the errors and possible solutions, please read the following articles:
[ERROR] [Help 1] http://cwiki.apache.org/confluence/display/MAVEN/MojoFailureException
[ERROR]
[ERROR] After correcting the problems, you can resume the build with the command
[ERROR] mvn <goals> -rf :cayenne-jdk1.5-unpublished
Build step 'Invoke top-level Maven targets' marked build as failure