You are viewing a plain text version of this content. The canonical link for it is here.
Posted to dev@kafka.apache.org by Apache Jenkins Server <je...@builds.apache.org> on 2018/07/03 18:51:44 UTC
Build failed in Jenkins: kafka-trunk-jdk8 #2789
See <https://builds.apache.org/job/kafka-trunk-jdk8/2789/display/redirect?page=changes>
Changes:
[wangguoz] MINOR: Fix standby streamTime (#5288)
------------------------------------------
[...truncated 871.08 KB...]
kafka.security.auth.ResourceTest > shouldParseThreePartWithEmbeddedSeparators STARTED
kafka.security.auth.ResourceTest > shouldParseThreePartWithEmbeddedSeparators PASSED
kafka.security.auth.SimpleAclAuthorizerTest > testAuthorizeWithPrefixedResource STARTED
kafka.security.auth.SimpleAclAuthorizerTest > testAuthorizeWithPrefixedResource PASSED
kafka.security.auth.SimpleAclAuthorizerTest > testAllowAllAccess STARTED
kafka.security.auth.SimpleAclAuthorizerTest > testAllowAllAccess PASSED
kafka.security.auth.SimpleAclAuthorizerTest > testLocalConcurrentModificationOfResourceAcls STARTED
kafka.security.auth.SimpleAclAuthorizerTest > testLocalConcurrentModificationOfResourceAcls PASSED
kafka.security.auth.SimpleAclAuthorizerTest > testDeleteAllAclOnWildcardResource STARTED
kafka.security.auth.SimpleAclAuthorizerTest > testDeleteAllAclOnWildcardResource PASSED
kafka.security.auth.SimpleAclAuthorizerTest > testHighConcurrencyDeletionOfResourceAcls STARTED
kafka.security.auth.SimpleAclAuthorizerTest > testHighConcurrencyDeletionOfResourceAcls PASSED
kafka.security.auth.SimpleAclAuthorizerTest > testNoAclFound STARTED
kafka.security.auth.SimpleAclAuthorizerTest > testNoAclFound PASSED
kafka.security.auth.SimpleAclAuthorizerTest > testAclInheritance STARTED
kafka.security.auth.SimpleAclAuthorizerTest > testAclInheritance PASSED
kafka.security.auth.SimpleAclAuthorizerTest > testDistributedConcurrentModificationOfResourceAcls STARTED
kafka.security.auth.SimpleAclAuthorizerTest > testDistributedConcurrentModificationOfResourceAcls PASSED
kafka.security.auth.SimpleAclAuthorizerTest > testAddAclsOnWildcardResource STARTED
kafka.security.auth.SimpleAclAuthorizerTest > testAddAclsOnWildcardResource PASSED
kafka.security.auth.SimpleAclAuthorizerTest > testWritesExtendedAclChangeEventWhenInterBrokerProtocolAtLeastKafkaV2 STARTED
kafka.security.auth.SimpleAclAuthorizerTest > testWritesExtendedAclChangeEventWhenInterBrokerProtocolAtLeastKafkaV2 PASSED
kafka.security.auth.SimpleAclAuthorizerTest > testAclManagementAPIs STARTED
kafka.security.auth.SimpleAclAuthorizerTest > testAclManagementAPIs PASSED
kafka.security.auth.SimpleAclAuthorizerTest > testWildCardAcls STARTED
kafka.security.auth.SimpleAclAuthorizerTest > testWildCardAcls PASSED
kafka.security.auth.SimpleAclAuthorizerTest > testWritesLiteralAclChangeEventWhenInterBrokerProtocolIsKafkaV2 STARTED
kafka.security.auth.SimpleAclAuthorizerTest > testWritesLiteralAclChangeEventWhenInterBrokerProtocolIsKafkaV2 PASSED
kafka.security.auth.SimpleAclAuthorizerTest > testTopicAcl STARTED
kafka.security.auth.SimpleAclAuthorizerTest > testTopicAcl PASSED
kafka.security.auth.SimpleAclAuthorizerTest > testSuperUserHasAccess STARTED
kafka.security.auth.SimpleAclAuthorizerTest > testSuperUserHasAccess PASSED
kafka.security.auth.SimpleAclAuthorizerTest > testDeleteAclOnPrefixedResource STARTED
kafka.security.auth.SimpleAclAuthorizerTest > testDeleteAclOnPrefixedResource PASSED
kafka.security.auth.SimpleAclAuthorizerTest > testDenyTakesPrecedence STARTED
kafka.security.auth.SimpleAclAuthorizerTest > testDenyTakesPrecedence PASSED
kafka.security.auth.SimpleAclAuthorizerTest > testNoAclFoundOverride STARTED
kafka.security.auth.SimpleAclAuthorizerTest > testNoAclFoundOverride PASSED
kafka.security.auth.SimpleAclAuthorizerTest > testSuperUserWithCustomPrincipalHasAccess STARTED
kafka.security.auth.SimpleAclAuthorizerTest > testSuperUserWithCustomPrincipalHasAccess PASSED
kafka.security.auth.SimpleAclAuthorizerTest > testAllowAccessWithCustomPrincipal STARTED
kafka.security.auth.SimpleAclAuthorizerTest > testAllowAccessWithCustomPrincipal PASSED
kafka.security.auth.SimpleAclAuthorizerTest > testDeleteAclOnWildcardResource STARTED
kafka.security.auth.SimpleAclAuthorizerTest > testDeleteAclOnWildcardResource PASSED
kafka.security.auth.SimpleAclAuthorizerTest > testChangeListenerTiming STARTED
kafka.security.auth.SimpleAclAuthorizerTest > testChangeListenerTiming PASSED
kafka.security.auth.SimpleAclAuthorizerTest > testWritesLiteralWritesLiteralAclChangeEventWhenInterBrokerProtocolLessThanKafkaV2eralAclChangesForOlderProtocolVersions STARTED
kafka.security.auth.SimpleAclAuthorizerTest > testWritesLiteralWritesLiteralAclChangeEventWhenInterBrokerProtocolLessThanKafkaV2eralAclChangesForOlderProtocolVersions PASSED
kafka.security.auth.SimpleAclAuthorizerTest > testThrowsOnAddPrefixedAclIfInterBrokerProtocolVersionTooLow STARTED
kafka.security.auth.SimpleAclAuthorizerTest > testThrowsOnAddPrefixedAclIfInterBrokerProtocolVersionTooLow PASSED
kafka.security.auth.SimpleAclAuthorizerTest > testAccessAllowedIfAllowAclExistsOnPrefixedResource STARTED
kafka.security.auth.SimpleAclAuthorizerTest > testAccessAllowedIfAllowAclExistsOnPrefixedResource PASSED
kafka.security.auth.SimpleAclAuthorizerTest > testHighConcurrencyModificationOfResourceAcls STARTED
kafka.security.auth.SimpleAclAuthorizerTest > testHighConcurrencyModificationOfResourceAcls PASSED
kafka.security.auth.SimpleAclAuthorizerTest > testDeleteAllAclOnPrefixedResource STARTED
kafka.security.auth.SimpleAclAuthorizerTest > testDeleteAllAclOnPrefixedResource PASSED
kafka.security.auth.SimpleAclAuthorizerTest > testAddAclsOnLiteralResource STARTED
kafka.security.auth.SimpleAclAuthorizerTest > testAddAclsOnLiteralResource PASSED
kafka.security.auth.SimpleAclAuthorizerTest > testAuthorizeThrowsOnNoneLiteralResource STARTED
kafka.security.auth.SimpleAclAuthorizerTest > testAuthorizeThrowsOnNoneLiteralResource PASSED
kafka.security.auth.SimpleAclAuthorizerTest > testGetAclsPrincipal STARTED
kafka.security.auth.SimpleAclAuthorizerTest > testGetAclsPrincipal PASSED
kafka.security.auth.SimpleAclAuthorizerTest > testAddAclsOnPrefiexedResource STARTED
kafka.security.auth.SimpleAclAuthorizerTest > testAddAclsOnPrefiexedResource PASSED
kafka.security.auth.SimpleAclAuthorizerTest > testWritesExtendedAclChangeEventIfInterBrokerProtocolNotSet STARTED
kafka.security.auth.SimpleAclAuthorizerTest > testWritesExtendedAclChangeEventIfInterBrokerProtocolNotSet PASSED
kafka.security.auth.SimpleAclAuthorizerTest > testAccessAllowedIfAllowAclExistsOnWildcardResource STARTED
kafka.security.auth.SimpleAclAuthorizerTest > testAccessAllowedIfAllowAclExistsOnWildcardResource PASSED
kafka.security.auth.SimpleAclAuthorizerTest > testLoadCache STARTED
kafka.security.auth.SimpleAclAuthorizerTest > testLoadCache PASSED
kafka.security.auth.OperationTest > testJavaConversions STARTED
kafka.security.auth.OperationTest > testJavaConversions PASSED
kafka.security.auth.ZkAuthorizationTest > testIsZkSecurityEnabled STARTED
kafka.security.auth.ZkAuthorizationTest > testIsZkSecurityEnabled PASSED
kafka.security.auth.ZkAuthorizationTest > testZkUtils STARTED
kafka.security.auth.ZkAuthorizationTest > testZkUtils PASSED
kafka.security.auth.ZkAuthorizationTest > testZkAntiMigration STARTED
kafka.security.auth.ZkAuthorizationTest > testZkAntiMigration PASSED
kafka.security.auth.ZkAuthorizationTest > testZkMigration STARTED
kafka.security.auth.ZkAuthorizationTest > testZkMigration PASSED
kafka.security.auth.ZkAuthorizationTest > testChroot STARTED
kafka.security.auth.ZkAuthorizationTest > testChroot PASSED
kafka.security.auth.ZkAuthorizationTest > testDelete STARTED
kafka.security.auth.ZkAuthorizationTest > testDelete PASSED
kafka.security.auth.ZkAuthorizationTest > testDeleteRecursive STARTED
kafka.security.auth.ZkAuthorizationTest > testDeleteRecursive PASSED
kafka.security.auth.AclTest > testAclJsonConversion STARTED
kafka.security.auth.AclTest > testAclJsonConversion PASSED
kafka.security.auth.ResourceTypeTest > testJavaConversions STARTED
kafka.security.auth.ResourceTypeTest > testJavaConversions PASSED
kafka.security.auth.ResourceTypeTest > testFromString STARTED
kafka.security.auth.ResourceTypeTest > testFromString PASSED
kafka.security.auth.PermissionTypeTest > testJavaConversions STARTED
kafka.security.auth.PermissionTypeTest > testJavaConversions PASSED
kafka.security.auth.PermissionTypeTest > testFromString STARTED
kafka.security.auth.PermissionTypeTest > testFromString PASSED
kafka.KafkaTest > testGetKafkaConfigFromArgsWrongSetValue STARTED
kafka.KafkaTest > testGetKafkaConfigFromArgsWrongSetValue PASSED
kafka.KafkaTest > testKafkaSslPasswords STARTED
kafka.KafkaTest > testKafkaSslPasswords PASSED
kafka.KafkaTest > testGetKafkaConfigFromArgs STARTED
kafka.KafkaTest > testGetKafkaConfigFromArgs PASSED
kafka.KafkaTest > testGetKafkaConfigFromArgsNonArgsAtTheEnd STARTED
kafka.KafkaTest > testGetKafkaConfigFromArgsNonArgsAtTheEnd PASSED
kafka.KafkaTest > testGetKafkaConfigFromArgsNonArgsOnly STARTED
kafka.KafkaTest > testGetKafkaConfigFromArgsNonArgsOnly PASSED
kafka.KafkaTest > testGetKafkaConfigFromArgsNonArgsAtTheBegging STARTED
kafka.KafkaTest > testGetKafkaConfigFromArgsNonArgsAtTheBegging PASSED
2026 tests completed, 2 failed, 4 skipped
> Task :kafka-trunk-jdk8:core:test FAILED
> Task :test_core_2_12 FAILED
FAILURE: Build failed with an exception.
* What went wrong:
Execution failed for task ':kafka-trunk-jdk8:core:test'.
> There were failing tests. See the report at: file://<https://builds.apache.org/job/kafka-trunk-jdk8/ws/core/build/reports/tests/test/index.html>
* Try:
Run with --stacktrace option to get the stack trace. Run with --info or --debug option to get more log output. Run with --scan to get full insights.
* Get more help at https://help.gradle.org
BUILD FAILED in 3h 57m 41s
26 actionable tasks: 17 executed, 9 up-to-date
Build step 'Execute shell' marked build as failure
[FINDBUGS] Collecting findbugs analysis files...
Setting GRADLE_4_4_HOME=/home/jenkins/tools/gradle/4.4
[FINDBUGS] Searching for all files in <https://builds.apache.org/job/kafka-trunk-jdk8/ws/> that match the pattern **/build/reports/findbugs/*.xml
[FINDBUGS] Parsing 1 file in <https://builds.apache.org/job/kafka-trunk-jdk8/ws/>
[FINDBUGS] Successfully parsed file <https://builds.apache.org/job/kafka-trunk-jdk8/ws/core/build/reports/findbugs/main.xml> with 0 unique warnings and 0 duplicates.
Setting GRADLE_4_4_HOME=/home/jenkins/tools/gradle/4.4
Setting GRADLE_4_4_HOME=/home/jenkins/tools/gradle/4.4
<Git Blamer> Using GitBlamer to create author and commit information for all warnings.
<Git Blamer> GIT_COMMIT=e38e3a66ab099996ecb156ec9105869f3d9b9228, workspace=<https://builds.apache.org/job/kafka-trunk-jdk8/ws/>
[FINDBUGS] Computing warning deltas based on reference build #2788
Recording test results
Setting GRADLE_4_4_HOME=/home/jenkins/tools/gradle/4.4
Setting GRADLE_4_4_HOME=/home/jenkins/tools/gradle/4.4
Not sending mail to unregistered user wangguoz@gmail.com
Jenkins build is back to normal : kafka-trunk-jdk8 #2790
Posted by Apache Jenkins Server <je...@builds.apache.org>.
See <https://builds.apache.org/job/kafka-trunk-jdk8/2790/display/redirect?page=changes>