You are viewing a plain text version of this content. The canonical link for it is here.
Posted to notifications@maven.apache.org by Apache Jenkins Server <je...@builds.apache.org> on 2019/10/19 23:41:59 UTC

Build failed in Jenkins: Maven TLP » maven-surefire » docker-alpine #4

See https://builds.apache.org/job/maven-box/job/maven-surefire/job/docker-alpine/4/

Changes:

* "-p" in "ps" not supported on Docker Alpine Linux

No tests ran.

Build log:
[...truncated 25648 lines...]
[2019-10-19T23:41:56.944Z] [INFO] 
[2019-10-19T23:41:56.944Z] [INFO] --- maven-site-plugin:3.8.2:attach-descriptor (attach-descriptor) @ surefire-booter ---
[2019-10-19T23:41:56.944Z] [INFO] Skipping because packaging 'jar' is not pom.
[2019-10-19T23:41:56.944Z] [INFO] 
[2019-10-19T23:41:56.944Z] [INFO] --- maven-shade-plugin:3.1.1:shade (default) @ surefire-booter ---
[2019-10-19T23:41:56.944Z] [INFO] Excluding org.apache.maven.surefire:surefire-api:jar:3.0.0-SNAPSHOT from the shaded jar.
[2019-10-19T23:41:56.944Z] [INFO] Excluding org.apache.maven.surefire:surefire-logger-api:jar:3.0.0-SNAPSHOT from the shaded jar.
[2019-10-19T23:41:56.944Z] [INFO] Including org.apache.commons:commons-lang3:jar:3.8.1 in the shaded jar.
[2019-10-19T23:41:56.944Z] [INFO] Including commons-io:commons-io:jar:2.6 in the shaded jar.
[2019-10-19T23:41:56.944Z] [INFO] Minimizing jar org.apache.maven.surefire:surefire-booter:jar:3.0.0-SNAPSHOT
[2019-10-19T23:41:57.576Z] [INFO] Minimized 453 -> 131 (28%)
[2019-10-19T23:41:57.576Z] [INFO] Replacing original artifact with shaded artifact.
[2019-10-19T23:41:57.576Z] [INFO] Replacing C:\Users\jenkins\AppData\Local\Temp\3\jenkins-maven-box-maven-surefire-docker-alpine-4\surefire-booter\target\surefire-booter-3.0.0-SNAPSHOT.jar with C:\Users\jenkins\AppData\Local\Temp\3\jenkins-maven-box-maven-surefire-docker-alpine-4\surefire-booter\target\surefire-booter-3.0.0-SNAPSHOT-shaded.jar
[2019-10-19T23:41:57.576Z] [INFO] Dependency-reduced POM written at: C:\Users\jenkins\AppData\Local\Temp\3\jenkins-maven-box-maven-surefire-docker-alpine-4\surefire-booter\dependency-reduced-pom.xml
[2019-10-19T23:41:57.576Z] [INFO] Minimized 453 -> 131 (28%)
[2019-10-19T23:41:57.576Z] [INFO] Replacing original artifact with shaded artifact.
[2019-10-19T23:41:57.576Z] [INFO] Replacing C:\Users\jenkins\AppData\Local\Temp\3\jenkins-maven-box-maven-surefire-docker-alpine-4@2\surefire-booter\target\surefire-booter-3.0.0-SNAPSHOT.jar with C:\Users\jenkins\AppData\Local\Temp\3\jenkins-maven-box-maven-surefire-docker-alpine-4@2\surefire-booter\target\surefire-booter-3.0.0-SNAPSHOT-shaded.jar
[2019-10-19T23:41:57.577Z] [INFO] Dependency-reduced POM written at: C:\Users\jenkins\AppData\Local\Temp\3\jenkins-maven-box-maven-surefire-docker-alpine-4@2\surefire-booter\dependency-reduced-pom.xml
[2019-10-19T23:41:57.870Z] [INFO] 
[2019-10-19T23:41:57.870Z] [INFO] --- maven-checkstyle-plugin:3.0.0:check (checkstyle-check) @ surefire-booter ---
[2019-10-19T23:41:57.870Z] [INFO] 
[2019-10-19T23:41:57.870Z] [INFO] --- maven-checkstyle-plugin:3.0.0:check (checkstyle-check) @ surefire-booter ---
[2019-10-19T23:41:58.481Z] [INFO] There is 1 error reported by Checkstyle 6.18 with config/maven_checks.xml ruleset.
[2019-10-19T23:41:58.481Z] [ERROR] src\main\java\org\apache\maven\surefire\booter\PpidChecker.java:[42] (imports) AvoidStarImport: Using the '.*' form of import should be avoided - org.apache.commons.lang3.SystemUtils.*.
[2019-10-19T23:41:58.481Z] [INFO] ------------------------------------------------------------------------
[2019-10-19T23:41:58.481Z] [INFO] Reactor Summary for Apache Maven Surefire 3.0.0-SNAPSHOT:
[2019-10-19T23:41:58.481Z] [INFO] 
[2019-10-19T23:41:58.481Z] [INFO] Apache Maven Surefire .............................. SUCCESS [01:40 min]
[2019-10-19T23:41:58.481Z] [INFO] SureFire Logger API ................................ SUCCESS [ 27.114 s]
[2019-10-19T23:41:58.481Z] [INFO] SureFire API ....................................... SUCCESS [ 17.053 s]
[2019-10-19T23:41:58.481Z] [INFO] Surefire Extensions API ............................ SUCCESS [  3.243 s]
[2019-10-19T23:41:58.481Z] [INFO] SureFire Booter .................................... FAILURE [ 10.728 s]
[2019-10-19T23:41:58.481Z] [INFO] Maven Surefire Test-Grouping Support ............... SKIPPED
[2019-10-19T23:41:58.481Z] [INFO] SureFire Providers ................................. SKIPPED
[2019-10-19T23:41:58.481Z] [INFO] Shared JUnit3 Provider Code ........................ SKIPPED
[2019-10-19T23:41:58.481Z] [INFO] Shared Java 5 Provider Base ........................ SKIPPED
[2019-10-19T23:41:58.481Z] [INFO] Shared JUnit4 Provider Code ........................ SKIPPED
[2019-10-19T23:41:58.481Z] [INFO] Shared JUnit48 Provider Code ....................... SKIPPED
[2019-10-19T23:41:58.481Z] [INFO] SureFire JUnit Runner .............................. SKIPPED
[2019-10-19T23:41:58.481Z] [INFO] SureFire JUnit4 Runner ............................. SKIPPED
[2019-10-19T23:41:58.481Z] [INFO] Maven Surefire Common .............................. SKIPPED
[2019-10-19T23:41:58.481Z] [INFO] SureFire JUnitCore Runner .......................... SKIPPED
[2019-10-19T23:41:58.481Z] [INFO] SureFire JUnit Platform Runner ..................... SKIPPED
[2019-10-19T23:41:58.481Z] [INFO] SureFire TestNG Utils .............................. SKIPPED
[2019-10-19T23:41:58.481Z] [INFO] SureFire TestNG Runner ............................. SKIPPED
[2019-10-19T23:41:58.481Z] [INFO] ShadeFire JUnit3 Provider .......................... SKIPPED
[2019-10-19T23:41:58.481Z] [INFO] Surefire Report Parser ............................. SKIPPED
[2019-10-19T23:41:58.481Z] [INFO] Maven Surefire Plugin .............................. SKIPPED
[2019-10-19T23:41:58.481Z] [INFO] Maven Failsafe Plugin .............................. SKIPPED
[2019-10-19T23:41:58.481Z] [INFO] Maven Surefire Report Plugin ....................... SKIPPED
[2019-10-19T23:41:58.481Z] [INFO] Maven Surefire Integration Tests ................... SKIPPED
[2019-10-19T23:41:58.481Z] [INFO] ------------------------------------------------------------------------
[2019-10-19T23:41:58.481Z] [INFO] There is 1 error reported by Checkstyle 6.18 with config/maven_checks.xml ruleset.
[2019-10-19T23:41:58.481Z] [INFO] BUILD FAILURE
[2019-10-19T23:41:58.481Z] [ERROR] src\main\java\org\apache\maven\surefire\booter\PpidChecker.java:[42] (imports) AvoidStarImport: Using the '.*' form of import should be avoided - org.apache.commons.lang3.SystemUtils.*.
[2019-10-19T23:41:58.481Z] [INFO] ------------------------------------------------------------------------
[2019-10-19T23:41:58.481Z] [INFO] ------------------------------------------------------------------------
[2019-10-19T23:41:58.481Z] [INFO] Total time:  02:40 min
[2019-10-19T23:41:58.481Z] [INFO] Reactor Summary for Apache Maven Surefire 3.0.0-SNAPSHOT:
[2019-10-19T23:41:58.481Z] [INFO] 
[2019-10-19T23:41:58.481Z] [INFO] Finished at: 2019-10-19T16:41:58-07:00
[2019-10-19T23:41:58.481Z] [INFO] Apache Maven Surefire .............................. SUCCESS [01:41 min]
[2019-10-19T23:41:58.481Z] [INFO] ------------------------------------------------------------------------
[2019-10-19T23:41:58.481Z] [INFO] SureFire Logger API ................................ SUCCESS [ 26.793 s]
[2019-10-19T23:41:58.481Z] [ERROR] Failed to execute goal org.apache.maven.plugins:maven-checkstyle-plugin:3.0.0:check (checkstyle-check) on project surefire-booter: You have 1 Checkstyle violation. -> [Help 1]
[2019-10-19T23:41:58.481Z] [INFO] SureFire API ....................................... SUCCESS [ 17.263 s]
[2019-10-19T23:41:58.482Z] org.apache.maven.lifecycle.LifecycleExecutionException: Failed to execute goal org.apache.maven.plugins:maven-checkstyle-plugin:3.0.0:check (checkstyle-check) on project surefire-booter: You have 1 Checkstyle violation.
[2019-10-19T23:41:58.482Z] [INFO] Surefire Extensions API ............................ SUCCESS [  3.243 s]
[2019-10-19T23:41:58.482Z]     at org.apache.maven.lifecycle.internal.MojoExecutor.execute (MojoExecutor.java:215)
[2019-10-19T23:41:58.482Z] [INFO] SureFire Booter .................................... FAILURE [ 10.728 s]
[2019-10-19T23:41:58.482Z]     at org.apache.maven.lifecycle.internal.MojoExecutor.execute (MojoExecutor.java:156)
[2019-10-19T23:41:58.482Z] [INFO] Maven Surefire Test-Grouping Support ............... SKIPPED
[2019-10-19T23:41:58.482Z]     at org.apache.maven.lifecycle.internal.MojoExecutor.execute (MojoExecutor.java:148)
[2019-10-19T23:41:58.482Z] [INFO] SureFire Providers ................................. SKIPPED
[2019-10-19T23:41:58.482Z]     at org.apache.maven.lifecycle.internal.LifecycleModuleBuilder.buildProject (LifecycleModuleBuilder.java:117)
[2019-10-19T23:41:58.482Z] [INFO] Shared JUnit3 Provider Code ........................ SKIPPED
[2019-10-19T23:41:58.482Z]     at org.apache.maven.lifecycle.internal.LifecycleModuleBuilder.buildProject (LifecycleModuleBuilder.java:81)
[2019-10-19T23:41:58.482Z] [INFO] Shared Java 5 Provider Base ........................ SKIPPED
[2019-10-19T23:41:58.482Z]     at org.apache.maven.lifecycle.internal.builder.singlethreaded.SingleThreadedBuilder.build (SingleThreadedBuilder.java:56)
[2019-10-19T23:41:58.482Z] [INFO] Shared JUnit4 Provider Code ........................ SKIPPED
[2019-10-19T23:41:58.482Z]     at org.apache.maven.lifecycle.internal.LifecycleStarter.execute (LifecycleStarter.java:128)
[2019-10-19T23:41:58.482Z] [INFO] Shared JUnit48 Provider Code ....................... SKIPPED
[2019-10-19T23:41:58.482Z]     at org.apache.maven.DefaultMaven.doExecute (DefaultMaven.java:305)
[2019-10-19T23:41:58.482Z] [INFO] SureFire JUnit Runner .............................. SKIPPED
[2019-10-19T23:41:58.482Z]     at org.apache.maven.DefaultMaven.doExecute (DefaultMaven.java:192)
[2019-10-19T23:41:58.482Z] [INFO] SureFire JUnit4 Runner ............................. SKIPPED
[2019-10-19T23:41:58.482Z]     at org.apache.maven.DefaultMaven.execute (DefaultMaven.java:105)
[2019-10-19T23:41:58.482Z] [INFO] Maven Surefire Common .............................. SKIPPED
[2019-10-19T23:41:58.482Z]     at org.apache.maven.cli.MavenCli.execute (MavenCli.java:956)
[2019-10-19T23:41:58.482Z] [INFO] SureFire JUnitCore Runner .......................... SKIPPED
[2019-10-19T23:41:58.482Z]     at org.apache.maven.cli.MavenCli.doMain (MavenCli.java:288)
[2019-10-19T23:41:58.482Z] [INFO] SureFire JUnit Platform Runner ..................... SKIPPED
[2019-10-19T23:41:58.482Z]     at org.apache.maven.cli.MavenCli.main (MavenCli.java:192)
[2019-10-19T23:41:58.482Z] [INFO] SureFire TestNG Utils .............................. SKIPPED
[2019-10-19T23:41:58.482Z]     at sun.reflect.NativeMethodAccessorImpl.invoke0 (Native Method)
[2019-10-19T23:41:58.482Z] [INFO] SureFire TestNG Runner ............................. SKIPPED
[2019-10-19T23:41:58.482Z]     at sun.reflect.NativeMethodAccessorImpl.invoke (NativeMethodAccessorImpl.java:62)
[2019-10-19T23:41:58.482Z] [INFO] ShadeFire JUnit3 Provider .......................... SKIPPED
[2019-10-19T23:41:58.482Z]     at sun.reflect.DelegatingMethodAccessorImpl.invoke (DelegatingMethodAccessorImpl.java:43)
[2019-10-19T23:41:58.482Z] [INFO] Surefire Report Parser ............................. SKIPPED
[2019-10-19T23:41:58.482Z]     at java.lang.reflect.Method.invoke (Method.java:498)
[2019-10-19T23:41:58.482Z] [INFO] Maven Surefire Plugin .............................. SKIPPED
[2019-10-19T23:41:58.482Z]     at org.codehaus.plexus.classworlds.launcher.Launcher.launchEnhanced (Launcher.java:282)
[2019-10-19T23:41:58.483Z] [INFO] Maven Failsafe Plugin .............................. SKIPPED
[2019-10-19T23:41:58.483Z]     at org.codehaus.plexus.classworlds.launcher.Launcher.launch (Launcher.java:225)
[2019-10-19T23:41:58.483Z] [INFO] Maven Surefire Report Plugin ....................... SKIPPED
[2019-10-19T23:41:58.483Z]     at org.codehaus.plexus.classworlds.launcher.Launcher.mainWithExitCode (Launcher.java:406)
[2019-10-19T23:41:58.483Z] [INFO] Maven Surefire Integration Tests ................... SKIPPED
[2019-10-19T23:41:58.483Z]     at org.codehaus.plexus.classworlds.launcher.Launcher.main (Launcher.java:347)
[2019-10-19T23:41:58.483Z] [INFO] ------------------------------------------------------------------------
[2019-10-19T23:41:58.483Z] Caused by: org.apache.maven.plugin.MojoFailureException: You have 1 Checkstyle violation.
[2019-10-19T23:41:58.483Z] [INFO] BUILD FAILURE
[2019-10-19T23:41:58.483Z]     at org.apache.maven.plugins.checkstyle.CheckstyleViolationCheckMojo.execute (CheckstyleViolationCheckMojo.java:576)
[2019-10-19T23:41:58.483Z] [INFO] ------------------------------------------------------------------------
[2019-10-19T23:41:58.483Z]     at org.apache.maven.plugin.DefaultBuildPluginManager.executeMojo (DefaultBuildPluginManager.java:137)
[2019-10-19T23:41:58.483Z] [INFO] Total time:  02:42 min
[2019-10-19T23:41:58.483Z]     at org.apache.maven.lifecycle.internal.MojoExecutor.execute (MojoExecutor.java:210)
[2019-10-19T23:41:58.483Z] [INFO] Finished at: 2019-10-19T16:41:58-07:00
[2019-10-19T23:41:58.483Z]     at org.apache.maven.lifecycle.internal.MojoExecutor.execute (MojoExecutor.java:156)
[2019-10-19T23:41:58.483Z] [INFO] ------------------------------------------------------------------------
[2019-10-19T23:41:58.483Z]     at org.apache.maven.lifecycle.internal.MojoExecutor.execute (MojoExecutor.java:148)
[2019-10-19T23:41:58.483Z] [ERROR] Failed to execute goal org.apache.maven.plugins:maven-checkstyle-plugin:3.0.0:check (checkstyle-check) on project surefire-booter: You have 1 Checkstyle violation. -> [Help 1]
[2019-10-19T23:41:58.483Z]     at org.apache.maven.lifecycle.internal.LifecycleModuleBuilder.buildProject (LifecycleModuleBuilder.java:117)
[2019-10-19T23:41:58.483Z] org.apache.maven.lifecycle.LifecycleExecutionException: Failed to execute goal org.apache.maven.plugins:maven-checkstyle-plugin:3.0.0:check (checkstyle-check) on project surefire-booter: You have 1 Checkstyle violation.
[2019-10-19T23:41:58.483Z]     at org.apache.maven.lifecycle.internal.LifecycleModuleBuilder.buildProject (LifecycleModuleBuilder.java:81)
[2019-10-19T23:41:58.483Z]     at org.apache.maven.lifecycle.internal.MojoExecutor.execute (MojoExecutor.java:215)
[2019-10-19T23:41:58.483Z]     at org.apache.maven.lifecycle.internal.builder.singlethreaded.SingleThreadedBuilder.build (SingleThreadedBuilder.java:56)
[2019-10-19T23:41:58.483Z]     at org.apache.maven.lifecycle.internal.MojoExecutor.execute (MojoExecutor.java:156)
[2019-10-19T23:41:58.483Z]     at org.apache.maven.lifecycle.internal.LifecycleStarter.execute (LifecycleStarter.java:128)
[2019-10-19T23:41:58.483Z]     at org.apache.maven.lifecycle.internal.MojoExecutor.execute (MojoExecutor.java:148)
[2019-10-19T23:41:58.483Z]     at org.apache.maven.DefaultMaven.doExecute (DefaultMaven.java:305)
[2019-10-19T23:41:58.483Z]     at org.apache.maven.lifecycle.internal.LifecycleModuleBuilder.buildProject (LifecycleModuleBuilder.java:117)
[2019-10-19T23:41:58.483Z]     at org.apache.maven.DefaultMaven.doExecute (DefaultMaven.java:192)
[2019-10-19T23:41:58.484Z]     at org.apache.maven.lifecycle.internal.LifecycleModuleBuilder.buildProject (LifecycleModuleBuilder.java:81)
[2019-10-19T23:41:58.484Z]     at org.apache.maven.DefaultMaven.execute (DefaultMaven.java:105)
[2019-10-19T23:41:58.484Z]     at org.apache.maven.lifecycle.internal.builder.singlethreaded.SingleThreadedBuilder.build (SingleThreadedBuilder.java:56)
[2019-10-19T23:41:58.484Z]     at org.apache.maven.cli.MavenCli.execute (MavenCli.java:956)
[2019-10-19T23:41:58.484Z]     at org.apache.maven.lifecycle.internal.LifecycleStarter.execute (LifecycleStarter.java:128)
[2019-10-19T23:41:58.484Z]     at org.apache.maven.cli.MavenCli.doMain (MavenCli.java:288)
[2019-10-19T23:41:58.484Z]     at org.apache.maven.DefaultMaven.doExecute (DefaultMaven.java:305)
[2019-10-19T23:41:58.484Z]     at org.apache.maven.cli.MavenCli.main (MavenCli.java:192)
[2019-10-19T23:41:58.484Z]     at org.apache.maven.DefaultMaven.doExecute (DefaultMaven.java:192)
[2019-10-19T23:41:58.484Z]     at sun.reflect.NativeMethodAccessorImpl.invoke0 (Native Method)
[2019-10-19T23:41:58.484Z]     at org.apache.maven.DefaultMaven.execute (DefaultMaven.java:105)
[2019-10-19T23:41:58.484Z]     at sun.reflect.NativeMethodAccessorImpl.invoke (NativeMethodAccessorImpl.java:62)
[2019-10-19T23:41:58.484Z]     at org.apache.maven.cli.MavenCli.execute (MavenCli.java:956)
[2019-10-19T23:41:58.484Z]     at sun.reflect.DelegatingMethodAccessorImpl.invoke (DelegatingMethodAccessorImpl.java:43)
[2019-10-19T23:41:58.484Z]     at org.apache.maven.cli.MavenCli.doMain (MavenCli.java:288)
[2019-10-19T23:41:58.484Z]     at java.lang.reflect.Method.invoke (Method.java:498)
[2019-10-19T23:41:58.484Z]     at org.apache.maven.cli.MavenCli.main (MavenCli.java:192)
[2019-10-19T23:41:58.484Z]     at org.codehaus.plexus.classworlds.launcher.Launcher.launchEnhanced (Launcher.java:282)
[2019-10-19T23:41:58.484Z]     at sun.reflect.NativeMethodAccessorImpl.invoke0 (Native Method)
[2019-10-19T23:41:58.484Z]     at org.codehaus.plexus.classworlds.launcher.Launcher.launch (Launcher.java:225)
[2019-10-19T23:41:58.484Z]     at sun.reflect.NativeMethodAccessorImpl.invoke (NativeMethodAccessorImpl.java:62)
[2019-10-19T23:41:58.484Z]     at org.codehaus.plexus.classworlds.launcher.Launcher.mainWithExitCode (Launcher.java:406)
[2019-10-19T23:41:58.484Z]     at sun.reflect.DelegatingMethodAccessorImpl.invoke (DelegatingMethodAccessorImpl.java:43)
[2019-10-19T23:41:58.484Z]     at org.codehaus.plexus.classworlds.launcher.Launcher.main (Launcher.java:347)
[2019-10-19T23:41:58.484Z] [ERROR] 
[2019-10-19T23:41:58.484Z]     at java.lang.reflect.Method.invoke (Method.java:498)
[2019-10-19T23:41:58.484Z] [ERROR] Re-run Maven using the -X switch to enable full debug logging.
[2019-10-19T23:41:58.484Z]     at org.codehaus.plexus.classworlds.launcher.Launcher.launchEnhanced (Launcher.java:282)
[2019-10-19T23:41:58.484Z] [ERROR] 
[2019-10-19T23:41:58.484Z]     at org.codehaus.plexus.classworlds.launcher.Launcher.launch (Launcher.java:225)
[2019-10-19T23:41:58.484Z] [ERROR] For more information about the errors and possible solutions, please read the following articles:
[2019-10-19T23:41:58.484Z]     at org.codehaus.plexus.classworlds.launcher.Launcher.mainWithExitCode (Launcher.java:406)
[2019-10-19T23:41:58.484Z] [ERROR] [Help 1] http://cwiki.apache.org/confluence/display/MAVEN/MojoFailureException
[2019-10-19T23:41:58.484Z] [ERROR] 
[2019-10-19T23:41:58.484Z]     at org.codehaus.plexus.classworlds.launcher.Launcher.main (Launcher.java:347)
[2019-10-19T23:41:58.484Z] [ERROR] After correcting the problems, you can resume the build with the command
[2019-10-19T23:41:58.484Z] Caused by: org.apache.maven.plugin.MojoFailureException: You have 1 Checkstyle violation.
[2019-10-19T23:41:58.484Z] [ERROR]   mvn <args> -rf :surefire-booter
[2019-10-19T23:41:58.484Z]     at org.apache.maven.plugins.checkstyle.CheckstyleViolationCheckMojo.execute (CheckstyleViolationCheckMojo.java:576)
[2019-10-19T23:41:58.485Z]     at org.apache.maven.plugin.DefaultBuildPluginManager.executeMojo (DefaultBuildPluginManager.java:137)
[2019-10-19T23:41:58.485Z]     at org.apache.maven.lifecycle.internal.MojoExecutor.execute (MojoExecutor.java:210)
[2019-10-19T23:41:58.485Z]     at org.apache.maven.lifecycle.internal.MojoExecutor.execute (MojoExecutor.java:156)
[2019-10-19T23:41:58.485Z]     at org.apache.maven.lifecycle.internal.MojoExecutor.execute (MojoExecutor.java:148)
[2019-10-19T23:41:58.485Z]     at org.apache.maven.lifecycle.internal.LifecycleModuleBuilder.buildProject (LifecycleModuleBuilder.java:117)
[2019-10-19T23:41:58.485Z]     at org.apache.maven.lifecycle.internal.LifecycleModuleBuilder.buildProject (LifecycleModuleBuilder.java:81)
[2019-10-19T23:41:58.485Z]     at org.apache.maven.lifecycle.internal.builder.singlethreaded.SingleThreadedBuilder.build (SingleThreadedBuilder.java:56)
[2019-10-19T23:41:58.485Z]     at org.apache.maven.lifecycle.internal.LifecycleStarter.execute (LifecycleStarter.java:128)
[2019-10-19T23:41:58.485Z]     at org.apache.maven.DefaultMaven.doExecute (DefaultMaven.java:305)
[2019-10-19T23:41:58.485Z]     at org.apache.maven.DefaultMaven.doExecute (DefaultMaven.java:192)
[2019-10-19T23:41:58.485Z]     at org.apache.maven.DefaultMaven.execute (DefaultMaven.java:105)
[2019-10-19T23:41:58.485Z]     at org.apache.maven.cli.MavenCli.execute (MavenCli.java:956)
[2019-10-19T23:41:58.485Z]     at org.apache.maven.cli.MavenCli.doMain (MavenCli.java:288)
[2019-10-19T23:41:58.485Z]     at org.apache.maven.cli.MavenCli.main (MavenCli.java:192)
[2019-10-19T23:41:58.485Z]     at sun.reflect.NativeMethodAccessorImpl.invoke0 (Native Method)
[2019-10-19T23:41:58.485Z]     at sun.reflect.NativeMethodAccessorImpl.invoke (NativeMethodAccessorImpl.java:62)
[2019-10-19T23:41:58.485Z]     at sun.reflect.DelegatingMethodAccessorImpl.invoke (DelegatingMethodAccessorImpl.java:43)
[2019-10-19T23:41:58.485Z]     at java.lang.reflect.Method.invoke (Method.java:498)
[2019-10-19T23:41:58.485Z]     at org.codehaus.plexus.classworlds.launcher.Launcher.launchEnhanced (Launcher.java:282)
[2019-10-19T23:41:58.485Z]     at org.codehaus.plexus.classworlds.launcher.Launcher.launch (Launcher.java:225)
[2019-10-19T23:41:58.485Z]     at org.codehaus.plexus.classworlds.launcher.Launcher.mainWithExitCode (Launcher.java:406)
[2019-10-19T23:41:58.485Z]     at org.codehaus.plexus.classworlds.launcher.Launcher.main (Launcher.java:347)
[2019-10-19T23:41:58.485Z] [ERROR] 
[2019-10-19T23:41:58.485Z] [ERROR] Re-run Maven using the -X switch to enable full debug logging.
[2019-10-19T23:41:58.485Z] [ERROR] 
[2019-10-19T23:41:58.485Z] [ERROR] For more information about the errors and possible solutions, please read the following articles:
[2019-10-19T23:41:58.485Z] [ERROR] [Help 1] http://cwiki.apache.org/confluence/display/MAVEN/MojoFailureException
[2019-10-19T23:41:58.485Z] [ERROR] 
[2019-10-19T23:41:58.485Z] [ERROR] After correcting the problems, you can resume the build with the command
[2019-10-19T23:41:58.485Z] [ERROR]   mvn <args> -rf :surefire-booter
[Pipeline] }
[Pipeline] }
[Pipeline] // withEnv
[Pipeline] // withEnv
[Pipeline] }
[Pipeline] }
[Pipeline] // stage
[Pipeline] // stage
[Pipeline] fileExists
[Pipeline] fileExists
[Pipeline] fileExists
[Pipeline] fileExists
[Pipeline] archiveArtifacts
[2019-10-19T23:41:58.746Z] Archiving artifacts
[Pipeline] archiveArtifacts
[2019-10-19T23:41:58.758Z] Archiving artifacts
[Pipeline] cleanWs
[2019-10-19T23:41:58.794Z] [WS-CLEANUP] Deleting project workspace...
[2019-10-19T23:41:58.795Z] [WS-CLEANUP] Deferred wipeout is used...
[Pipeline] cleanWs
[2019-10-19T23:41:58.844Z] [WS-CLEANUP] Deleting project workspace...
[2019-10-19T23:41:58.844Z] [WS-CLEANUP] Deferred wipeout is used...
[2019-10-19T23:41:58.847Z] [WS-CLEANUP] done
[Pipeline] }
[Pipeline] // ws
[2019-10-19T23:41:58.883Z] [WS-CLEANUP] done
[Pipeline] }
[Pipeline] // timestamps
[Pipeline] }
[Pipeline] }
[Pipeline] // node
[Pipeline] // ws
[Pipeline] }
[Pipeline] }
[Pipeline] // timestamps
[Pipeline] }
[Pipeline] // node
[Pipeline] }
[Pipeline] // parallel
[Pipeline] echo
Build result: FAILURE
[Pipeline] jiraIssueSelector
[Pipeline] echo
The authors of changes [tibordigana].
[Pipeline] echo
Sending email ...
[Pipeline] emailext

Build succeeded in Jenkins: Maven TLP » maven-surefire » docker-alpine #5

Posted by Apache Jenkins Server <je...@builds.apache.org>.
See https://builds.apache.org/job/maven-box/job/maven-surefire/job/docker-alpine/5/

Changes:

* "-p" in "ps" not supported on Docker Alpine Linux

No tests ran.