You are viewing a plain text version of this content. The canonical link for it is here.
Posted to builds@hbase.apache.org by Apache Jenkins Server <je...@builds.apache.org> on 2015/10/30 10:55:54 UTC
Build failed in Jenkins: HBase-TRUNK #6983
See <https://builds.apache.org/job/HBase-TRUNK/6983/>
------------------------------------------
[...truncated 5057 lines...]
Running org.apache.hadoop.hbase.ipc.TestHBaseClient
Tests run: 1, Failures: 0, Errors: 0, Skipped: 0, Time elapsed: 0.386 sec - in org.apache.hadoop.hbase.ipc.TestHBaseClient
Running org.apache.hadoop.hbase.ipc.TestProtoBufRpc
Running org.apache.hadoop.hbase.TestFullLogReconstruction
Running org.apache.hadoop.hbase.TestGlobalMemStoreSize
Tests run: 1, Failures: 0, Errors: 0, Skipped: 0, Time elapsed: 1.976 sec - in org.apache.hadoop.hbase.ipc.TestProtoBufRpc
Running org.apache.hadoop.hbase.TestServerSideScanMetricsFromClientSide
Tests run: 2, Failures: 0, Errors: 0, Skipped: 0, Time elapsed: 3.194 sec - in org.apache.hadoop.hbase.TestServerSideScanMetricsFromClientSide
Running org.apache.hadoop.hbase.TestJMXListener
Running org.apache.hadoop.hbase.io.hfile.TestHFileBlockIndex
Running org.apache.hadoop.hbase.constraint.TestConstraint
Running org.apache.hadoop.hbase.io.hfile.TestHFileSeek
Running org.apache.hadoop.hbase.io.hfile.TestForceCacheImportantBlocks
Tests run: 1, Failures: 0, Errors: 0, Skipped: 0, Time elapsed: 2.4 sec - in org.apache.hadoop.hbase.io.hfile.TestHFileSeek
Running org.apache.hadoop.hbase.io.hfile.TestCacheConfig
Running org.apache.hadoop.hbase.trace.TestHTraceHooks
Tests run: 6, Failures: 0, Errors: 0, Skipped: 0, Time elapsed: 1.639 sec - in org.apache.hadoop.hbase.io.hfile.TestCacheConfig
Tests run: 10, Failures: 0, Errors: 0, Skipped: 0, Time elapsed: 10.562 sec - in org.apache.hadoop.hbase.io.hfile.TestHFileBlockIndex
Running org.apache.hadoop.hbase.io.hfile.TestSeekBeforeWithInlineBlocks
Running org.apache.hadoop.hbase.io.hfile.TestScannerFromBucketCache
Running org.apache.hadoop.hbase.io.hfile.TestCacheOnWrite
Tests run: 4, Failures: 0, Errors: 0, Skipped: 0, Time elapsed: 4.425 sec - in org.apache.hadoop.hbase.io.hfile.TestScannerFromBucketCache
Running org.apache.hadoop.hbase.io.hfile.TestScannerSelectionUsingTTL
Running org.apache.hadoop.hbase.io.hfile.TestHFileBlock
Tests run: 1, Failures: 0, Errors: 0, Skipped: 0, Time elapsed: 10.487 sec - in org.apache.hadoop.hbase.io.hfile.TestSeekBeforeWithInlineBlocks
Tests run: 2, Failures: 0, Errors: 0, Skipped: 0, Time elapsed: 16.995 sec - in org.apache.hadoop.hbase.io.hfile.TestForceCacheImportantBlocks
Running org.apache.hadoop.hbase.io.TestFileLink
Running org.apache.hadoop.hbase.io.encoding.TestEncodedSeekers
Running org.apache.hadoop.hbase.io.encoding.TestDataBlockEncoders
Running org.apache.hadoop.hbase.io.encoding.TestBufferedDataBlockEncoder
Tests run: 5, Failures: 0, Errors: 0, Skipped: 0, Time elapsed: 14.614 sec - in org.apache.hadoop.hbase.io.TestFileLink
Running org.apache.hadoop.hbase.io.encoding.TestLoadAndSwitchEncodeOnDisk
Tests run: 2, Failures: 0, Errors: 0, Skipped: 0, Time elapsed: 10.237 sec - in org.apache.hadoop.hbase.io.encoding.TestBufferedDataBlockEncoder
Running org.apache.hadoop.hbase.io.encoding.TestChangingEncoding
Running org.apache.hadoop.hbase.TestRegionRebalancing
Running org.apache.hadoop.hbase.TestHColumnDescriptorDefaultVersions
Running org.apache.hadoop.hbase.mapred.TestTableSnapshotInputFormat
Running org.apache.hadoop.hbase.mapred.TestTableMapReduceUtil
Running org.apache.hadoop.hbase.mapred.TestTableInputFormat
Running org.apache.hadoop.hbase.replication.TestReplicationTrackerZKImpl
Tests run: 5, Failures: 0, Errors: 0, Skipped: 0, Time elapsed: 1.517 sec - in org.apache.hadoop.hbase.replication.TestReplicationTrackerZKImpl
Running org.apache.hadoop.hbase.replication.regionserver.TestReplicationSourceManager
Tests run: 5, Failures: 0, Errors: 0, Skipped: 0, Time elapsed: 4.726 sec - in org.apache.hadoop.hbase.replication.regionserver.TestReplicationSourceManager
Running org.apache.hadoop.hbase.replication.regionserver.TestReplicationWALReaderManager
Running org.apache.hadoop.hbase.replication.regionserver.TestRegionReplicaReplicationEndpoint
Running org.apache.hadoop.hbase.replication.TestReplicationSource
Tests run: 1, Failures: 0, Errors: 0, Skipped: 0, Time elapsed: 0.216 sec - in org.apache.hadoop.hbase.replication.TestReplicationSource
Running org.apache.hadoop.hbase.replication.TestMultiSlaveReplication
Running org.apache.hadoop.hbase.replication.TestReplicationStateZKImpl
Tests run: 6, Failures: 0, Errors: 0, Skipped: 0, Time elapsed: 5.534 sec - in org.apache.hadoop.hbase.replication.TestReplicationStateZKImpl
Running org.apache.hadoop.hbase.replication.TestMasterReplication
Running org.apache.hadoop.hbase.util.TestFSTableDescriptors
Running org.apache.hadoop.hbase.util.TestMergeTool
Tests run: 16, Failures: 0, Errors: 0, Skipped: 0, Time elapsed: 2.943 sec - in org.apache.hadoop.hbase.util.TestFSTableDescriptors
Running org.apache.hadoop.hbase.util.TestConnectionCache
Running org.apache.hadoop.hbase.util.TestHBaseFsckEncryption
Running org.apache.hadoop.hbase.util.TestIdLock
Running org.apache.hadoop.hbase.util.TestMiniClusterLoadSequential
Tests run: 1, Failures: 0, Errors: 0, Skipped: 0, Time elapsed: 15.161 sec - in org.apache.hadoop.hbase.util.TestIdLock
Running org.apache.hadoop.hbase.util.TestMergeTable
Running org.apache.hadoop.hbase.util.TestHBaseFsckTwoRS
Running org.apache.hadoop.hbase.util.TestHBaseFsckMOB
Running org.apache.hadoop.hbase.util.TestHBaseFsckOneRS
Running org.apache.hadoop.hbase.util.TestMiniClusterLoadParallel
Running org.apache.hadoop.hbase.util.TestFSUtils
Running org.apache.hadoop.hbase.util.TestTableName
Tests run: 6, Failures: 0, Errors: 0, Skipped: 0, Time elapsed: 0.337 sec - in org.apache.hadoop.hbase.util.TestTableName
Running org.apache.hadoop.hbase.util.TestMiniClusterLoadEncoded
Running org.apache.hadoop.hbase.util.TestRegionSplitter
Running org.apache.hadoop.hbase.util.hbck.TestOfflineMetaRebuildBase
Running org.apache.hadoop.hbase.util.TestFSVisitor
Tests run: 1, Failures: 0, Errors: 0, Skipped: 0, Time elapsed: 1.618 sec - in org.apache.hadoop.hbase.util.TestFSVisitor
Running org.apache.hadoop.hbase.util.hbck.TestOfflineMetaRebuildOverlap
Running org.apache.hadoop.hbase.util.hbck.TestOfflineMetaRebuildHole
Running org.apache.hadoop.hbase.util.TestCoprocessorScanPolicy
Running org.apache.hadoop.hbase.util.TestDefaultEnvironmentEdge
Tests run: 1, Failures: 0, Errors: 0, Skipped: 0, Time elapsed: 0.135 sec - in org.apache.hadoop.hbase.util.TestDefaultEnvironmentEdge
Running org.apache.hadoop.hbase.util.TestFSHDFSUtils
Tests run: 3, Failures: 0, Errors: 0, Skipped: 0, Time elapsed: 8.025 sec - in org.apache.hadoop.hbase.util.TestFSHDFSUtils
Running org.apache.hadoop.hbase.util.TestHBaseFsckReplicas
Running org.apache.hadoop.hbase.TestMetaTableAccessorNoCluster
Running org.apache.hadoop.hbase.mob.TestExpiredMobFileCleaner
Tests run: 2, Failures: 0, Errors: 0, Skipped: 0, Time elapsed: 4.363 sec - in org.apache.hadoop.hbase.TestMetaTableAccessorNoCluster
Running org.apache.hadoop.hbase.TestNamespace
Running org.apache.hadoop.hbase.mob.mapreduce.TestMobSweepReducer
Running org.apache.hadoop.hbase.mob.mapreduce.TestMobSweepJob
Tests run: 3, Failures: 0, Errors: 0, Skipped: 0, Time elapsed: 2.393 sec - in org.apache.hadoop.hbase.mob.mapreduce.TestMobSweepJob
Running org.apache.hadoop.hbase.mob.compactions.TestPartitionedMobCompactor
Running org.apache.hadoop.hbase.mob.compactions.TestMobCompactor
Running org.apache.hadoop.hbase.mob.TestDefaultMobStoreFlusher
Running org.apache.hadoop.hbase.mob.TestMobDataBlockEncoding
Running org.apache.hadoop.hbase.TestInfoServers
Running org.apache.hadoop.hbase.TestMetaTableAccessor
Results :
Tests in error:
TestRegionReplicaFailover.testSecondaryRegionKillWhilePrimaryIsAcceptingWrites:334->verifyNumericRowsWithTimeout:213->Object.wait:503->Object.wait:-2 ? TestTimedOut
Tests run: 1631, Failures: 0, Errors: 1, Skipped: 37
[INFO] ------------------------------------------------------------------------
[INFO] Reactor Summary:
[INFO]
[INFO] Apache HBase ...................................... SUCCESS [ 2.485 s]
[INFO] Apache HBase - Checkstyle ......................... SUCCESS [ 0.666 s]
[INFO] Apache HBase - Resource Bundle .................... SUCCESS [ 0.282 s]
[INFO] Apache HBase - Annotations ........................ SUCCESS [ 0.501 s]
[INFO] Apache HBase - Protocol ........................... SUCCESS [ 4.537 s]
[INFO] Apache HBase - Common ............................. SUCCESS [01:52 min]
[INFO] Apache HBase - Procedure .......................... SUCCESS [01:54 min]
[INFO] Apache HBase - Client ............................. SUCCESS [01:53 min]
[INFO] Apache HBase - Hadoop Compatibility ............... SUCCESS [ 10.697 s]
[INFO] Apache HBase - Hadoop Two Compatibility ........... SUCCESS [ 14.520 s]
[INFO] Apache HBase - Prefix Tree ........................ SUCCESS [ 14.745 s]
[INFO] Apache HBase - Server ............................. FAILURE [ 01:34 h]
[INFO] Apache HBase - Testing Util ....................... SKIPPED
[INFO] Apache HBase - Thrift ............................. SKIPPED
[INFO] Apache HBase - Shell .............................. SKIPPED
[INFO] Apache HBase - Integration Tests .................. SKIPPED
[INFO] Apache HBase - Examples ........................... SKIPPED
[INFO] Apache HBase - Rest ............................... SKIPPED
[INFO] Apache HBase - External Block Cache ............... SKIPPED
[INFO] Apache HBase - Assembly ........................... SKIPPED
[INFO] Apache HBase - Shaded ............................. SKIPPED
[INFO] Apache HBase - Shaded - Client .................... SKIPPED
[INFO] Apache HBase - Shaded - Server .................... SKIPPED
[INFO] Apache HBase - Spark .............................. SKIPPED
[INFO] ------------------------------------------------------------------------
[INFO] BUILD FAILURE
[INFO] ------------------------------------------------------------------------
[INFO] Total time: 01:41 h
[INFO] Finished at: 2015-10-30T09:53:20+00:00
[INFO] Final Memory: 59M/493M
[INFO] ------------------------------------------------------------------------
[ERROR] Failed to execute goal org.apache.maven.plugins:maven-surefire-plugin:2.19:test (secondPartTestsExecution) on project hbase-server: ExecutionException Error occurred in starting fork, check output in log -> [Help 1]
[ERROR]
[ERROR] To see the full stack trace of the errors, re-run Maven with the -e switch.
[ERROR] Re-run Maven using the -X switch to enable full debug logging.
[ERROR]
[ERROR] For more information about the errors and possible solutions, please read the following articles:
[ERROR] [Help 1] http://cwiki.apache.org/confluence/display/MAVEN/MojoFailureException
[ERROR]
[ERROR] After correcting the problems, you can resume the build with the command
[ERROR] mvn <goals> -rf :hbase-server
Build step 'Invoke top-level Maven targets' marked build as failure
Performing Post build task...
Match found for :.* : True
Logical operation result is TRUE
Running script : ZOMBIE_TESTS_COUNT=`jps -v | grep surefirebooter | grep '-Dhbase.test' | wc -l`
if [[ $ZOMBIE_TESTS_COUNT != 0 ]] ; then
#It seems sometimes the tests are not dying immediately. Let's give them 30s
echo "Suspicious java process found - waiting 30s to see if there are just slow to stop"
sleep 30
ZOMBIE_TESTS_COUNT=`jps -v | grep surefirebooter | grep '-Dhbase.test' | wc -l`
if [[ $ZOMBIE_TESTS_COUNT != 0 ]] ; then
echo "There are $ZOMBIE_TESTS_COUNT zombie tests, they should have been killed by surefire but survived"
echo "************ zombies jps listing"
jps -v
jps -v | grep surefirebooter | grep '-Dhbase.test'
echo "************ BEGIN zombies jstack extract"
# HBase tests have been flagged with an innocuous '-Dhbase.test' just so they can
# be identified as hbase in a process listing.
ZB_STACK=`jps -v | grep surefirebooter | grep '-Dhbase.test' | cut -d ' ' -f 1 | xargs -n 1 jstack | grep ".test" | grep "\.java"`
jps -v | grep surefirebooter | grep '-Dhbase.test' | cut -d ' ' -f 1 | xargs -n 1 jstack
echo "************ END zombies jstack extract"
JIRA_COMMENT="$JIRA_COMMENT
{color:red}-1 core zombie tests{color}. There are ${ZOMBIE_TESTS_COUNT} zombie test(s): ${ZB_STACK}"
BAD=1
# Killing these zombies
echo 'Killing ZOMBIES!!!'
jps -v
jps -v | grep surefirebooter | grep '-Dhbase.test' | cut -d ' ' -f 1 | xargs kill -9
else
echo "We're ok: there is no zombie test, but some tests took some time to stop"
fi
[HBase-TRUNK] $ /bin/bash -xe /tmp/hudson3185611078223456714.sh
++ jps -v
++ grep surefirebooter
++ grep -Dhbase.test
++ wc -l
grep: unknown devices method
+ ZOMBIE_TESTS_COUNT=0
/tmp/hudson3185611078223456714.sh: line 30: syntax error: unexpected end of file
POST BUILD TASK : FAILURE
END OF POST BUILD TASK : 0
Archiving artifacts
Recording test results
[FINDBUGS] Collecting findbugs analysis files...
[FINDBUGS] Finding all files that match the pattern **/findbugs.xml,**/findbugsXml.xml
[FINDBUGS] Parsing 28 files in <https://builds.apache.org/job/HBase-TRUNK/ws/>
[FINDBUGS] Successfully parsed file <https://builds.apache.org/job/HBase-TRUNK/6983/artifact/hbase-annotations/target/findbugs.xml> with 0 unique warnings and 0 duplicates.
[FINDBUGS] Successfully parsed file <https://builds.apache.org/job/HBase-TRUNK/6983/artifact/hbase-annotations/target/findbugsXml.xml> with 0 unique warnings and 0 duplicates.
[FINDBUGS] Successfully parsed file <https://builds.apache.org/job/HBase-TRUNK/6983/artifact/hbase-client/target/findbugs.xml> with 0 unique warnings and 0 duplicates.
[FINDBUGS] Successfully parsed file <https://builds.apache.org/job/HBase-TRUNK/6983/artifact/hbase-client/target/findbugsXml.xml> with 14 unique warnings and 0 duplicates.
[FINDBUGS] Successfully parsed file <https://builds.apache.org/job/HBase-TRUNK/6983/artifact/hbase-common/target/findbugs.xml> with 14 unique warnings and 0 duplicates.
[FINDBUGS] Successfully parsed file <https://builds.apache.org/job/HBase-TRUNK/6983/artifact/hbase-common/target/findbugsXml.xml> with 23 unique warnings and 0 duplicates.
[FINDBUGS] Successfully parsed file <https://builds.apache.org/job/HBase-TRUNK/6983/artifact/hbase-examples/target/findbugs.xml> with 23 unique warnings and 0 duplicates.
[FINDBUGS] Successfully parsed file <https://builds.apache.org/job/HBase-TRUNK/6983/artifact/hbase-examples/target/findbugsXml.xml> with 23 unique warnings and 0 duplicates.
[FINDBUGS] Successfully parsed file <https://builds.apache.org/job/HBase-TRUNK/6983/artifact/hbase-external-blockcache/target/findbugs.xml> with 23 unique warnings and 0 duplicates.
[FINDBUGS] Successfully parsed file <https://builds.apache.org/job/HBase-TRUNK/6983/artifact/hbase-external-blockcache/target/findbugsXml.xml> with 23 unique warnings and 0 duplicates.
[FINDBUGS] Successfully parsed file <https://builds.apache.org/job/HBase-TRUNK/6983/artifact/hbase-hadoop-compat/target/findbugs.xml> with 23 unique warnings and 0 duplicates.
[FINDBUGS] Successfully parsed file <https://builds.apache.org/job/HBase-TRUNK/6983/artifact/hbase-hadoop-compat/target/findbugsXml.xml> with 23 unique warnings and 0 duplicates.
[FINDBUGS] Successfully parsed file <https://builds.apache.org/job/HBase-TRUNK/6983/artifact/hbase-hadoop2-compat/target/findbugs.xml> with 23 unique warnings and 0 duplicates.
[FINDBUGS] Successfully parsed file <https://builds.apache.org/job/HBase-TRUNK/6983/artifact/hbase-hadoop2-compat/target/findbugsXml.xml> with 23 unique warnings and 0 duplicates.
[FINDBUGS] Successfully parsed file <https://builds.apache.org/job/HBase-TRUNK/6983/artifact/hbase-prefix-tree/target/findbugs.xml> with 23 unique warnings and 0 duplicates.
[FINDBUGS] Successfully parsed file <https://builds.apache.org/job/HBase-TRUNK/6983/artifact/hbase-prefix-tree/target/findbugsXml.xml> with 24 unique warnings and 0 duplicates.
[FINDBUGS] Successfully parsed file <https://builds.apache.org/job/HBase-TRUNK/6983/artifact/hbase-procedure/target/findbugs.xml> with 24 unique warnings and 0 duplicates.
[FINDBUGS] Successfully parsed file <https://builds.apache.org/job/HBase-TRUNK/6983/artifact/hbase-procedure/target/findbugsXml.xml> with 25 unique warnings and 0 duplicates.
[FINDBUGS] Successfully parsed file <https://builds.apache.org/job/HBase-TRUNK/6983/artifact/hbase-protocol/target/findbugs.xml> with 25 unique warnings and 0 duplicates.
[FINDBUGS] Successfully parsed file <https://builds.apache.org/job/HBase-TRUNK/6983/artifact/hbase-protocol/target/findbugsXml.xml> with 25 unique warnings and 0 duplicates.
[FINDBUGS] Successfully parsed file <https://builds.apache.org/job/HBase-TRUNK/6983/artifact/hbase-rest/target/findbugs.xml> with 25 unique warnings and 0 duplicates.
[FINDBUGS] Successfully parsed file <https://builds.apache.org/job/HBase-TRUNK/6983/artifact/hbase-rest/target/findbugsXml.xml> with 27 unique warnings and 0 duplicates.
[FINDBUGS] Successfully parsed file <https://builds.apache.org/job/HBase-TRUNK/6983/artifact/hbase-server/target/findbugs.xml> with 27 unique warnings and 0 duplicates.
[FINDBUGS] Successfully parsed file <https://builds.apache.org/job/HBase-TRUNK/6983/artifact/hbase-server/target/findbugsXml.xml> with 104 unique warnings and 1 duplicate.
[FINDBUGS] Successfully parsed file <https://builds.apache.org/job/HBase-TRUNK/6983/artifact/hbase-spark/target/findbugs.xml> with 104 unique warnings and 0 duplicates.
[FINDBUGS] Successfully parsed file <https://builds.apache.org/job/HBase-TRUNK/6983/artifact/hbase-spark/target/findbugsXml.xml> with 141 unique warnings and 0 duplicates.
[FINDBUGS] Successfully parsed file <https://builds.apache.org/job/HBase-TRUNK/6983/artifact/hbase-thrift/target/findbugs.xml> with 141 unique warnings and 0 duplicates.
[FINDBUGS] Successfully parsed file <https://builds.apache.org/job/HBase-TRUNK/6983/artifact/hbase-thrift/target/findbugsXml.xml> with 141 unique warnings and 0 duplicates.
[FINDBUGS] Computing warning deltas based on reference build #6982
[CHECKSTYLE] Collecting checkstyle analysis files...
[CHECKSTYLE] Finding all files that match the pattern **/checkstyle-result.xml
[CHECKSTYLE] Parsing 24 files in <https://builds.apache.org/job/HBase-TRUNK/ws/>
[CHECKSTYLE] Successfully parsed file <https://builds.apache.org/job/HBase-TRUNK/6983/artifact/hbase-annotations/target/checkstyle-result.xml> with 0 unique warnings and 0 duplicates.
[CHECKSTYLE] Successfully parsed file <https://builds.apache.org/job/HBase-TRUNK/6983/artifact/hbase-assembly/target/checkstyle-result.xml> with 0 unique warnings and 0 duplicates.
[CHECKSTYLE] Successfully parsed file <https://builds.apache.org/job/HBase-TRUNK/6983/artifact/hbase-checkstyle/target/checkstyle-result.xml> with 0 unique warnings and 0 duplicates.
[CHECKSTYLE] Successfully parsed file <https://builds.apache.org/job/HBase-TRUNK/6983/artifact/hbase-client/target/checkstyle-result.xml> with 198 unique warnings and 0 duplicates.
[CHECKSTYLE] Successfully parsed file <https://builds.apache.org/job/HBase-TRUNK/6983/artifact/hbase-common/target/checkstyle-result.xml> with 297 unique warnings and 0 duplicates.
[CHECKSTYLE] Successfully parsed file <https://builds.apache.org/job/HBase-TRUNK/6983/artifact/hbase-examples/target/checkstyle-result.xml> with 324 unique warnings and 0 duplicates.
[CHECKSTYLE] Successfully parsed file <https://builds.apache.org/job/HBase-TRUNK/6983/artifact/hbase-external-blockcache/target/checkstyle-result.xml> with 324 unique warnings and 0 duplicates.
[CHECKSTYLE] Successfully parsed file <https://builds.apache.org/job/HBase-TRUNK/6983/artifact/hbase-hadoop-compat/target/checkstyle-result.xml> with 326 unique warnings and 0 duplicates.
[CHECKSTYLE] Successfully parsed file <https://builds.apache.org/job/HBase-TRUNK/6983/artifact/hbase-hadoop2-compat/target/checkstyle-result.xml> with 357 unique warnings and 0 duplicates.
[CHECKSTYLE] Successfully parsed file <https://builds.apache.org/job/HBase-TRUNK/6983/artifact/hbase-it/target/checkstyle-result.xml> with 357 unique warnings and 0 duplicates.
[CHECKSTYLE] Successfully parsed file <https://builds.apache.org/job/HBase-TRUNK/6983/artifact/hbase-prefix-tree/target/checkstyle-result.xml> with 374 unique warnings and 0 duplicates.
[CHECKSTYLE] Successfully parsed file <https://builds.apache.org/job/HBase-TRUNK/6983/artifact/hbase-procedure/target/checkstyle-result.xml> with 374 unique warnings and 0 duplicates.
[CHECKSTYLE] Successfully parsed file <https://builds.apache.org/job/HBase-TRUNK/6983/artifact/hbase-protocol/target/checkstyle-result.xml> with 376 unique warnings and 0 duplicates.
[CHECKSTYLE] Successfully parsed file <https://builds.apache.org/job/HBase-TRUNK/6983/artifact/hbase-resource-bundle/target/checkstyle-result.xml> with 376 unique warnings and 0 duplicates.
[CHECKSTYLE] Successfully parsed file <https://builds.apache.org/job/HBase-TRUNK/6983/artifact/hbase-rest/target/checkstyle-result.xml> with 418 unique warnings and 0 duplicates.
[CHECKSTYLE] Successfully parsed file <https://builds.apache.org/job/HBase-TRUNK/6983/artifact/hbase-server/target/checkstyle-result.xml> with 1707 unique warnings and 0 duplicates.
[CHECKSTYLE] Successfully parsed file <https://builds.apache.org/job/HBase-TRUNK/6983/artifact/hbase-shaded/hbase-shaded-client/target/checkstyle-result.xml> with 1707 unique warnings and 0 duplicates.
[CHECKSTYLE] Successfully parsed file <https://builds.apache.org/job/HBase-TRUNK/6983/artifact/hbase-shaded/hbase-shaded-server/target/checkstyle-result.xml> with 1707 unique warnings and 0 duplicates.
[CHECKSTYLE] Successfully parsed file <https://builds.apache.org/job/HBase-TRUNK/6983/artifact/hbase-shaded/target/checkstyle-result.xml> with 1707 unique warnings and 0 duplicates.
[CHECKSTYLE] Successfully parsed file <https://builds.apache.org/job/HBase-TRUNK/6983/artifact/hbase-shell/target/checkstyle-result.xml> with 1707 unique warnings and 0 duplicates.
[CHECKSTYLE] Successfully parsed file <https://builds.apache.org/job/HBase-TRUNK/6983/artifact/hbase-spark/target/checkstyle-result.xml> with 1707 unique warnings and 0 duplicates.
[CHECKSTYLE] Successfully parsed file <https://builds.apache.org/job/HBase-TRUNK/6983/artifact/hbase-testing-util/target/checkstyle-result.xml> with 1707 unique warnings and 0 duplicates.
[CHECKSTYLE] Successfully parsed file <https://builds.apache.org/job/HBase-TRUNK/6983/artifact/hbase-thrift/target/checkstyle-result.xml> with 1728 unique warnings and 0 duplicates.
[CHECKSTYLE] Successfully parsed file <https://builds.apache.org/job/HBase-TRUNK/6983/artifact/target/checkstyle-result.xml> with 1728 unique warnings and 0 duplicates.
[CHECKSTYLE] Computing warning deltas based on reference build #6982
Jenkins build is back to normal : HBase-TRUNK #6986
Posted by Apache Jenkins Server <je...@builds.apache.org>.
See <https://builds.apache.org/job/HBase-TRUNK/6986/changes>
Build failed in Jenkins: HBase-TRUNK #6985
Posted by Apache Jenkins Server <je...@builds.apache.org>.
See <https://builds.apache.org/job/HBase-TRUNK/6985/changes>
Changes:
[anoopsamjohn] HBASE-14557 MapReduce WALPlayer issue with NoTagsKeyValue.
[eclark] HBASE-14687 Un-synchronize BufferedMutator
[stack] Revert "HBASE-14722 Update surefire to 2.19"
[enis] HBASE-14733 Minor typo in alter_namespace.rb
[Gary Helmling] HBASE-14700 Support a permissive mode for secure clusters to allow
[ndimiduk] update ndimiduk affiliation
[jmhsieh] HBASE-14711 Remove or annotate deprecated methods in HRegionInfo
[mstanleyjones] HBASE-14026 Clarify 'Web API' in version and compatibility docs
[mstanleyjones] HBASE-14532 Add dfs shortcircuit configs to hbase-default.xml, fix
[mstanleyjones] HBASE-14640 Move Cascading info from Wiki to Ref Guide
[mstanleyjones] HBASE-14641 Move JDO example to HBase Ref Guide
[mstanleyjones] HBASE-13478 Document the change of default master ports being used
[mstanleyjones] HBASE-14639 Move Scala info from HBase Wiki to Ref Guide
[mstanleyjones] HBASE-14638 Move Jython info from the Wiki to the Ref Guide
[mstanleyjones] HBASE-14739 Fix broken link to Javadoc that is suppressed because it is
[stack] HBASE-14728 TestRowCounter is broken in master (Abhishek Singh Chouhan)
[stack] HBASE-14725 Vet categorization of tests so they for sure go into the
[jmhsieh] HBASE-14731 Add -DuseMob option to ITBLL
[stack] Revert "HBASE-14728 TestRowCounter is broken in master (Abhishek Singh
[stack] HBASE-14728 TestRowCounter is broken in master (Abhishek Singh Chouhan)
[stack] Revert "HBASE-14725 Vet categorization of tests so they for sure go
[stack] HBASE-13014 Java Tool For Region Moving
------------------------------------------
[...truncated 656 lines...]
[mkdir] Created dir: /x1/jenkins/jenkins-slave/workspace/HBase-TRUNK/hbase-server/target/hbase-webapps
[copy] Copying 20 files to /x1/jenkins/jenkins-slave/workspace/HBase-TRUNK/hbase-server/target/hbase-webapps
[INFO] Logging to org.slf4j.impl.SimpleLogger(org.mortbay.log) via org.mortbay.log.Slf4jLog
[mkdir] Created dir: /x1/jenkins/jenkins-slave/workspace/HBase-TRUNK/hbase-server/target/hbase-webapps/master/WEB-INF
[mkdir] Created dir: /x1/jenkins/jenkins-slave/workspace/HBase-TRUNK/hbase-server/target/hbase-webapps/regionserver/WEB-INF
[INFO] Executed tasks
[INFO]
[INFO] --- maven-remote-resources-plugin:1.5:process (default) @ hbase-server ---
[INFO]
[INFO] --- maven-resources-plugin:2.6:resources (default-resources) @ hbase-server ---
[INFO] Using 'UTF-8' encoding to copy filtered resources.
[INFO] Copying 22 resources
[INFO] Copying 2 resources
[INFO]
[INFO] --- maven-compiler-plugin:3.2:compile (default-compile) @ hbase-server ---
[INFO] Compiling 808 source files to /x1/jenkins/jenkins-slave/workspace/HBase-TRUNK/hbase-server/target/classes
[INFO] /x1/jenkins/jenkins-slave/workspace/HBase-TRUNK/hbase-server/src/main/java/org/apache/hadoop/hbase/util/hbck/ReplicationChecker.java: Some input files use or override a deprecated API.
[INFO] /x1/jenkins/jenkins-slave/workspace/HBase-TRUNK/hbase-server/src/main/java/org/apache/hadoop/hbase/util/hbck/ReplicationChecker.java: Recompile with -Xlint:deprecation for details.
[INFO] /x1/jenkins/jenkins-slave/workspace/HBase-TRUNK/hbase-server/src/main/java/org/apache/hadoop/hbase/coprocessor/CoprocessorHost.java: Some input files use unchecked or unsafe operations.
[INFO] /x1/jenkins/jenkins-slave/workspace/HBase-TRUNK/hbase-server/src/main/java/org/apache/hadoop/hbase/coprocessor/CoprocessorHost.java: Recompile with -Xlint:unchecked for details.
[INFO] -------------------------------------------------------------
[WARNING] COMPILATION WARNING :
[INFO] -------------------------------------------------------------
[WARNING] /x1/jenkins/jenkins-slave/workspace/HBase-TRUNK/hbase-server/src/main/java/org/apache/hadoop/hbase/util/FSUtils.java:[229,15] sun.misc.Signal is internal proprietary API and may be removed in a future release
[WARNING] /x1/jenkins/jenkins-slave/workspace/HBase-TRUNK/hbase-server/src/main/java/org/apache/hadoop/hbase/util/FSUtils.java:[229,39] sun.misc.SignalHandler is internal proprietary API and may be removed in a future release
[WARNING] /x1/jenkins/jenkins-slave/workspace/HBase-TRUNK/hbase-server/src/main/java/org/apache/hadoop/hbase/regionserver/HRegionServer.java:[611,25] sun.misc.Signal is internal proprietary API and may be removed in a future release
[WARNING] /x1/jenkins/jenkins-slave/workspace/HBase-TRUNK/hbase-server/src/main/java/org/apache/hadoop/hbase/regionserver/HRegionServer.java:[611,44] sun.misc.SignalHandler is internal proprietary API and may be removed in a future release
[WARNING] /x1/jenkins/jenkins-slave/workspace/HBase-TRUNK/hbase-server/src/main/java/org/apache/hadoop/hbase/regionserver/HRegionServer.java:[612,28] sun.misc.Signal is internal proprietary API and may be removed in a future release
[WARNING] /x1/jenkins/jenkins-slave/workspace/HBase-TRUNK/hbase-server/src/main/java/org/apache/hadoop/hbase/regionserver/HRegionServer.java:[611,7] sun.misc.Signal is internal proprietary API and may be removed in a future release
[INFO] 6 warnings
[INFO] -------------------------------------------------------------
[INFO] -------------------------------------------------------------
[ERROR] COMPILATION ERROR :
[INFO] -------------------------------------------------------------
[ERROR] /x1/jenkins/jenkins-slave/workspace/HBase-TRUNK/hbase-server/src/main/java/org/apache/hadoop/hbase/util/RegionMover.java:[50,38] cannot find symbol
symbol: class HConnectionManager
location: package org.apache.hadoop.hbase.client
[ERROR] /x1/jenkins/jenkins-slave/workspace/HBase-TRUNK/hbase-server/src/main/java/org/apache/hadoop/hbase/util/RegionMover.java:[57,41] cannot find symbol
symbol: class MetaRegionTracker
location: package org.apache.hadoop.hbase.zookeeper
[ERROR] /x1/jenkins/jenkins-slave/workspace/HBase-TRUNK/hbase-server/src/main/java/org/apache/hadoop/hbase/util/RegionMover.java:[365,42] cannot find symbol
symbol: method currentTimeMillis()
location: class org.apache.hadoop.hbase.util.EnvironmentEdgeManager
[ERROR] /x1/jenkins/jenkins-slave/workspace/HBase-TRUNK/hbase-server/src/main/java/org/apache/hadoop/hbase/util/RegionMover.java:[366,35] cannot find symbol
symbol: method currentTimeMillis()
location: class org.apache.hadoop.hbase.util.EnvironmentEdgeManager
[ERROR] /x1/jenkins/jenkins-slave/workspace/HBase-TRUNK/hbase-server/src/main/java/org/apache/hadoop/hbase/util/RegionMover.java:[553,46] cannot find symbol
symbol: method currentTimeMillis()
location: class org.apache.hadoop.hbase.util.EnvironmentEdgeManager
[ERROR] /x1/jenkins/jenkins-slave/workspace/HBase-TRUNK/hbase-server/src/main/java/org/apache/hadoop/hbase/util/RegionMover.java:[566,38] cannot find symbol
symbol: method currentTimeMillis()
location: class org.apache.hadoop.hbase.util.EnvironmentEdgeManager
[ERROR] /x1/jenkins/jenkins-slave/workspace/HBase-TRUNK/hbase-server/src/main/java/org/apache/hadoop/hbase/util/RegionMover.java:[583,46] cannot find symbol
symbol: method currentTimeMillis()
location: class org.apache.hadoop.hbase.util.EnvironmentEdgeManager
[ERROR] /x1/jenkins/jenkins-slave/workspace/HBase-TRUNK/hbase-server/src/main/java/org/apache/hadoop/hbase/util/RegionMover.java:[668,24] cannot find symbol
symbol: variable HConnectionManager
location: class org.apache.hadoop.hbase.util.RegionMover
[ERROR] /x1/jenkins/jenkins-slave/workspace/HBase-TRUNK/hbase-server/src/main/java/org/apache/hadoop/hbase/util/RegionMover.java:[831,15] no suitable constructor found for HTable(org.apache.hadoop.conf.Configuration,org.apache.hadoop.hbase.TableName)
constructor org.apache.hadoop.hbase.client.HTable.HTable(org.apache.hadoop.hbase.client.ClusterConnection,org.apache.hadoop.hbase.client.BufferedMutatorParams) is not applicable
(actual argument org.apache.hadoop.conf.Configuration cannot be converted to org.apache.hadoop.hbase.client.ClusterConnection by method invocation conversion)
constructor org.apache.hadoop.hbase.client.HTable.HTable(org.apache.hadoop.hbase.TableName,org.apache.hadoop.hbase.client.ClusterConnection,org.apache.hadoop.hbase.client.TableConfiguration,org.apache.hadoop.hbase.client.RpcRetryingCallerFactory,org.apache.hadoop.hbase.ipc.RpcControllerFactory,java.util.concurrent.ExecutorService) is not applicable
(actual and formal argument lists differ in length)
[ERROR] /x1/jenkins/jenkins-slave/workspace/HBase-TRUNK/hbase-server/src/main/java/org/apache/hadoop/hbase/util/RegionMover.java:[879,7] cannot find symbol
symbol: class MetaRegionTracker
location: class org.apache.hadoop.hbase.util.RegionMover
[ERROR] /x1/jenkins/jenkins-slave/workspace/HBase-TRUNK/hbase-server/src/main/java/org/apache/hadoop/hbase/util/RegionMover.java:[879,39] cannot find symbol
symbol: class MetaRegionTracker
location: class org.apache.hadoop.hbase.util.RegionMover
[ERROR] /x1/jenkins/jenkins-slave/workspace/HBase-TRUNK/hbase-server/src/main/java/org/apache/hadoop/hbase/util/RegionMover.java:[897,17] no suitable constructor found for HTable(org.apache.hadoop.conf.Configuration,org.apache.hadoop.hbase.TableName)
constructor org.apache.hadoop.hbase.client.HTable.HTable(org.apache.hadoop.hbase.client.ClusterConnection,org.apache.hadoop.hbase.client.BufferedMutatorParams) is not applicable
(actual argument org.apache.hadoop.conf.Configuration cannot be converted to org.apache.hadoop.hbase.client.ClusterConnection by method invocation conversion)
constructor org.apache.hadoop.hbase.client.HTable.HTable(org.apache.hadoop.hbase.TableName,org.apache.hadoop.hbase.client.ClusterConnection,org.apache.hadoop.hbase.client.TableConfiguration,org.apache.hadoop.hbase.client.RpcRetryingCallerFactory,org.apache.hadoop.hbase.ipc.RpcControllerFactory,java.util.concurrent.ExecutorService) is not applicable
(actual and formal argument lists differ in length)
[INFO] 12 errors
[INFO] -------------------------------------------------------------
[INFO] ------------------------------------------------------------------------
[INFO] Reactor Summary:
[INFO]
[INFO] Apache HBase ...................................... SUCCESS [ 12.208 s]
[INFO] Apache HBase - Checkstyle ......................... SUCCESS [ 1.523 s]
[INFO] Apache HBase - Resource Bundle .................... SUCCESS [ 0.265 s]
[INFO] Apache HBase - Annotations ........................ SUCCESS [ 11.798 s]
[INFO] Apache HBase - Protocol ........................... SUCCESS [01:29 min]
[INFO] Apache HBase - Common ............................. SUCCESS [ 32.469 s]
[INFO] Apache HBase - Procedure .......................... SUCCESS [ 13.343 s]
[INFO] Apache HBase - Client ............................. SUCCESS [ 39.871 s]
[INFO] Apache HBase - Hadoop Compatibility ............... SUCCESS [ 6.351 s]
[INFO] Apache HBase - Hadoop Two Compatibility ........... SUCCESS [ 12.195 s]
[INFO] Apache HBase - Prefix Tree ........................ SUCCESS [ 11.969 s]
[INFO] Apache HBase - Server ............................. FAILURE [ 8.399 s]
[INFO] Apache HBase - Testing Util ....................... SKIPPED
[INFO] Apache HBase - Thrift ............................. SKIPPED
[INFO] Apache HBase - Shell .............................. SKIPPED
[INFO] Apache HBase - Integration Tests .................. SKIPPED
[INFO] Apache HBase - Examples ........................... SKIPPED
[INFO] Apache HBase - Rest ............................... SKIPPED
[INFO] Apache HBase - External Block Cache ............... SKIPPED
[INFO] Apache HBase - Assembly ........................... SKIPPED
[INFO] Apache HBase - Shaded ............................. SKIPPED
[INFO] Apache HBase - Shaded - Client .................... SKIPPED
[INFO] Apache HBase - Shaded - Server .................... SKIPPED
[INFO] Apache HBase - Spark .............................. SKIPPED
[INFO] ------------------------------------------------------------------------
[INFO] BUILD FAILURE
[INFO] ------------------------------------------------------------------------
[INFO] Total time: 04:03 min
[INFO] Finished at: 2015-11-02T21:00:18+00:00
[INFO] Final Memory: 97M/1109M
[INFO] ------------------------------------------------------------------------
[ERROR] Failed to execute goal org.apache.maven.plugins:maven-compiler-plugin:3.2:compile (default-compile) on project hbase-server: Compilation failure: Compilation failure:
[ERROR] /x1/jenkins/jenkins-slave/workspace/HBase-TRUNK/hbase-server/src/main/java/org/apache/hadoop/hbase/util/RegionMover.java:[50,38] cannot find symbol
[ERROR] symbol: class HConnectionManager
[ERROR] location: package org.apache.hadoop.hbase.client
[ERROR] /x1/jenkins/jenkins-slave/workspace/HBase-TRUNK/hbase-server/src/main/java/org/apache/hadoop/hbase/util/RegionMover.java:[57,41] cannot find symbol
[ERROR] symbol: class MetaRegionTracker
[ERROR] location: package org.apache.hadoop.hbase.zookeeper
[ERROR] /x1/jenkins/jenkins-slave/workspace/HBase-TRUNK/hbase-server/src/main/java/org/apache/hadoop/hbase/util/RegionMover.java:[365,42] cannot find symbol
[ERROR] symbol: method currentTimeMillis()
[ERROR] location: class org.apache.hadoop.hbase.util.EnvironmentEdgeManager
[ERROR] /x1/jenkins/jenkins-slave/workspace/HBase-TRUNK/hbase-server/src/main/java/org/apache/hadoop/hbase/util/RegionMover.java:[366,35] cannot find symbol
[ERROR] symbol: method currentTimeMillis()
[ERROR] location: class org.apache.hadoop.hbase.util.EnvironmentEdgeManager
[ERROR] /x1/jenkins/jenkins-slave/workspace/HBase-TRUNK/hbase-server/src/main/java/org/apache/hadoop/hbase/util/RegionMover.java:[553,46] cannot find symbol
[ERROR] symbol: method currentTimeMillis()
[ERROR] location: class org.apache.hadoop.hbase.util.EnvironmentEdgeManager
[ERROR] /x1/jenkins/jenkins-slave/workspace/HBase-TRUNK/hbase-server/src/main/java/org/apache/hadoop/hbase/util/RegionMover.java:[566,38] cannot find symbol
[ERROR] symbol: method currentTimeMillis()
[ERROR] location: class org.apache.hadoop.hbase.util.EnvironmentEdgeManager
[ERROR] /x1/jenkins/jenkins-slave/workspace/HBase-TRUNK/hbase-server/src/main/java/org/apache/hadoop/hbase/util/RegionMover.java:[583,46] cannot find symbol
[ERROR] symbol: method currentTimeMillis()
[ERROR] location: class org.apache.hadoop.hbase.util.EnvironmentEdgeManager
[ERROR] /x1/jenkins/jenkins-slave/workspace/HBase-TRUNK/hbase-server/src/main/java/org/apache/hadoop/hbase/util/RegionMover.java:[668,24] cannot find symbol
[ERROR] symbol: variable HConnectionManager
[ERROR] location: class org.apache.hadoop.hbase.util.RegionMover
[ERROR] /x1/jenkins/jenkins-slave/workspace/HBase-TRUNK/hbase-server/src/main/java/org/apache/hadoop/hbase/util/RegionMover.java:[831,15] no suitable constructor found for HTable(org.apache.hadoop.conf.Configuration,org.apache.hadoop.hbase.TableName)
[ERROR] constructor org.apache.hadoop.hbase.client.HTable.HTable(org.apache.hadoop.hbase.client.ClusterConnection,org.apache.hadoop.hbase.client.BufferedMutatorParams) is not applicable
[ERROR] (actual argument org.apache.hadoop.conf.Configuration cannot be converted to org.apache.hadoop.hbase.client.ClusterConnection by method invocation conversion)
[ERROR] constructor org.apache.hadoop.hbase.client.HTable.HTable(org.apache.hadoop.hbase.TableName,org.apache.hadoop.hbase.client.ClusterConnection,org.apache.hadoop.hbase.client.TableConfiguration,org.apache.hadoop.hbase.client.RpcRetryingCallerFactory,org.apache.hadoop.hbase.ipc.RpcControllerFactory,java.util.concurrent.ExecutorService) is not applicable
[ERROR] (actual and formal argument lists differ in length)
[ERROR] /x1/jenkins/jenkins-slave/workspace/HBase-TRUNK/hbase-server/src/main/java/org/apache/hadoop/hbase/util/RegionMover.java:[879,7] cannot find symbol
[ERROR] symbol: class MetaRegionTracker
[ERROR] location: class org.apache.hadoop.hbase.util.RegionMover
[ERROR] /x1/jenkins/jenkins-slave/workspace/HBase-TRUNK/hbase-server/src/main/java/org/apache/hadoop/hbase/util/RegionMover.java:[879,39] cannot find symbol
[ERROR] symbol: class MetaRegionTracker
[ERROR] location: class org.apache.hadoop.hbase.util.RegionMover
[ERROR] /x1/jenkins/jenkins-slave/workspace/HBase-TRUNK/hbase-server/src/main/java/org/apache/hadoop/hbase/util/RegionMover.java:[897,17] no suitable constructor found for HTable(org.apache.hadoop.conf.Configuration,org.apache.hadoop.hbase.TableName)
[ERROR] constructor org.apache.hadoop.hbase.client.HTable.HTable(org.apache.hadoop.hbase.client.ClusterConnection,org.apache.hadoop.hbase.client.BufferedMutatorParams) is not applicable
[ERROR] (actual argument org.apache.hadoop.conf.Configuration cannot be converted to org.apache.hadoop.hbase.client.ClusterConnection by method invocation conversion)
[ERROR] constructor org.apache.hadoop.hbase.client.HTable.HTable(org.apache.hadoop.hbase.TableName,org.apache.hadoop.hbase.client.ClusterConnection,org.apache.hadoop.hbase.client.TableConfiguration,org.apache.hadoop.hbase.client.RpcRetryingCallerFactory,org.apache.hadoop.hbase.ipc.RpcControllerFactory,java.util.concurrent.ExecutorService) is not applicable
[ERROR] (actual and formal argument lists differ in length)
[ERROR] -> [Help 1]
[ERROR]
[ERROR] To see the full stack trace of the errors, re-run Maven with the -e switch.
[ERROR] Re-run Maven using the -X switch to enable full debug logging.
[ERROR]
[ERROR] For more information about the errors and possible solutions, please read the following articles:
[ERROR] [Help 1] http://cwiki.apache.org/confluence/display/MAVEN/MojoFailureException
[ERROR]
[ERROR] After correcting the problems, you can resume the build with the command
[ERROR] mvn <goals> -rf :hbase-server
Build step 'Invoke top-level Maven targets' marked build as failure
Performing Post build task...
Match found for :.* : True
Logical operation result is TRUE
Running script : ZOMBIE_TESTS_COUNT=`jps -v | grep surefirebooter | grep '-Dhbase.test' | wc -l`
if [[ $ZOMBIE_TESTS_COUNT != 0 ]] ; then
#It seems sometimes the tests are not dying immediately. Let's give them 30s
echo "Suspicious java process found - waiting 30s to see if there are just slow to stop"
sleep 30
ZOMBIE_TESTS_COUNT=`jps -v | grep surefirebooter | grep '-Dhbase.test' | wc -l`
if [[ $ZOMBIE_TESTS_COUNT != 0 ]] ; then
echo "There are $ZOMBIE_TESTS_COUNT zombie tests, they should have been killed by surefire but survived"
echo "************ zombies jps listing"
jps -v
jps -v | grep surefirebooter | grep '-Dhbase.test'
echo "************ BEGIN zombies jstack extract"
# HBase tests have been flagged with an innocuous '-Dhbase.test' just so they can
# be identified as hbase in a process listing.
ZB_STACK=`jps -v | grep surefirebooter | grep '-Dhbase.test' | cut -d ' ' -f 1 | xargs -n 1 jstack | grep ".test" | grep "\.java"`
jps -v | grep surefirebooter | grep '-Dhbase.test' | cut -d ' ' -f 1 | xargs -n 1 jstack
echo "************ END zombies jstack extract"
JIRA_COMMENT="$JIRA_COMMENT
{color:red}-1 core zombie tests{color}. There are ${ZOMBIE_TESTS_COUNT} zombie test(s): ${ZB_STACK}"
BAD=1
# Killing these zombies
echo 'Killing ZOMBIES!!!'
jps -v
jps -v | grep surefirebooter | grep '-Dhbase.test' | cut -d ' ' -f 1 | xargs kill -9
else
echo "We're ok: there is no zombie test, but some tests took some time to stop"
fi
[HBase-TRUNK] $ /bin/bash -xe /tmp/hudson6625027844184480063.sh
++ jps -v
++ grep surefirebooter
++ grep -Dhbase.test
++ wc -l
grep: unknown devices method
+ ZOMBIE_TESTS_COUNT=0
/tmp/hudson6625027844184480063.sh: line 30: syntax error: unexpected end of file
POST BUILD TASK : FAILURE
END OF POST BUILD TASK : 0
Archiving artifacts
Compressed 2.06 MB of artifacts by 47.0% relative to #6982
Recording test results
ERROR: Publisher 'Publish JUnit test result report' failed: No test report files were found. Configuration error?
[FINDBUGS] Collecting findbugs analysis files...
[FINDBUGS] Finding all files that match the pattern **/findbugs.xml,**/findbugsXml.xml
[FINDBUGS] Parsing 16 files in <https://builds.apache.org/job/HBase-TRUNK/ws/>
[FINDBUGS] Successfully parsed file <https://builds.apache.org/job/HBase-TRUNK/6985/artifact/hbase-annotations/target/findbugs.xml> with 0 unique warnings and 0 duplicates.
[FINDBUGS] Successfully parsed file <https://builds.apache.org/job/HBase-TRUNK/6985/artifact/hbase-annotations/target/findbugsXml.xml> with 0 unique warnings and 0 duplicates.
[FINDBUGS] Successfully parsed file <https://builds.apache.org/job/HBase-TRUNK/6985/artifact/hbase-client/target/findbugs.xml> with 0 unique warnings and 0 duplicates.
[FINDBUGS] Successfully parsed file <https://builds.apache.org/job/HBase-TRUNK/6985/artifact/hbase-client/target/findbugsXml.xml> with 13 unique warnings and 0 duplicates.
[FINDBUGS] Successfully parsed file <https://builds.apache.org/job/HBase-TRUNK/6985/artifact/hbase-common/target/findbugs.xml> with 13 unique warnings and 0 duplicates.
[FINDBUGS] Successfully parsed file <https://builds.apache.org/job/HBase-TRUNK/6985/artifact/hbase-common/target/findbugsXml.xml> with 22 unique warnings and 0 duplicates.
[FINDBUGS] Successfully parsed file <https://builds.apache.org/job/HBase-TRUNK/6985/artifact/hbase-hadoop-compat/target/findbugs.xml> with 22 unique warnings and 0 duplicates.
[FINDBUGS] Successfully parsed file <https://builds.apache.org/job/HBase-TRUNK/6985/artifact/hbase-hadoop-compat/target/findbugsXml.xml> with 22 unique warnings and 0 duplicates.
[FINDBUGS] Successfully parsed file <https://builds.apache.org/job/HBase-TRUNK/6985/artifact/hbase-hadoop2-compat/target/findbugs.xml> with 22 unique warnings and 0 duplicates.
[FINDBUGS] Successfully parsed file <https://builds.apache.org/job/HBase-TRUNK/6985/artifact/hbase-hadoop2-compat/target/findbugsXml.xml> with 22 unique warnings and 0 duplicates.
[FINDBUGS] Successfully parsed file <https://builds.apache.org/job/HBase-TRUNK/6985/artifact/hbase-prefix-tree/target/findbugs.xml> with 22 unique warnings and 0 duplicates.
[FINDBUGS] Successfully parsed file <https://builds.apache.org/job/HBase-TRUNK/6985/artifact/hbase-prefix-tree/target/findbugsXml.xml> with 23 unique warnings and 0 duplicates.
[FINDBUGS] Successfully parsed file <https://builds.apache.org/job/HBase-TRUNK/6985/artifact/hbase-procedure/target/findbugs.xml> with 23 unique warnings and 0 duplicates.
[FINDBUGS] Successfully parsed file <https://builds.apache.org/job/HBase-TRUNK/6985/artifact/hbase-procedure/target/findbugsXml.xml> with 24 unique warnings and 0 duplicates.
[FINDBUGS] Successfully parsed file <https://builds.apache.org/job/HBase-TRUNK/6985/artifact/hbase-protocol/target/findbugs.xml> with 24 unique warnings and 0 duplicates.
[FINDBUGS] Successfully parsed file <https://builds.apache.org/job/HBase-TRUNK/6985/artifact/hbase-protocol/target/findbugsXml.xml> with 24 unique warnings and 0 duplicates.
[FINDBUGS] Computing warning deltas based on reference build #6982
[CHECKSTYLE] Collecting checkstyle analysis files...
[CHECKSTYLE] Finding all files that match the pattern **/checkstyle-result.xml
[CHECKSTYLE] No files found in <https://builds.apache.org/job/HBase-TRUNK/ws/> for pattern: **/checkstyle-result.xml
[CHECKSTYLE] Computing warning deltas based on reference build #6982
Updating HBASE-13014
Updating HBASE-14638
Updating HBASE-14639
Updating HBASE-14731
Updating HBASE-14557
Updating HBASE-14722
Updating HBASE-14711
Updating HBASE-14725
Updating HBASE-14733
Updating HBASE-14700
Updating HBASE-14641
Updating HBASE-14640
Updating HBASE-14739
Updating HBASE-14532
Updating HBASE-14728
Updating HBASE-14687
Updating HBASE-13478
Updating HBASE-14026
Re: Build failed in Jenkins: HBase-TRUNK #6984
Posted by Stack <st...@duboce.net>.
The failed test usually passes:
https://builds.apache.org/job/HBase-TRUNK/6984/testReport/junit/org.apache.hadoop.hbase.regionserver/TestSplitTransactionOnCluster/testSSHCleanupDaugtherRegionsOfAbortedSplit/history/
St.Ack
On Fri, Oct 30, 2015 at 8:54 AM, Apache Jenkins Server <
jenkins@builds.apache.org> wrote:
> See <https://builds.apache.org/job/HBase-TRUNK/6984/changes>
>
> Changes:
>
> [anoopsamjohn] HBASE-14721 Memstore add cells - Avoid many garbage.
>
> ------------------------------------------
> [...truncated 4821 lines...]
> Tests run: 1, Failures: 0, Errors: 0, Skipped: 0, Time elapsed: 19.345 sec
> - in org.apache.hadoop.hbase.master.TestTableStateManager
> Tests run: 3, Failures: 0, Errors: 0, Skipped: 0, Time elapsed: 40.269 sec
> - in org.apache.hadoop.hbase.master.TestMasterFailover
> Tests run: 2, Failures: 0, Errors: 0, Skipped: 0, Time elapsed: 17.83 sec
> - in org.apache.hadoop.hbase.master.TestMasterShutdown
> Running org.apache.hadoop.hbase.master.TestMasterNoCluster
> Running org.apache.hadoop.hbase.master.balancer.TestDefaultLoadBalancer
> Tests run: 1, Failures: 0, Errors: 0, Skipped: 0, Time elapsed: 4.219 sec
> - in org.apache.hadoop.hbase.master.balancer.TestDefaultLoadBalancer
> Running org.apache.hadoop.hbase.master.TestMasterFileSystem
> Tests run: 2, Failures: 0, Errors: 0, Skipped: 0, Time elapsed: 1.376 sec
> - in org.apache.hadoop.hbase.master.TestMasterFileSystem
> Tests run: 1, Failures: 0, Errors: 0, Skipped: 0, Time elapsed: 32.181 sec
> - in org.apache.hadoop.hbase.master.TestMetaShutdownHandler
> Running org.apache.hadoop.hbase.master.balancer.TestBaseLoadBalancer
> Tests run: 7, Failures: 0, Errors: 0, Skipped: 0, Time elapsed: 0.686 sec
> - in org.apache.hadoop.hbase.master.balancer.TestBaseLoadBalancer
> Running org.apache.hadoop.hbase.master.TestActiveMasterManager
> Tests run: 2, Failures: 0, Errors: 0, Skipped: 0, Time elapsed: 1.421 sec
> - in org.apache.hadoop.hbase.master.TestActiveMasterManager
> Tests run: 3, Failures: 0, Errors: 0, Skipped: 0, Time elapsed: 14.873 sec
> - in org.apache.hadoop.hbase.master.TestMasterNoCluster
> Running org.apache.hadoop.hbase.master.TestMasterTransitions
> Tests run: 3, Failures: 0, Errors: 0, Skipped: 3, Time elapsed: 0.004 sec
> - in org.apache.hadoop.hbase.master.TestMasterTransitions
> Running org.apache.hadoop.hbase.master.TestRestartCluster
> Running org.apache.hadoop.hbase.master.TestTableLockManager
> Running org.apache.hadoop.hbase.master.TestRegionPlacement2
> Tests run: 2, Failures: 0, Errors: 0, Skipped: 0, Time elapsed: 2.695 sec
> - in org.apache.hadoop.hbase.master.TestRegionPlacement2
> Running
> org.apache.hadoop.hbase.master.handler.TestTableDescriptorModification
> Running org.apache.hadoop.hbase.master.handler.TestTableDeleteFamilyHandler
> Tests run: 2, Failures: 0, Errors: 0, Skipped: 0, Time elapsed: 18.057 sec
> - in org.apache.hadoop.hbase.master.handler.TestTableDeleteFamilyHandler
> Tests run: 2, Failures: 0, Errors: 0, Skipped: 0, Time elapsed: 46.702 sec
> - in org.apache.hadoop.hbase.master.TestRestartCluster
> Running org.apache.hadoop.hbase.master.handler.TestEnableTableHandler
> Running org.apache.hadoop.hbase.master.handler.TestCreateTableHandler
> Tests run: 7, Failures: 0, Errors: 0, Skipped: 0, Time elapsed: 35.288 sec
> - in org.apache.hadoop.hbase.master.handler.TestTableDescriptorModification
> Running org.apache.hadoop.hbase.master.TestGetLastFlushedSequenceId
> Tests run: 20, Failures: 0, Errors: 0, Skipped: 0, Time elapsed: 94.019
> sec - in org.apache.hadoop.hbase.master.TestAssignmentManagerOnCluster
> Running org.apache.hadoop.hbase.master.TestRollingRestart
> Tests run: 1, Failures: 0, Errors: 0, Skipped: 0, Time elapsed: 20.69 sec
> - in org.apache.hadoop.hbase.master.TestGetLastFlushedSequenceId
> Tests run: 3, Failures: 0, Errors: 0, Skipped: 0, Time elapsed: 30.255 sec
> - in org.apache.hadoop.hbase.master.handler.TestCreateTableHandler
> Running org.apache.hadoop.hbase.master.TestSplitLogManager
> Running org.apache.hadoop.hbase.master.TestHMasterRPCException
> Tests run: 2, Failures: 0, Errors: 0, Skipped: 0, Time elapsed: 33.613 sec
> - in org.apache.hadoop.hbase.master.handler.TestEnableTableHandler
> Tests run: 1, Failures: 0, Errors: 0, Skipped: 0, Time elapsed: 3.779 sec
> - in org.apache.hadoop.hbase.master.TestHMasterRPCException
> Running org.apache.hadoop.hbase.master.TestClusterStatusPublisher
> Tests run: 3, Failures: 0, Errors: 0, Skipped: 0, Time elapsed: 0.284 sec
> - in org.apache.hadoop.hbase.master.TestClusterStatusPublisher
> Running org.apache.hadoop.hbase.master.TestGetInfoPort
> Tests run: 1, Failures: 0, Errors: 0, Skipped: 0, Time elapsed: 33.141 sec
> - in org.apache.hadoop.hbase.master.TestRollingRestart
> Running org.apache.hadoop.hbase.master.TestMaster
> Running org.apache.hadoop.hbase.master.TestDeadServer
> Tests run: 3, Failures: 0, Errors: 0, Skipped: 0, Time elapsed: 0.132 sec
> - in org.apache.hadoop.hbase.master.TestDeadServer
> Tests run: 1, Failures: 0, Errors: 0, Skipped: 0, Time elapsed: 13.307 sec
> - in org.apache.hadoop.hbase.master.TestGetInfoPort
> Tests run: 4, Failures: 0, Errors: 0, Skipped: 0, Time elapsed: 102.223
> sec - in org.apache.hadoop.hbase.master.TestTableLockManager
> Running org.apache.hadoop.hbase.master.TestMasterStatusServlet
> Tests run: 4, Failures: 0, Errors: 0, Skipped: 0, Time elapsed: 1.889 sec
> - in org.apache.hadoop.hbase.master.TestMasterStatusServlet
> Running
> org.apache.hadoop.hbase.master.normalizer.TestSimpleRegionNormalizerOnCluster
> Tests run: 4, Failures: 0, Errors: 0, Skipped: 0, Time elapsed: 15.323 sec
> - in org.apache.hadoop.hbase.master.TestMaster
> Running org.apache.hadoop.hbase.master.cleaner.TestHFileCleaner
> Running org.apache.hadoop.hbase.master.cleaner.TestLogsCleaner
> Tests run: 3, Failures: 0, Errors: 0, Skipped: 0, Time elapsed: 1.467 sec
> - in org.apache.hadoop.hbase.master.cleaner.TestHFileCleaner
> Running org.apache.hadoop.hbase.master.cleaner.TestSnapshotFromMaster
> Tests run: 2, Failures: 0, Errors: 0, Skipped: 0, Time elapsed: 11.975 sec
> - in org.apache.hadoop.hbase.master.cleaner.TestLogsCleaner
> Running org.apache.hadoop.hbase.master.TestMasterMetrics
> Tests run: 2, Failures: 0, Errors: 0, Skipped: 0, Time elapsed: 1.369 sec
> - in org.apache.hadoop.hbase.master.TestMasterMetrics
> Running org.apache.hadoop.hbase.master.TestMasterRestartAfterDisablingTable
> Tests run: 2, Failures: 0, Errors: 0, Skipped: 0, Time elapsed: 26.215 sec
> - in
> org.apache.hadoop.hbase.master.normalizer.TestSimpleRegionNormalizerOnCluster
> Running org.apache.hadoop.hbase.master.TestRegionPlacement
> Tests run: 2, Failures: 0, Errors: 0, Skipped: 2, Time elapsed: 0.002 sec
> - in org.apache.hadoop.hbase.master.TestRegionPlacement
> Running
> org.apache.hadoop.hbase.master.TestMasterOperationsForRegionReplicas
> Tests run: 1, Failures: 0, Errors: 0, Skipped: 0, Time elapsed: 20.255 sec
> - in org.apache.hadoop.hbase.master.TestMasterRestartAfterDisablingTable
> Running org.apache.hadoop.hbase.master.TestAssignmentListener
> Tests run: 4, Failures: 0, Errors: 0, Skipped: 0, Time elapsed: 33.402 sec
> - in org.apache.hadoop.hbase.master.cleaner.TestSnapshotFromMaster
> Running org.apache.hadoop.hbase.master.snapshot.TestSnapshotFileCache
> Tests run: 2, Failures: 0, Errors: 0, Skipped: 0, Time elapsed: 10.197 sec
> - in org.apache.hadoop.hbase.master.TestAssignmentListener
> Running org.apache.hadoop.hbase.master.TestMasterMetricsWrapper
> Tests run: 1, Failures: 0, Errors: 0, Skipped: 0, Time elapsed: 2.216 sec
> - in org.apache.hadoop.hbase.master.TestMasterMetricsWrapper
> Running org.apache.hadoop.hbase.snapshot.TestSnapshotClientRetries
> Tests run: 2, Failures: 0, Errors: 0, Skipped: 0, Time elapsed: 28.308 sec
> - in org.apache.hadoop.hbase.master.TestMasterOperationsForRegionReplicas
> Running org.apache.hadoop.hbase.snapshot.TestFlushSnapshotFromClient
> Tests run: 2, Failures: 0, Errors: 0, Skipped: 0, Time elapsed: 21.399 sec
> - in org.apache.hadoop.hbase.snapshot.TestSnapshotClientRetries
> Running org.apache.hadoop.hbase.snapshot.TestSnapshotDescriptionUtils
> Tests run: 2, Failures: 0, Errors: 0, Skipped: 0, Time elapsed: 0.104 sec
> - in org.apache.hadoop.hbase.snapshot.TestSnapshotDescriptionUtils
> Running org.apache.hadoop.hbase.snapshot.TestExportSnapshot
> Tests run: 15, Failures: 0, Errors: 0, Skipped: 1, Time elapsed: 140.479
> sec - in org.apache.hadoop.hbase.master.TestSplitLogManager
> Tests run: 4, Failures: 0, Errors: 0, Skipped: 0, Time elapsed: 60.333 sec
> - in org.apache.hadoop.hbase.master.snapshot.TestSnapshotFileCache
> Running org.apache.hadoop.hbase.snapshot.TestMobSecureExportSnapshot
> Running
> org.apache.hadoop.hbase.snapshot.TestMobRestoreFlushSnapshotFromClient
> Tests run: 9, Failures: 0, Errors: 0, Skipped: 1, Time elapsed: 70.208 sec
> - in org.apache.hadoop.hbase.snapshot.TestFlushSnapshotFromClient
> Running org.apache.hadoop.hbase.snapshot.TestMobExportSnapshot
> Running org.apache.hadoop.hbase.snapshot.TestRestoreFlushSnapshotFromClient
> Tests run: 5, Failures: 0, Errors: 0, Skipped: 0, Time elapsed: 69.22 sec
> - in org.apache.hadoop.hbase.snapshot.TestRestoreFlushSnapshotFromClient
> Tests run: 5, Failures: 0, Errors: 0, Skipped: 0, Time elapsed: 109.425
> sec - in
> org.apache.hadoop.hbase.snapshot.TestMobRestoreFlushSnapshotFromClient
> Running org.apache.hadoop.hbase.snapshot.TestSecureExportSnapshot
> Tests run: 9, Failures: 0, Errors: 0, Skipped: 0, Time elapsed: 398.11 sec
> - in org.apache.hadoop.hbase.snapshot.TestExportSnapshot
> Tests run: 9, Failures: 0, Errors: 0, Skipped: 0, Time elapsed: 393.434
> sec - in org.apache.hadoop.hbase.snapshot.TestMobSecureExportSnapshot
> Tests run: 9, Failures: 0, Errors: 0, Skipped: 0, Time elapsed: 395.756
> sec - in org.apache.hadoop.hbase.snapshot.TestMobExportSnapshot
> Tests run: 9, Failures: 0, Errors: 0, Skipped: 0, Time elapsed: 359.922
> sec - in org.apache.hadoop.hbase.snapshot.TestSecureExportSnapshot
>
> Results :
>
> Failed tests:
>
> TestSplitTransactionOnCluster.testSSHCleanupDaugtherRegionsOfAbortedSplit:996
> {b7da38d105b70d06a3b002f6bfe6694b={b7da38d105b70d06a3b002f6bfe6694b
> state=SPLITTING, ts=1446218150399, server=pomona.apache.org,56119,1446218140859},
> 833b078759f7d52f456f1aca0ca120cb={833b078759f7d52f456f1aca0ca120cb
> state=SPLITTING_NEW, ts=1446218150404, server=pomona.apache.org,56119,1446218140859},
> fa6feb686dcab5ea4a637f174f8a0b09={fa6feb686dcab5ea4a637f174f8a0b09
> state=SPLITTING_NEW, ts=1446218150404, server=pomona.apache.org,56119,1446218140859}}
> expected:<0> but was:<3>
>
> Tests run: 2443, Failures: 1, Errors: 0, Skipped: 41
>
> [INFO]
> ------------------------------------------------------------------------
> [INFO] Reactor Summary:
> [INFO]
> [INFO] Apache HBase ...................................... SUCCESS [
> 2.615 s]
> [INFO] Apache HBase - Checkstyle ......................... SUCCESS [
> 0.639 s]
> [INFO] Apache HBase - Resource Bundle .................... SUCCESS [
> 0.254 s]
> [INFO] Apache HBase - Annotations ........................ SUCCESS [
> 0.205 s]
> [INFO] Apache HBase - Protocol ........................... SUCCESS [
> 2.864 s]
> [INFO] Apache HBase - Common ............................. SUCCESS [01:41
> min]
> [INFO] Apache HBase - Procedure .......................... SUCCESS [01:55
> min]
> [INFO] Apache HBase - Client ............................. SUCCESS [01:44
> min]
> [INFO] Apache HBase - Hadoop Compatibility ............... SUCCESS [
> 9.627 s]
> [INFO] Apache HBase - Hadoop Two Compatibility ........... SUCCESS [
> 9.832 s]
> [INFO] Apache HBase - Prefix Tree ........................ SUCCESS [
> 13.401 s]
> [INFO] Apache HBase - Server ............................. FAILURE [
> 01:27 h]
> [INFO] Apache HBase - Testing Util ....................... SKIPPED
> [INFO] Apache HBase - Thrift ............................. SKIPPED
> [INFO] Apache HBase - Shell .............................. SKIPPED
> [INFO] Apache HBase - Integration Tests .................. SKIPPED
> [INFO] Apache HBase - Examples ........................... SKIPPED
> [INFO] Apache HBase - Rest ............................... SKIPPED
> [INFO] Apache HBase - External Block Cache ............... SKIPPED
> [INFO] Apache HBase - Assembly ........................... SKIPPED
> [INFO] Apache HBase - Shaded ............................. SKIPPED
> [INFO] Apache HBase - Shaded - Client .................... SKIPPED
> [INFO] Apache HBase - Shaded - Server .................... SKIPPED
> [INFO] Apache HBase - Spark .............................. SKIPPED
> [INFO]
> ------------------------------------------------------------------------
> [INFO] BUILD FAILURE
> [INFO]
> ------------------------------------------------------------------------
> [INFO] Total time: 01:33 h
> [INFO] Finished at: 2015-10-30T15:50:39+00:00
> [INFO] Final Memory: 62M/600M
> [INFO]
> ------------------------------------------------------------------------
> [ERROR] Failed to execute goal
> org.apache.maven.plugins:maven-surefire-plugin:2.19:test
> (secondPartTestsExecution) on project hbase-server: There are test failures.
> [ERROR]
> [ERROR] Please refer to <
> https://builds.apache.org/job/HBase-TRUNK/ws/hbase-server/target/surefire-reports>
> for the individual test results.
> [ERROR] -> [Help 1]
> [ERROR]
> [ERROR] To see the full stack trace of the errors, re-run Maven with the
> -e switch.
> [ERROR] Re-run Maven using the -X switch to enable full debug logging.
> [ERROR]
> [ERROR] For more information about the errors and possible solutions,
> please read the following articles:
> [ERROR] [Help 1]
> http://cwiki.apache.org/confluence/display/MAVEN/MojoFailureException
> [ERROR]
> [ERROR] After correcting the problems, you can resume the build with the
> command
> [ERROR] mvn <goals> -rf :hbase-server
> Build step 'Invoke top-level Maven targets' marked build as failure
> Performing Post build task...
> Match found for :.* : True
> Logical operation result is TRUE
> Running script : ZOMBIE_TESTS_COUNT=`jps -v | grep surefirebooter |
> grep '-Dhbase.test' | wc -l`
> if [[ $ZOMBIE_TESTS_COUNT != 0 ]] ; then
> #It seems sometimes the tests are not dying immediately. Let's give
> them 30s
> echo "Suspicious java process found - waiting 30s to see if there are
> just slow to stop"
> sleep 30
> ZOMBIE_TESTS_COUNT=`jps -v | grep surefirebooter | grep '-Dhbase.test'
> | wc -l`
> if [[ $ZOMBIE_TESTS_COUNT != 0 ]] ; then
> echo "There are $ZOMBIE_TESTS_COUNT zombie tests, they should have
> been killed by surefire but survived"
> echo "************ zombies jps listing"
> jps -v
> jps -v | grep surefirebooter | grep '-Dhbase.test'
> echo "************ BEGIN zombies jstack extract"
> # HBase tests have been flagged with an innocuous '-Dhbase.test'
> just so they can
> # be identified as hbase in a process listing.
> ZB_STACK=`jps -v | grep surefirebooter | grep '-Dhbase.test' | cut
> -d ' ' -f 1 | xargs -n 1 jstack | grep ".test" | grep "\.java"`
> jps -v | grep surefirebooter | grep '-Dhbase.test' | cut -d ' ' -f 1
> | xargs -n 1 jstack
> echo "************ END zombies jstack extract"
> JIRA_COMMENT="$JIRA_COMMENT
>
> {color:red}-1 core zombie tests{color}. There are
> ${ZOMBIE_TESTS_COUNT} zombie test(s): ${ZB_STACK}"
> BAD=1
> # Killing these zombies
> echo 'Killing ZOMBIES!!!'
> jps -v
> jps -v | grep surefirebooter | grep '-Dhbase.test' | cut -d ' ' -f 1
> | xargs kill -9
> else
> echo "We're ok: there is no zombie test, but some tests took some
> time to stop"
> fi
> [HBase-TRUNK] $ /bin/bash -xe /tmp/hudson7427541824955308186.sh
> ++ jps -v
> ++ grep surefirebooter
> ++ grep -Dhbase.test
> grep: unknown devices method
> ++ wc -l
> + ZOMBIE_TESTS_COUNT=0
> /tmp/hudson7427541824955308186.sh: line 30: syntax error: unexpected end
> of file
> POST BUILD TASK : FAILURE
> END OF POST BUILD TASK : 0
> Archiving artifacts
> Recording test results
> [FINDBUGS] Collecting findbugs analysis files...
> [FINDBUGS] Finding all files that match the pattern
> **/findbugs.xml,**/findbugsXml.xml
> [FINDBUGS] Parsing 28 files in <
> https://builds.apache.org/job/HBase-TRUNK/ws/>
> [FINDBUGS] Successfully parsed file <
> https://builds.apache.org/job/HBase-TRUNK/6984/artifact/hbase-annotations/target/findbugs.xml>
> with 0 unique warnings and 0 duplicates.
> [FINDBUGS] Successfully parsed file <
> https://builds.apache.org/job/HBase-TRUNK/6984/artifact/hbase-annotations/target/findbugsXml.xml>
> with 0 unique warnings and 0 duplicates.
> [FINDBUGS] Successfully parsed file <
> https://builds.apache.org/job/HBase-TRUNK/6984/artifact/hbase-client/target/findbugs.xml>
> with 0 unique warnings and 0 duplicates.
> [FINDBUGS] Successfully parsed file <
> https://builds.apache.org/job/HBase-TRUNK/6984/artifact/hbase-client/target/findbugsXml.xml>
> with 14 unique warnings and 0 duplicates.
> [FINDBUGS] Successfully parsed file <
> https://builds.apache.org/job/HBase-TRUNK/6984/artifact/hbase-common/target/findbugs.xml>
> with 14 unique warnings and 0 duplicates.
> [FINDBUGS] Successfully parsed file <
> https://builds.apache.org/job/HBase-TRUNK/6984/artifact/hbase-common/target/findbugsXml.xml>
> with 23 unique warnings and 0 duplicates.
> [FINDBUGS] Successfully parsed file <
> https://builds.apache.org/job/HBase-TRUNK/6984/artifact/hbase-examples/target/findbugs.xml>
> with 23 unique warnings and 0 duplicates.
> [FINDBUGS] Successfully parsed file <
> https://builds.apache.org/job/HBase-TRUNK/6984/artifact/hbase-examples/target/findbugsXml.xml>
> with 23 unique warnings and 0 duplicates.
> [FINDBUGS] Successfully parsed file <
> https://builds.apache.org/job/HBase-TRUNK/6984/artifact/hbase-external-blockcache/target/findbugs.xml>
> with 23 unique warnings and 0 duplicates.
> [FINDBUGS] Successfully parsed file <
> https://builds.apache.org/job/HBase-TRUNK/6984/artifact/hbase-external-blockcache/target/findbugsXml.xml>
> with 23 unique warnings and 0 duplicates.
> [FINDBUGS] Successfully parsed file <
> https://builds.apache.org/job/HBase-TRUNK/6984/artifact/hbase-hadoop-compat/target/findbugs.xml>
> with 23 unique warnings and 0 duplicates.
> [FINDBUGS] Successfully parsed file <
> https://builds.apache.org/job/HBase-TRUNK/6984/artifact/hbase-hadoop-compat/target/findbugsXml.xml>
> with 23 unique warnings and 0 duplicates.
> [FINDBUGS] Successfully parsed file <
> https://builds.apache.org/job/HBase-TRUNK/6984/artifact/hbase-hadoop2-compat/target/findbugs.xml>
> with 23 unique warnings and 0 duplicates.
> [FINDBUGS] Successfully parsed file <
> https://builds.apache.org/job/HBase-TRUNK/6984/artifact/hbase-hadoop2-compat/target/findbugsXml.xml>
> with 23 unique warnings and 0 duplicates.
> [FINDBUGS] Successfully parsed file <
> https://builds.apache.org/job/HBase-TRUNK/6984/artifact/hbase-prefix-tree/target/findbugs.xml>
> with 23 unique warnings and 0 duplicates.
> [FINDBUGS] Successfully parsed file <
> https://builds.apache.org/job/HBase-TRUNK/6984/artifact/hbase-prefix-tree/target/findbugsXml.xml>
> with 24 unique warnings and 0 duplicates.
> [FINDBUGS] Successfully parsed file <
> https://builds.apache.org/job/HBase-TRUNK/6984/artifact/hbase-procedure/target/findbugs.xml>
> with 24 unique warnings and 0 duplicates.
> [FINDBUGS] Successfully parsed file <
> https://builds.apache.org/job/HBase-TRUNK/6984/artifact/hbase-procedure/target/findbugsXml.xml>
> with 25 unique warnings and 0 duplicates.
> [FINDBUGS] Successfully parsed file <
> https://builds.apache.org/job/HBase-TRUNK/6984/artifact/hbase-protocol/target/findbugs.xml>
> with 25 unique warnings and 0 duplicates.
> [FINDBUGS] Successfully parsed file <
> https://builds.apache.org/job/HBase-TRUNK/6984/artifact/hbase-protocol/target/findbugsXml.xml>
> with 25 unique warnings and 0 duplicates.
> [FINDBUGS] Successfully parsed file <
> https://builds.apache.org/job/HBase-TRUNK/6984/artifact/hbase-rest/target/findbugs.xml>
> with 25 unique warnings and 0 duplicates.
> [FINDBUGS] Successfully parsed file <
> https://builds.apache.org/job/HBase-TRUNK/6984/artifact/hbase-rest/target/findbugsXml.xml>
> with 27 unique warnings and 0 duplicates.
> [FINDBUGS] Successfully parsed file <
> https://builds.apache.org/job/HBase-TRUNK/6984/artifact/hbase-server/target/findbugs.xml>
> with 27 unique warnings and 0 duplicates.
> [FINDBUGS] Successfully parsed file <
> https://builds.apache.org/job/HBase-TRUNK/6984/artifact/hbase-server/target/findbugsXml.xml>
> with 104 unique warnings and 1 duplicate.
> [FINDBUGS] Successfully parsed file <
> https://builds.apache.org/job/HBase-TRUNK/6984/artifact/hbase-spark/target/findbugs.xml>
> with 104 unique warnings and 0 duplicates.
> [FINDBUGS] Successfully parsed file <
> https://builds.apache.org/job/HBase-TRUNK/6984/artifact/hbase-spark/target/findbugsXml.xml>
> with 141 unique warnings and 0 duplicates.
> [FINDBUGS] Successfully parsed file <
> https://builds.apache.org/job/HBase-TRUNK/6984/artifact/hbase-thrift/target/findbugs.xml>
> with 141 unique warnings and 0 duplicates.
> [FINDBUGS] Successfully parsed file <
> https://builds.apache.org/job/HBase-TRUNK/6984/artifact/hbase-thrift/target/findbugsXml.xml>
> with 141 unique warnings and 0 duplicates.
> [FINDBUGS] Computing warning deltas based on reference build #6982
> [CHECKSTYLE] Collecting checkstyle analysis files...
> [CHECKSTYLE] Finding all files that match the pattern
> **/checkstyle-result.xml
> [CHECKSTYLE] Parsing 24 files in <
> https://builds.apache.org/job/HBase-TRUNK/ws/>
> [CHECKSTYLE] Successfully parsed file <
> https://builds.apache.org/job/HBase-TRUNK/6984/artifact/hbase-annotations/target/checkstyle-result.xml>
> with 0 unique warnings and 0 duplicates.
> [CHECKSTYLE] Successfully parsed file <
> https://builds.apache.org/job/HBase-TRUNK/6984/artifact/hbase-assembly/target/checkstyle-result.xml>
> with 0 unique warnings and 0 duplicates.
> [CHECKSTYLE] Successfully parsed file <
> https://builds.apache.org/job/HBase-TRUNK/6984/artifact/hbase-checkstyle/target/checkstyle-result.xml>
> with 0 unique warnings and 0 duplicates.
> [CHECKSTYLE] Successfully parsed file <
> https://builds.apache.org/job/HBase-TRUNK/6984/artifact/hbase-client/target/checkstyle-result.xml>
> with 198 unique warnings and 0 duplicates.
> [CHECKSTYLE] Successfully parsed file <
> https://builds.apache.org/job/HBase-TRUNK/6984/artifact/hbase-common/target/checkstyle-result.xml>
> with 297 unique warnings and 0 duplicates.
> [CHECKSTYLE] Successfully parsed file <
> https://builds.apache.org/job/HBase-TRUNK/6984/artifact/hbase-examples/target/checkstyle-result.xml>
> with 324 unique warnings and 0 duplicates.
> [CHECKSTYLE] Successfully parsed file <
> https://builds.apache.org/job/HBase-TRUNK/6984/artifact/hbase-external-blockcache/target/checkstyle-result.xml>
> with 324 unique warnings and 0 duplicates.
> [CHECKSTYLE] Successfully parsed file <
> https://builds.apache.org/job/HBase-TRUNK/6984/artifact/hbase-hadoop-compat/target/checkstyle-result.xml>
> with 326 unique warnings and 0 duplicates.
> [CHECKSTYLE] Successfully parsed file <
> https://builds.apache.org/job/HBase-TRUNK/6984/artifact/hbase-hadoop2-compat/target/checkstyle-result.xml>
> with 357 unique warnings and 0 duplicates.
> [CHECKSTYLE] Successfully parsed file <
> https://builds.apache.org/job/HBase-TRUNK/6984/artifact/hbase-it/target/checkstyle-result.xml>
> with 357 unique warnings and 0 duplicates.
> [CHECKSTYLE] Successfully parsed file <
> https://builds.apache.org/job/HBase-TRUNK/6984/artifact/hbase-prefix-tree/target/checkstyle-result.xml>
> with 374 unique warnings and 0 duplicates.
> [CHECKSTYLE] Successfully parsed file <
> https://builds.apache.org/job/HBase-TRUNK/6984/artifact/hbase-procedure/target/checkstyle-result.xml>
> with 374 unique warnings and 0 duplicates.
> [CHECKSTYLE] Successfully parsed file <
> https://builds.apache.org/job/HBase-TRUNK/6984/artifact/hbase-protocol/target/checkstyle-result.xml>
> with 376 unique warnings and 0 duplicates.
> [CHECKSTYLE] Successfully parsed file <
> https://builds.apache.org/job/HBase-TRUNK/6984/artifact/hbase-resource-bundle/target/checkstyle-result.xml>
> with 376 unique warnings and 0 duplicates.
> [CHECKSTYLE] Successfully parsed file <
> https://builds.apache.org/job/HBase-TRUNK/6984/artifact/hbase-rest/target/checkstyle-result.xml>
> with 418 unique warnings and 0 duplicates.
> [CHECKSTYLE] Successfully parsed file <
> https://builds.apache.org/job/HBase-TRUNK/6984/artifact/hbase-server/target/checkstyle-result.xml>
> with 1707 unique warnings and 0 duplicates.
> [CHECKSTYLE] Successfully parsed file <
> https://builds.apache.org/job/HBase-TRUNK/6984/artifact/hbase-shaded/hbase-shaded-client/target/checkstyle-result.xml>
> with 1707 unique warnings and 0 duplicates.
> [CHECKSTYLE] Successfully parsed file <
> https://builds.apache.org/job/HBase-TRUNK/6984/artifact/hbase-shaded/hbase-shaded-server/target/checkstyle-result.xml>
> with 1707 unique warnings and 0 duplicates.
> [CHECKSTYLE] Successfully parsed file <
> https://builds.apache.org/job/HBase-TRUNK/6984/artifact/hbase-shaded/target/checkstyle-result.xml>
> with 1707 unique warnings and 0 duplicates.
> [CHECKSTYLE] Successfully parsed file <
> https://builds.apache.org/job/HBase-TRUNK/6984/artifact/hbase-shell/target/checkstyle-result.xml>
> with 1707 unique warnings and 0 duplicates.
> [CHECKSTYLE] Successfully parsed file <
> https://builds.apache.org/job/HBase-TRUNK/6984/artifact/hbase-spark/target/checkstyle-result.xml>
> with 1707 unique warnings and 0 duplicates.
> [CHECKSTYLE] Successfully parsed file <
> https://builds.apache.org/job/HBase-TRUNK/6984/artifact/hbase-testing-util/target/checkstyle-result.xml>
> with 1707 unique warnings and 0 duplicates.
> [CHECKSTYLE] Successfully parsed file <
> https://builds.apache.org/job/HBase-TRUNK/6984/artifact/hbase-thrift/target/checkstyle-result.xml>
> with 1728 unique warnings and 0 duplicates.
> [CHECKSTYLE] Successfully parsed file <
> https://builds.apache.org/job/HBase-TRUNK/6984/artifact/target/checkstyle-result.xml>
> with 1728 unique warnings and 0 duplicates.
> [CHECKSTYLE] Computing warning deltas based on reference build #6982
> Updating HBASE-14721
>
Build failed in Jenkins: HBase-TRUNK #6984
Posted by Apache Jenkins Server <je...@builds.apache.org>.
See <https://builds.apache.org/job/HBase-TRUNK/6984/changes>
Changes:
[anoopsamjohn] HBASE-14721 Memstore add cells - Avoid many garbage.
------------------------------------------
[...truncated 4821 lines...]
Tests run: 1, Failures: 0, Errors: 0, Skipped: 0, Time elapsed: 19.345 sec - in org.apache.hadoop.hbase.master.TestTableStateManager
Tests run: 3, Failures: 0, Errors: 0, Skipped: 0, Time elapsed: 40.269 sec - in org.apache.hadoop.hbase.master.TestMasterFailover
Tests run: 2, Failures: 0, Errors: 0, Skipped: 0, Time elapsed: 17.83 sec - in org.apache.hadoop.hbase.master.TestMasterShutdown
Running org.apache.hadoop.hbase.master.TestMasterNoCluster
Running org.apache.hadoop.hbase.master.balancer.TestDefaultLoadBalancer
Tests run: 1, Failures: 0, Errors: 0, Skipped: 0, Time elapsed: 4.219 sec - in org.apache.hadoop.hbase.master.balancer.TestDefaultLoadBalancer
Running org.apache.hadoop.hbase.master.TestMasterFileSystem
Tests run: 2, Failures: 0, Errors: 0, Skipped: 0, Time elapsed: 1.376 sec - in org.apache.hadoop.hbase.master.TestMasterFileSystem
Tests run: 1, Failures: 0, Errors: 0, Skipped: 0, Time elapsed: 32.181 sec - in org.apache.hadoop.hbase.master.TestMetaShutdownHandler
Running org.apache.hadoop.hbase.master.balancer.TestBaseLoadBalancer
Tests run: 7, Failures: 0, Errors: 0, Skipped: 0, Time elapsed: 0.686 sec - in org.apache.hadoop.hbase.master.balancer.TestBaseLoadBalancer
Running org.apache.hadoop.hbase.master.TestActiveMasterManager
Tests run: 2, Failures: 0, Errors: 0, Skipped: 0, Time elapsed: 1.421 sec - in org.apache.hadoop.hbase.master.TestActiveMasterManager
Tests run: 3, Failures: 0, Errors: 0, Skipped: 0, Time elapsed: 14.873 sec - in org.apache.hadoop.hbase.master.TestMasterNoCluster
Running org.apache.hadoop.hbase.master.TestMasterTransitions
Tests run: 3, Failures: 0, Errors: 0, Skipped: 3, Time elapsed: 0.004 sec - in org.apache.hadoop.hbase.master.TestMasterTransitions
Running org.apache.hadoop.hbase.master.TestRestartCluster
Running org.apache.hadoop.hbase.master.TestTableLockManager
Running org.apache.hadoop.hbase.master.TestRegionPlacement2
Tests run: 2, Failures: 0, Errors: 0, Skipped: 0, Time elapsed: 2.695 sec - in org.apache.hadoop.hbase.master.TestRegionPlacement2
Running org.apache.hadoop.hbase.master.handler.TestTableDescriptorModification
Running org.apache.hadoop.hbase.master.handler.TestTableDeleteFamilyHandler
Tests run: 2, Failures: 0, Errors: 0, Skipped: 0, Time elapsed: 18.057 sec - in org.apache.hadoop.hbase.master.handler.TestTableDeleteFamilyHandler
Tests run: 2, Failures: 0, Errors: 0, Skipped: 0, Time elapsed: 46.702 sec - in org.apache.hadoop.hbase.master.TestRestartCluster
Running org.apache.hadoop.hbase.master.handler.TestEnableTableHandler
Running org.apache.hadoop.hbase.master.handler.TestCreateTableHandler
Tests run: 7, Failures: 0, Errors: 0, Skipped: 0, Time elapsed: 35.288 sec - in org.apache.hadoop.hbase.master.handler.TestTableDescriptorModification
Running org.apache.hadoop.hbase.master.TestGetLastFlushedSequenceId
Tests run: 20, Failures: 0, Errors: 0, Skipped: 0, Time elapsed: 94.019 sec - in org.apache.hadoop.hbase.master.TestAssignmentManagerOnCluster
Running org.apache.hadoop.hbase.master.TestRollingRestart
Tests run: 1, Failures: 0, Errors: 0, Skipped: 0, Time elapsed: 20.69 sec - in org.apache.hadoop.hbase.master.TestGetLastFlushedSequenceId
Tests run: 3, Failures: 0, Errors: 0, Skipped: 0, Time elapsed: 30.255 sec - in org.apache.hadoop.hbase.master.handler.TestCreateTableHandler
Running org.apache.hadoop.hbase.master.TestSplitLogManager
Running org.apache.hadoop.hbase.master.TestHMasterRPCException
Tests run: 2, Failures: 0, Errors: 0, Skipped: 0, Time elapsed: 33.613 sec - in org.apache.hadoop.hbase.master.handler.TestEnableTableHandler
Tests run: 1, Failures: 0, Errors: 0, Skipped: 0, Time elapsed: 3.779 sec - in org.apache.hadoop.hbase.master.TestHMasterRPCException
Running org.apache.hadoop.hbase.master.TestClusterStatusPublisher
Tests run: 3, Failures: 0, Errors: 0, Skipped: 0, Time elapsed: 0.284 sec - in org.apache.hadoop.hbase.master.TestClusterStatusPublisher
Running org.apache.hadoop.hbase.master.TestGetInfoPort
Tests run: 1, Failures: 0, Errors: 0, Skipped: 0, Time elapsed: 33.141 sec - in org.apache.hadoop.hbase.master.TestRollingRestart
Running org.apache.hadoop.hbase.master.TestMaster
Running org.apache.hadoop.hbase.master.TestDeadServer
Tests run: 3, Failures: 0, Errors: 0, Skipped: 0, Time elapsed: 0.132 sec - in org.apache.hadoop.hbase.master.TestDeadServer
Tests run: 1, Failures: 0, Errors: 0, Skipped: 0, Time elapsed: 13.307 sec - in org.apache.hadoop.hbase.master.TestGetInfoPort
Tests run: 4, Failures: 0, Errors: 0, Skipped: 0, Time elapsed: 102.223 sec - in org.apache.hadoop.hbase.master.TestTableLockManager
Running org.apache.hadoop.hbase.master.TestMasterStatusServlet
Tests run: 4, Failures: 0, Errors: 0, Skipped: 0, Time elapsed: 1.889 sec - in org.apache.hadoop.hbase.master.TestMasterStatusServlet
Running org.apache.hadoop.hbase.master.normalizer.TestSimpleRegionNormalizerOnCluster
Tests run: 4, Failures: 0, Errors: 0, Skipped: 0, Time elapsed: 15.323 sec - in org.apache.hadoop.hbase.master.TestMaster
Running org.apache.hadoop.hbase.master.cleaner.TestHFileCleaner
Running org.apache.hadoop.hbase.master.cleaner.TestLogsCleaner
Tests run: 3, Failures: 0, Errors: 0, Skipped: 0, Time elapsed: 1.467 sec - in org.apache.hadoop.hbase.master.cleaner.TestHFileCleaner
Running org.apache.hadoop.hbase.master.cleaner.TestSnapshotFromMaster
Tests run: 2, Failures: 0, Errors: 0, Skipped: 0, Time elapsed: 11.975 sec - in org.apache.hadoop.hbase.master.cleaner.TestLogsCleaner
Running org.apache.hadoop.hbase.master.TestMasterMetrics
Tests run: 2, Failures: 0, Errors: 0, Skipped: 0, Time elapsed: 1.369 sec - in org.apache.hadoop.hbase.master.TestMasterMetrics
Running org.apache.hadoop.hbase.master.TestMasterRestartAfterDisablingTable
Tests run: 2, Failures: 0, Errors: 0, Skipped: 0, Time elapsed: 26.215 sec - in org.apache.hadoop.hbase.master.normalizer.TestSimpleRegionNormalizerOnCluster
Running org.apache.hadoop.hbase.master.TestRegionPlacement
Tests run: 2, Failures: 0, Errors: 0, Skipped: 2, Time elapsed: 0.002 sec - in org.apache.hadoop.hbase.master.TestRegionPlacement
Running org.apache.hadoop.hbase.master.TestMasterOperationsForRegionReplicas
Tests run: 1, Failures: 0, Errors: 0, Skipped: 0, Time elapsed: 20.255 sec - in org.apache.hadoop.hbase.master.TestMasterRestartAfterDisablingTable
Running org.apache.hadoop.hbase.master.TestAssignmentListener
Tests run: 4, Failures: 0, Errors: 0, Skipped: 0, Time elapsed: 33.402 sec - in org.apache.hadoop.hbase.master.cleaner.TestSnapshotFromMaster
Running org.apache.hadoop.hbase.master.snapshot.TestSnapshotFileCache
Tests run: 2, Failures: 0, Errors: 0, Skipped: 0, Time elapsed: 10.197 sec - in org.apache.hadoop.hbase.master.TestAssignmentListener
Running org.apache.hadoop.hbase.master.TestMasterMetricsWrapper
Tests run: 1, Failures: 0, Errors: 0, Skipped: 0, Time elapsed: 2.216 sec - in org.apache.hadoop.hbase.master.TestMasterMetricsWrapper
Running org.apache.hadoop.hbase.snapshot.TestSnapshotClientRetries
Tests run: 2, Failures: 0, Errors: 0, Skipped: 0, Time elapsed: 28.308 sec - in org.apache.hadoop.hbase.master.TestMasterOperationsForRegionReplicas
Running org.apache.hadoop.hbase.snapshot.TestFlushSnapshotFromClient
Tests run: 2, Failures: 0, Errors: 0, Skipped: 0, Time elapsed: 21.399 sec - in org.apache.hadoop.hbase.snapshot.TestSnapshotClientRetries
Running org.apache.hadoop.hbase.snapshot.TestSnapshotDescriptionUtils
Tests run: 2, Failures: 0, Errors: 0, Skipped: 0, Time elapsed: 0.104 sec - in org.apache.hadoop.hbase.snapshot.TestSnapshotDescriptionUtils
Running org.apache.hadoop.hbase.snapshot.TestExportSnapshot
Tests run: 15, Failures: 0, Errors: 0, Skipped: 1, Time elapsed: 140.479 sec - in org.apache.hadoop.hbase.master.TestSplitLogManager
Tests run: 4, Failures: 0, Errors: 0, Skipped: 0, Time elapsed: 60.333 sec - in org.apache.hadoop.hbase.master.snapshot.TestSnapshotFileCache
Running org.apache.hadoop.hbase.snapshot.TestMobSecureExportSnapshot
Running org.apache.hadoop.hbase.snapshot.TestMobRestoreFlushSnapshotFromClient
Tests run: 9, Failures: 0, Errors: 0, Skipped: 1, Time elapsed: 70.208 sec - in org.apache.hadoop.hbase.snapshot.TestFlushSnapshotFromClient
Running org.apache.hadoop.hbase.snapshot.TestMobExportSnapshot
Running org.apache.hadoop.hbase.snapshot.TestRestoreFlushSnapshotFromClient
Tests run: 5, Failures: 0, Errors: 0, Skipped: 0, Time elapsed: 69.22 sec - in org.apache.hadoop.hbase.snapshot.TestRestoreFlushSnapshotFromClient
Tests run: 5, Failures: 0, Errors: 0, Skipped: 0, Time elapsed: 109.425 sec - in org.apache.hadoop.hbase.snapshot.TestMobRestoreFlushSnapshotFromClient
Running org.apache.hadoop.hbase.snapshot.TestSecureExportSnapshot
Tests run: 9, Failures: 0, Errors: 0, Skipped: 0, Time elapsed: 398.11 sec - in org.apache.hadoop.hbase.snapshot.TestExportSnapshot
Tests run: 9, Failures: 0, Errors: 0, Skipped: 0, Time elapsed: 393.434 sec - in org.apache.hadoop.hbase.snapshot.TestMobSecureExportSnapshot
Tests run: 9, Failures: 0, Errors: 0, Skipped: 0, Time elapsed: 395.756 sec - in org.apache.hadoop.hbase.snapshot.TestMobExportSnapshot
Tests run: 9, Failures: 0, Errors: 0, Skipped: 0, Time elapsed: 359.922 sec - in org.apache.hadoop.hbase.snapshot.TestSecureExportSnapshot
Results :
Failed tests:
TestSplitTransactionOnCluster.testSSHCleanupDaugtherRegionsOfAbortedSplit:996 {b7da38d105b70d06a3b002f6bfe6694b={b7da38d105b70d06a3b002f6bfe6694b state=SPLITTING, ts=1446218150399, server=pomona.apache.org,56119,1446218140859}, 833b078759f7d52f456f1aca0ca120cb={833b078759f7d52f456f1aca0ca120cb state=SPLITTING_NEW, ts=1446218150404, server=pomona.apache.org,56119,1446218140859}, fa6feb686dcab5ea4a637f174f8a0b09={fa6feb686dcab5ea4a637f174f8a0b09 state=SPLITTING_NEW, ts=1446218150404, server=pomona.apache.org,56119,1446218140859}} expected:<0> but was:<3>
Tests run: 2443, Failures: 1, Errors: 0, Skipped: 41
[INFO] ------------------------------------------------------------------------
[INFO] Reactor Summary:
[INFO]
[INFO] Apache HBase ...................................... SUCCESS [ 2.615 s]
[INFO] Apache HBase - Checkstyle ......................... SUCCESS [ 0.639 s]
[INFO] Apache HBase - Resource Bundle .................... SUCCESS [ 0.254 s]
[INFO] Apache HBase - Annotations ........................ SUCCESS [ 0.205 s]
[INFO] Apache HBase - Protocol ........................... SUCCESS [ 2.864 s]
[INFO] Apache HBase - Common ............................. SUCCESS [01:41 min]
[INFO] Apache HBase - Procedure .......................... SUCCESS [01:55 min]
[INFO] Apache HBase - Client ............................. SUCCESS [01:44 min]
[INFO] Apache HBase - Hadoop Compatibility ............... SUCCESS [ 9.627 s]
[INFO] Apache HBase - Hadoop Two Compatibility ........... SUCCESS [ 9.832 s]
[INFO] Apache HBase - Prefix Tree ........................ SUCCESS [ 13.401 s]
[INFO] Apache HBase - Server ............................. FAILURE [ 01:27 h]
[INFO] Apache HBase - Testing Util ....................... SKIPPED
[INFO] Apache HBase - Thrift ............................. SKIPPED
[INFO] Apache HBase - Shell .............................. SKIPPED
[INFO] Apache HBase - Integration Tests .................. SKIPPED
[INFO] Apache HBase - Examples ........................... SKIPPED
[INFO] Apache HBase - Rest ............................... SKIPPED
[INFO] Apache HBase - External Block Cache ............... SKIPPED
[INFO] Apache HBase - Assembly ........................... SKIPPED
[INFO] Apache HBase - Shaded ............................. SKIPPED
[INFO] Apache HBase - Shaded - Client .................... SKIPPED
[INFO] Apache HBase - Shaded - Server .................... SKIPPED
[INFO] Apache HBase - Spark .............................. SKIPPED
[INFO] ------------------------------------------------------------------------
[INFO] BUILD FAILURE
[INFO] ------------------------------------------------------------------------
[INFO] Total time: 01:33 h
[INFO] Finished at: 2015-10-30T15:50:39+00:00
[INFO] Final Memory: 62M/600M
[INFO] ------------------------------------------------------------------------
[ERROR] Failed to execute goal org.apache.maven.plugins:maven-surefire-plugin:2.19:test (secondPartTestsExecution) on project hbase-server: There are test failures.
[ERROR]
[ERROR] Please refer to <https://builds.apache.org/job/HBase-TRUNK/ws/hbase-server/target/surefire-reports> for the individual test results.
[ERROR] -> [Help 1]
[ERROR]
[ERROR] To see the full stack trace of the errors, re-run Maven with the -e switch.
[ERROR] Re-run Maven using the -X switch to enable full debug logging.
[ERROR]
[ERROR] For more information about the errors and possible solutions, please read the following articles:
[ERROR] [Help 1] http://cwiki.apache.org/confluence/display/MAVEN/MojoFailureException
[ERROR]
[ERROR] After correcting the problems, you can resume the build with the command
[ERROR] mvn <goals> -rf :hbase-server
Build step 'Invoke top-level Maven targets' marked build as failure
Performing Post build task...
Match found for :.* : True
Logical operation result is TRUE
Running script : ZOMBIE_TESTS_COUNT=`jps -v | grep surefirebooter | grep '-Dhbase.test' | wc -l`
if [[ $ZOMBIE_TESTS_COUNT != 0 ]] ; then
#It seems sometimes the tests are not dying immediately. Let's give them 30s
echo "Suspicious java process found - waiting 30s to see if there are just slow to stop"
sleep 30
ZOMBIE_TESTS_COUNT=`jps -v | grep surefirebooter | grep '-Dhbase.test' | wc -l`
if [[ $ZOMBIE_TESTS_COUNT != 0 ]] ; then
echo "There are $ZOMBIE_TESTS_COUNT zombie tests, they should have been killed by surefire but survived"
echo "************ zombies jps listing"
jps -v
jps -v | grep surefirebooter | grep '-Dhbase.test'
echo "************ BEGIN zombies jstack extract"
# HBase tests have been flagged with an innocuous '-Dhbase.test' just so they can
# be identified as hbase in a process listing.
ZB_STACK=`jps -v | grep surefirebooter | grep '-Dhbase.test' | cut -d ' ' -f 1 | xargs -n 1 jstack | grep ".test" | grep "\.java"`
jps -v | grep surefirebooter | grep '-Dhbase.test' | cut -d ' ' -f 1 | xargs -n 1 jstack
echo "************ END zombies jstack extract"
JIRA_COMMENT="$JIRA_COMMENT
{color:red}-1 core zombie tests{color}. There are ${ZOMBIE_TESTS_COUNT} zombie test(s): ${ZB_STACK}"
BAD=1
# Killing these zombies
echo 'Killing ZOMBIES!!!'
jps -v
jps -v | grep surefirebooter | grep '-Dhbase.test' | cut -d ' ' -f 1 | xargs kill -9
else
echo "We're ok: there is no zombie test, but some tests took some time to stop"
fi
[HBase-TRUNK] $ /bin/bash -xe /tmp/hudson7427541824955308186.sh
++ jps -v
++ grep surefirebooter
++ grep -Dhbase.test
grep: unknown devices method
++ wc -l
+ ZOMBIE_TESTS_COUNT=0
/tmp/hudson7427541824955308186.sh: line 30: syntax error: unexpected end of file
POST BUILD TASK : FAILURE
END OF POST BUILD TASK : 0
Archiving artifacts
Recording test results
[FINDBUGS] Collecting findbugs analysis files...
[FINDBUGS] Finding all files that match the pattern **/findbugs.xml,**/findbugsXml.xml
[FINDBUGS] Parsing 28 files in <https://builds.apache.org/job/HBase-TRUNK/ws/>
[FINDBUGS] Successfully parsed file <https://builds.apache.org/job/HBase-TRUNK/6984/artifact/hbase-annotations/target/findbugs.xml> with 0 unique warnings and 0 duplicates.
[FINDBUGS] Successfully parsed file <https://builds.apache.org/job/HBase-TRUNK/6984/artifact/hbase-annotations/target/findbugsXml.xml> with 0 unique warnings and 0 duplicates.
[FINDBUGS] Successfully parsed file <https://builds.apache.org/job/HBase-TRUNK/6984/artifact/hbase-client/target/findbugs.xml> with 0 unique warnings and 0 duplicates.
[FINDBUGS] Successfully parsed file <https://builds.apache.org/job/HBase-TRUNK/6984/artifact/hbase-client/target/findbugsXml.xml> with 14 unique warnings and 0 duplicates.
[FINDBUGS] Successfully parsed file <https://builds.apache.org/job/HBase-TRUNK/6984/artifact/hbase-common/target/findbugs.xml> with 14 unique warnings and 0 duplicates.
[FINDBUGS] Successfully parsed file <https://builds.apache.org/job/HBase-TRUNK/6984/artifact/hbase-common/target/findbugsXml.xml> with 23 unique warnings and 0 duplicates.
[FINDBUGS] Successfully parsed file <https://builds.apache.org/job/HBase-TRUNK/6984/artifact/hbase-examples/target/findbugs.xml> with 23 unique warnings and 0 duplicates.
[FINDBUGS] Successfully parsed file <https://builds.apache.org/job/HBase-TRUNK/6984/artifact/hbase-examples/target/findbugsXml.xml> with 23 unique warnings and 0 duplicates.
[FINDBUGS] Successfully parsed file <https://builds.apache.org/job/HBase-TRUNK/6984/artifact/hbase-external-blockcache/target/findbugs.xml> with 23 unique warnings and 0 duplicates.
[FINDBUGS] Successfully parsed file <https://builds.apache.org/job/HBase-TRUNK/6984/artifact/hbase-external-blockcache/target/findbugsXml.xml> with 23 unique warnings and 0 duplicates.
[FINDBUGS] Successfully parsed file <https://builds.apache.org/job/HBase-TRUNK/6984/artifact/hbase-hadoop-compat/target/findbugs.xml> with 23 unique warnings and 0 duplicates.
[FINDBUGS] Successfully parsed file <https://builds.apache.org/job/HBase-TRUNK/6984/artifact/hbase-hadoop-compat/target/findbugsXml.xml> with 23 unique warnings and 0 duplicates.
[FINDBUGS] Successfully parsed file <https://builds.apache.org/job/HBase-TRUNK/6984/artifact/hbase-hadoop2-compat/target/findbugs.xml> with 23 unique warnings and 0 duplicates.
[FINDBUGS] Successfully parsed file <https://builds.apache.org/job/HBase-TRUNK/6984/artifact/hbase-hadoop2-compat/target/findbugsXml.xml> with 23 unique warnings and 0 duplicates.
[FINDBUGS] Successfully parsed file <https://builds.apache.org/job/HBase-TRUNK/6984/artifact/hbase-prefix-tree/target/findbugs.xml> with 23 unique warnings and 0 duplicates.
[FINDBUGS] Successfully parsed file <https://builds.apache.org/job/HBase-TRUNK/6984/artifact/hbase-prefix-tree/target/findbugsXml.xml> with 24 unique warnings and 0 duplicates.
[FINDBUGS] Successfully parsed file <https://builds.apache.org/job/HBase-TRUNK/6984/artifact/hbase-procedure/target/findbugs.xml> with 24 unique warnings and 0 duplicates.
[FINDBUGS] Successfully parsed file <https://builds.apache.org/job/HBase-TRUNK/6984/artifact/hbase-procedure/target/findbugsXml.xml> with 25 unique warnings and 0 duplicates.
[FINDBUGS] Successfully parsed file <https://builds.apache.org/job/HBase-TRUNK/6984/artifact/hbase-protocol/target/findbugs.xml> with 25 unique warnings and 0 duplicates.
[FINDBUGS] Successfully parsed file <https://builds.apache.org/job/HBase-TRUNK/6984/artifact/hbase-protocol/target/findbugsXml.xml> with 25 unique warnings and 0 duplicates.
[FINDBUGS] Successfully parsed file <https://builds.apache.org/job/HBase-TRUNK/6984/artifact/hbase-rest/target/findbugs.xml> with 25 unique warnings and 0 duplicates.
[FINDBUGS] Successfully parsed file <https://builds.apache.org/job/HBase-TRUNK/6984/artifact/hbase-rest/target/findbugsXml.xml> with 27 unique warnings and 0 duplicates.
[FINDBUGS] Successfully parsed file <https://builds.apache.org/job/HBase-TRUNK/6984/artifact/hbase-server/target/findbugs.xml> with 27 unique warnings and 0 duplicates.
[FINDBUGS] Successfully parsed file <https://builds.apache.org/job/HBase-TRUNK/6984/artifact/hbase-server/target/findbugsXml.xml> with 104 unique warnings and 1 duplicate.
[FINDBUGS] Successfully parsed file <https://builds.apache.org/job/HBase-TRUNK/6984/artifact/hbase-spark/target/findbugs.xml> with 104 unique warnings and 0 duplicates.
[FINDBUGS] Successfully parsed file <https://builds.apache.org/job/HBase-TRUNK/6984/artifact/hbase-spark/target/findbugsXml.xml> with 141 unique warnings and 0 duplicates.
[FINDBUGS] Successfully parsed file <https://builds.apache.org/job/HBase-TRUNK/6984/artifact/hbase-thrift/target/findbugs.xml> with 141 unique warnings and 0 duplicates.
[FINDBUGS] Successfully parsed file <https://builds.apache.org/job/HBase-TRUNK/6984/artifact/hbase-thrift/target/findbugsXml.xml> with 141 unique warnings and 0 duplicates.
[FINDBUGS] Computing warning deltas based on reference build #6982
[CHECKSTYLE] Collecting checkstyle analysis files...
[CHECKSTYLE] Finding all files that match the pattern **/checkstyle-result.xml
[CHECKSTYLE] Parsing 24 files in <https://builds.apache.org/job/HBase-TRUNK/ws/>
[CHECKSTYLE] Successfully parsed file <https://builds.apache.org/job/HBase-TRUNK/6984/artifact/hbase-annotations/target/checkstyle-result.xml> with 0 unique warnings and 0 duplicates.
[CHECKSTYLE] Successfully parsed file <https://builds.apache.org/job/HBase-TRUNK/6984/artifact/hbase-assembly/target/checkstyle-result.xml> with 0 unique warnings and 0 duplicates.
[CHECKSTYLE] Successfully parsed file <https://builds.apache.org/job/HBase-TRUNK/6984/artifact/hbase-checkstyle/target/checkstyle-result.xml> with 0 unique warnings and 0 duplicates.
[CHECKSTYLE] Successfully parsed file <https://builds.apache.org/job/HBase-TRUNK/6984/artifact/hbase-client/target/checkstyle-result.xml> with 198 unique warnings and 0 duplicates.
[CHECKSTYLE] Successfully parsed file <https://builds.apache.org/job/HBase-TRUNK/6984/artifact/hbase-common/target/checkstyle-result.xml> with 297 unique warnings and 0 duplicates.
[CHECKSTYLE] Successfully parsed file <https://builds.apache.org/job/HBase-TRUNK/6984/artifact/hbase-examples/target/checkstyle-result.xml> with 324 unique warnings and 0 duplicates.
[CHECKSTYLE] Successfully parsed file <https://builds.apache.org/job/HBase-TRUNK/6984/artifact/hbase-external-blockcache/target/checkstyle-result.xml> with 324 unique warnings and 0 duplicates.
[CHECKSTYLE] Successfully parsed file <https://builds.apache.org/job/HBase-TRUNK/6984/artifact/hbase-hadoop-compat/target/checkstyle-result.xml> with 326 unique warnings and 0 duplicates.
[CHECKSTYLE] Successfully parsed file <https://builds.apache.org/job/HBase-TRUNK/6984/artifact/hbase-hadoop2-compat/target/checkstyle-result.xml> with 357 unique warnings and 0 duplicates.
[CHECKSTYLE] Successfully parsed file <https://builds.apache.org/job/HBase-TRUNK/6984/artifact/hbase-it/target/checkstyle-result.xml> with 357 unique warnings and 0 duplicates.
[CHECKSTYLE] Successfully parsed file <https://builds.apache.org/job/HBase-TRUNK/6984/artifact/hbase-prefix-tree/target/checkstyle-result.xml> with 374 unique warnings and 0 duplicates.
[CHECKSTYLE] Successfully parsed file <https://builds.apache.org/job/HBase-TRUNK/6984/artifact/hbase-procedure/target/checkstyle-result.xml> with 374 unique warnings and 0 duplicates.
[CHECKSTYLE] Successfully parsed file <https://builds.apache.org/job/HBase-TRUNK/6984/artifact/hbase-protocol/target/checkstyle-result.xml> with 376 unique warnings and 0 duplicates.
[CHECKSTYLE] Successfully parsed file <https://builds.apache.org/job/HBase-TRUNK/6984/artifact/hbase-resource-bundle/target/checkstyle-result.xml> with 376 unique warnings and 0 duplicates.
[CHECKSTYLE] Successfully parsed file <https://builds.apache.org/job/HBase-TRUNK/6984/artifact/hbase-rest/target/checkstyle-result.xml> with 418 unique warnings and 0 duplicates.
[CHECKSTYLE] Successfully parsed file <https://builds.apache.org/job/HBase-TRUNK/6984/artifact/hbase-server/target/checkstyle-result.xml> with 1707 unique warnings and 0 duplicates.
[CHECKSTYLE] Successfully parsed file <https://builds.apache.org/job/HBase-TRUNK/6984/artifact/hbase-shaded/hbase-shaded-client/target/checkstyle-result.xml> with 1707 unique warnings and 0 duplicates.
[CHECKSTYLE] Successfully parsed file <https://builds.apache.org/job/HBase-TRUNK/6984/artifact/hbase-shaded/hbase-shaded-server/target/checkstyle-result.xml> with 1707 unique warnings and 0 duplicates.
[CHECKSTYLE] Successfully parsed file <https://builds.apache.org/job/HBase-TRUNK/6984/artifact/hbase-shaded/target/checkstyle-result.xml> with 1707 unique warnings and 0 duplicates.
[CHECKSTYLE] Successfully parsed file <https://builds.apache.org/job/HBase-TRUNK/6984/artifact/hbase-shell/target/checkstyle-result.xml> with 1707 unique warnings and 0 duplicates.
[CHECKSTYLE] Successfully parsed file <https://builds.apache.org/job/HBase-TRUNK/6984/artifact/hbase-spark/target/checkstyle-result.xml> with 1707 unique warnings and 0 duplicates.
[CHECKSTYLE] Successfully parsed file <https://builds.apache.org/job/HBase-TRUNK/6984/artifact/hbase-testing-util/target/checkstyle-result.xml> with 1707 unique warnings and 0 duplicates.
[CHECKSTYLE] Successfully parsed file <https://builds.apache.org/job/HBase-TRUNK/6984/artifact/hbase-thrift/target/checkstyle-result.xml> with 1728 unique warnings and 0 duplicates.
[CHECKSTYLE] Successfully parsed file <https://builds.apache.org/job/HBase-TRUNK/6984/artifact/target/checkstyle-result.xml> with 1728 unique warnings and 0 duplicates.
[CHECKSTYLE] Computing warning deltas based on reference build #6982
Updating HBASE-14721