You are viewing a plain text version of this content. The canonical link for it is here.
Posted to torque-dev@db.apache.org by Apache Jenkins Server <je...@builds.apache.org> on 2012/07/16 19:39:07 UTC
Build failed in Jenkins: torque4-test-project-hsqldb #114
See <https://builds.apache.org/job/torque4-test-project-hsqldb/114/>
------------------------------------------
[...truncated 1786 lines...]
INFO org.apache.torque.generator.control.Controller - Start generation of File <https://builds.apache.org/job/torque4-test-project-hsqldb/ws/target/generated-sources/org/apache/torque/test/manager/base/BaseAutoincrementNoneManager.java>
INFO org.apache.torque.generator.control.Controller - Start generation of File <https://builds.apache.org/job/torque4-test-project-hsqldb/ws/target/generated-sources/org/apache/torque/test/manager/base/BaseAutoincrementIdbrokerManager.java>
INFO org.apache.torque.generator.control.Controller - Start generation of File <https://builds.apache.org/job/torque4-test-project-hsqldb/ws/target/generated-sources/org/apache/torque/test/manager/base/BaseLeaguesObjectManager.java>
INFO org.apache.torque.generator.control.Controller - Start generation of File <https://builds.apache.org/job/torque4-test-project-hsqldb/ws/target/generated-sources/org/apache/torque/test/manager/base/BaseLeaguesPrimitiveManager.java>
INFO org.apache.torque.generator.control.Controller - Start generation of File <https://builds.apache.org/job/torque4-test-project-hsqldb/ws/target/generated-sources/org/apache/torque/test/manager/base/BaseMultiPkForeignKeyManager.java>
INFO org.apache.torque.generator.control.Controller - Start generation of File <https://builds.apache.org/job/torque4-test-project-hsqldb/ws/target/generated-sources/org/apache/torque/test/manager/base/BaseIntegerPkManager.java>
INFO org.apache.torque.generator.control.Controller - Start generation of File <https://builds.apache.org/job/torque4-test-project-hsqldb/ws/target/generated-sources/org/apache/torque/test/manager/base/BaseIntegerObjectPkManager.java>
INFO org.apache.torque.generator.control.Controller - Start generation of File <https://builds.apache.org/job/torque4-test-project-hsqldb/ws/target/generated-sources/org/apache/torque/test/manager/base/BaseInheritanceTestManager.java>
INFO org.apache.torque.generator.control.Controller - Start generation of File <https://builds.apache.org/job/torque4-test-project-hsqldb/ws/target/generated-sources/org/apache/torque/test/manager/base/BaseInheritanceClassnameTestManager.java>
INFO org.apache.torque.generator.control.Controller - Start generation of File <https://builds.apache.org/job/torque4-test-project-hsqldb/ws/target/generated-sources/org/apache/torque/test/manager/base/BaseScaleTestManager.java>
INFO org.apache.torque.generator.control.Controller - Start generation of File <https://builds.apache.org/job/torque4-test-project-hsqldb/ws/target/generated-sources/org/apache/torque/test/manager/base/BaseCircularReferenceAManager.java>
INFO org.apache.torque.generator.control.Controller - Start generation of File <https://builds.apache.org/job/torque4-test-project-hsqldb/ws/target/generated-sources/org/apache/torque/test/manager/base/BaseCircularReferenceBManager.java>
INFO org.apache.torque.generator.control.Controller - Start generation of File <https://builds.apache.org/job/torque4-test-project-hsqldb/ws/target/generated-sources/org/apache/torque/test/manager/base/BaseReferencedManager.java>
INFO org.apache.torque.generator.control.Controller - Start generation of File <https://builds.apache.org/job/torque4-test-project-hsqldb/ws/target/generated-sources/org/apache/torque/test/manager/base/BaseMultiRefSameTableManager.java>
INFO org.apache.torque.generator.control.Controller - Start generation of File <https://builds.apache.org/job/torque4-test-project-hsqldb/ws/target/generated-sources/org/apache/torque/test/manager/base/BaseTypesObjectManager.java>
INFO org.apache.torque.generator.control.Controller - Start generation of File <https://builds.apache.org/job/torque4-test-project-hsqldb/ws/target/generated-sources/org/apache/torque/test/manager/base/BaseTypesPrimitiveManager.java>
INFO org.apache.torque.generator.control.Controller - Start generation of File <https://builds.apache.org/job/torque4-test-project-hsqldb/ws/target/generated-sources/org/apache/torque/test/manager/base/BaseSummarize1Manager.java>
INFO org.apache.torque.generator.control.Controller - Start generation of File <https://builds.apache.org/job/torque4-test-project-hsqldb/ws/target/generated-sources/org/apache/torque/test/manager/base/BaseSkipSqlManager.java>
INFO org.apache.torque.generator.control.Controller - Start generation of File <https://builds.apache.org/job/torque4-test-project-hsqldb/ws/target/generated-sources/org/apache/torque/test/manager/base/BaseAbstractManager.java>
INFO org.apache.torque.generator.control.Controller - Start generation of File <https://builds.apache.org/job/torque4-test-project-hsqldb/ws/target/generated-sources/org/apache/torque/test/manager/base/BaseIncludedManager.java>
INFO org.apache.torque.generator.control.Controller - Start generation of File <https://builds.apache.org/job/torque4-test-project-hsqldb/ws/target/generated-sources/org/apache/torque/test/manager/base/BaseIncludedFromIncludedManager.java>
INFO org.apache.torque.generator.control.Controller - Processing source <https://builds.apache.org/job/torque4-test-project-hsqldb/ws/target/torque/test/schema/types-schema.xml>
INFO org.apache.torque.generator.control.Controller - Start generation of File <https://builds.apache.org/job/torque4-test-project-hsqldb/ws/target/generated-sources/org/apache/torque/test/manager/base/BaseBitValueManager.java>
INFO org.apache.torque.generator.control.Controller - Start generation of File <https://builds.apache.org/job/torque4-test-project-hsqldb/ws/target/generated-sources/org/apache/torque/test/manager/base/BaseBlobTestManager.java>
INFO org.apache.torque.generator.control.Controller - Start generation of File <https://builds.apache.org/job/torque4-test-project-hsqldb/ws/target/generated-sources/org/apache/torque/test/manager/base/BaseClobTestManager.java>
INFO org.apache.torque.generator.control.Controller - Start generation of File <https://builds.apache.org/job/torque4-test-project-hsqldb/ws/target/generated-sources/org/apache/torque/test/manager/base/BaseBintBcharValueManager.java>
INFO org.apache.torque.generator.control.Controller - Start generation of File <https://builds.apache.org/job/torque4-test-project-hsqldb/ws/target/generated-sources/org/apache/torque/test/manager/base/BaseDateTimeTimestampManager.java>
INFO org.apache.torque.generator.control.Controller - Processing output torque.om.baseManagerForView
INFO org.apache.torque.generator.control.Controller - Processing source <https://builds.apache.org/job/torque4-test-project-hsqldb/ws/target/torque/test/schema/bookstore-schema.xml>
INFO org.apache.torque.generator.control.Controller - Start generation of File <https://builds.apache.org/job/torque4-test-project-hsqldb/ws/target/generated-sources/org/apache/torque/test/manager/base/BaseBookAuthorsManager.java>
INFO org.apache.torque.generator.control.Controller - Processing source <https://builds.apache.org/job/torque4-test-project-hsqldb/ws/target/torque/test/schema/databaseMapInit-schema.xml>
INFO org.apache.torque.generator.control.Controller - No start Elements found for path database/all-views/view
INFO org.apache.torque.generator.control.Controller - Processing source <https://builds.apache.org/job/torque4-test-project-hsqldb/ws/target/torque/test/schema/default-value-schema.xml>
INFO org.apache.torque.generator.control.Controller - No start Elements found for path database/all-views/view
INFO org.apache.torque.generator.control.Controller - Processing source <https://builds.apache.org/job/torque4-test-project-hsqldb/ws/target/torque/test/schema/foreign-key-schema.xml>
INFO org.apache.torque.generator.control.Controller - No start Elements found for path database/all-views/view
INFO org.apache.torque.generator.control.Controller - Processing source <https://builds.apache.org/job/torque4-test-project-hsqldb/ws/target/torque/test/schema/index.xml>
INFO org.apache.torque.generator.control.Controller - No start Elements found for path database/all-views/view
INFO org.apache.torque.generator.control.Controller - Processing source <https://builds.apache.org/job/torque4-test-project-hsqldb/ws/target/torque/test/schema/pk-schema.xml>
INFO org.apache.torque.generator.control.Controller - No start Elements found for path database/all-views/view
INFO org.apache.torque.generator.control.Controller - Processing source <https://builds.apache.org/job/torque4-test-project-hsqldb/ws/target/torque/test/schema/save-method-in-peer-schema.xml>
INFO org.apache.torque.generator.control.Controller - No start Elements found for path database/all-views/view
INFO org.apache.torque.generator.control.Controller - Processing source <https://builds.apache.org/job/torque4-test-project-hsqldb/ws/target/torque/test/schema/test-schema.xml>
INFO org.apache.torque.generator.control.Controller - No start Elements found for path database/all-views/view
INFO org.apache.torque.generator.control.Controller - Processing source <https://builds.apache.org/job/torque4-test-project-hsqldb/ws/target/torque/test/schema/types-schema.xml>
INFO org.apache.torque.generator.control.Controller - No start Elements found for path database/all-views/view
[INFO] Generation successful
[INFO] [torque:generate {execution: generate-sql}]
INFO org.apache.torque.generator.control.Controller - readConfiguration() : Starting to read configuration files
INFO org.apache.torque.generator.control.Controller - readConfiguration() : Configuration read.
INFO org.apache.torque.generator.control.Controller - Processing output torque.sql.ddl
INFO org.apache.torque.generator.control.Controller - Processing source <https://builds.apache.org/job/torque4-test-project-hsqldb/ws/target/torque/test/schema/bookstore-schema.xml>
INFO org.apache.torque.generator.control.Controller - Start generation of File <https://builds.apache.org/job/torque4-test-project-hsqldb/ws/target/generated-sql/bookstore-schema.sql>
INFO org.apache.torque.generator.control.Controller - Processing source <https://builds.apache.org/job/torque4-test-project-hsqldb/ws/target/torque/test/schema/databaseMapInit-schema.xml>
INFO org.apache.torque.generator.control.Controller - Start generation of File <https://builds.apache.org/job/torque4-test-project-hsqldb/ws/target/generated-sql/databaseMapInit-schema.sql>
INFO org.apache.torque.generator.control.Controller - Processing source <https://builds.apache.org/job/torque4-test-project-hsqldb/ws/target/torque/test/schema/default-value-schema.xml>
INFO org.apache.torque.generator.control.Controller - Start generation of File <https://builds.apache.org/job/torque4-test-project-hsqldb/ws/target/generated-sql/default-value-schema.sql>
INFO org.apache.torque.generator.control.Controller - Processing source <https://builds.apache.org/job/torque4-test-project-hsqldb/ws/target/torque/test/schema/foreign-key-schema.xml>
INFO org.apache.torque.generator.control.Controller - Start generation of File <https://builds.apache.org/job/torque4-test-project-hsqldb/ws/target/generated-sql/foreign-key-schema.sql>
INFO org.apache.torque.generator.control.Controller - Processing source <https://builds.apache.org/job/torque4-test-project-hsqldb/ws/target/torque/test/schema/id-table-schema.xml>
INFO org.apache.torque.generator.control.Controller - Start generation of File <https://builds.apache.org/job/torque4-test-project-hsqldb/ws/target/generated-sql/id-table-schema.sql>
INFO org.apache.torque.generator.control.Controller - Processing source <https://builds.apache.org/job/torque4-test-project-hsqldb/ws/target/torque/test/schema/index.xml>
INFO org.apache.torque.generator.control.Controller - Start generation of File <https://builds.apache.org/job/torque4-test-project-hsqldb/ws/target/generated-sql/index.sql>
INFO org.apache.torque.generator.control.Controller - Processing source <https://builds.apache.org/job/torque4-test-project-hsqldb/ws/target/torque/test/schema/pk-schema.xml>
INFO org.apache.torque.generator.control.Controller - Start generation of File <https://builds.apache.org/job/torque4-test-project-hsqldb/ws/target/generated-sql/pk-schema.sql>
INFO org.apache.torque.generator.control.Controller - Processing source <https://builds.apache.org/job/torque4-test-project-hsqldb/ws/target/torque/test/schema/save-method-in-peer-schema.xml>
INFO org.apache.torque.generator.control.Controller - Start generation of File <https://builds.apache.org/job/torque4-test-project-hsqldb/ws/target/generated-sql/save-method-in-peer-schema.sql>
INFO org.apache.torque.generator.control.Controller - Processing source <https://builds.apache.org/job/torque4-test-project-hsqldb/ws/target/torque/test/schema/test-schema.xml>
INFO org.apache.torque.generator.control.Controller - Start generation of File <https://builds.apache.org/job/torque4-test-project-hsqldb/ws/target/generated-sql/test-schema.sql>
INFO org.apache.torque.generator.control.Controller - Processing source <https://builds.apache.org/job/torque4-test-project-hsqldb/ws/target/torque/test/schema/types-schema.xml>
INFO org.apache.torque.generator.control.Controller - Start generation of File <https://builds.apache.org/job/torque4-test-project-hsqldb/ws/target/generated-sql/types-schema.sql>
[INFO] Generation successful
[INFO] [torque:generate {execution: generate-createdb-sql}]
INFO org.apache.torque.generator.control.Controller - readConfiguration() : Starting to read configuration files
INFO org.apache.torque.generator.control.Controller - readConfiguration() : Configuration read.
INFO org.apache.torque.generator.control.Controller - Processing output torque.sql.createdb
INFO org.apache.torque.generator.control.Controller - Processing source <https://builds.apache.org/job/torque4-test-project-hsqldb/ws/target/torque/test/schema/bookstore-schema.xml>
INFO org.apache.torque.generator.control.Controller - Start generation of File <https://builds.apache.org/job/torque4-test-project-hsqldb/ws/target/generated-createdb-sql/bookstore-schema-create.sql>
INFO org.apache.torque.generator.control.Controller - Processing source <https://builds.apache.org/job/torque4-test-project-hsqldb/ws/target/torque/test/schema/databaseMapInit-schema.xml>
INFO org.apache.torque.generator.control.Controller - Start generation of File <https://builds.apache.org/job/torque4-test-project-hsqldb/ws/target/generated-createdb-sql/databaseMapInit-schema-create.sql>
INFO org.apache.torque.generator.control.Controller - Processing source <https://builds.apache.org/job/torque4-test-project-hsqldb/ws/target/torque/test/schema/default-value-schema.xml>
INFO org.apache.torque.generator.control.Controller - Start generation of File <https://builds.apache.org/job/torque4-test-project-hsqldb/ws/target/generated-createdb-sql/default-value-schema-create.sql>
INFO org.apache.torque.generator.control.Controller - Processing source <https://builds.apache.org/job/torque4-test-project-hsqldb/ws/target/torque/test/schema/foreign-key-schema.xml>
INFO org.apache.torque.generator.control.Controller - Start generation of File <https://builds.apache.org/job/torque4-test-project-hsqldb/ws/target/generated-createdb-sql/foreign-key-schema-create.sql>
INFO org.apache.torque.generator.control.Controller - Processing source <https://builds.apache.org/job/torque4-test-project-hsqldb/ws/target/torque/test/schema/index.xml>
INFO org.apache.torque.generator.control.Controller - Start generation of File <https://builds.apache.org/job/torque4-test-project-hsqldb/ws/target/generated-createdb-sql/index-create.sql>
INFO org.apache.torque.generator.control.Controller - Processing source <https://builds.apache.org/job/torque4-test-project-hsqldb/ws/target/torque/test/schema/pk-schema.xml>
INFO org.apache.torque.generator.control.Controller - Start generation of File <https://builds.apache.org/job/torque4-test-project-hsqldb/ws/target/generated-createdb-sql/pk-schema-create.sql>
INFO org.apache.torque.generator.control.Controller - Processing source <https://builds.apache.org/job/torque4-test-project-hsqldb/ws/target/torque/test/schema/save-method-in-peer-schema.xml>
INFO org.apache.torque.generator.control.Controller - Start generation of File <https://builds.apache.org/job/torque4-test-project-hsqldb/ws/target/generated-createdb-sql/save-method-in-peer-schema-create.sql>
INFO org.apache.torque.generator.control.Controller - Processing source <https://builds.apache.org/job/torque4-test-project-hsqldb/ws/target/torque/test/schema/test-schema.xml>
INFO org.apache.torque.generator.control.Controller - Start generation of File <https://builds.apache.org/job/torque4-test-project-hsqldb/ws/target/generated-createdb-sql/test-schema-create.sql>
INFO org.apache.torque.generator.control.Controller - Processing source <https://builds.apache.org/job/torque4-test-project-hsqldb/ws/target/torque/test/schema/types-schema.xml>
INFO org.apache.torque.generator.control.Controller - Start generation of File <https://builds.apache.org/job/torque4-test-project-hsqldb/ws/target/generated-createdb-sql/types-schema-create.sql>
[INFO] Generation successful
[INFO] [torque:generate {execution: generate-idtable-sql}]
INFO org.apache.torque.generator.control.Controller - readConfiguration() : Starting to read configuration files
INFO org.apache.torque.generator.control.Controller - readConfiguration() : Configuration read.
INFO org.apache.torque.generator.control.Controller - Processing output torque.sql.idtable.idtable
INFO org.apache.torque.generator.control.Controller - Processing source <https://builds.apache.org/job/torque4-test-project-hsqldb/ws/target/torque/test/schema/./bookstore-schema.xml>
INFO org.apache.torque.generator.control.Controller - Start generation of File <https://builds.apache.org/job/torque4-test-project-hsqldb/ws/target/generated-sql/bookstore-schema-idtable-init.sql>
INFO org.apache.torque.generator.control.Controller - Processing source <https://builds.apache.org/job/torque4-test-project-hsqldb/ws/target/torque/test/schema/./databaseMapInit-schema.xml>
INFO org.apache.torque.generator.control.Controller - Start generation of File <https://builds.apache.org/job/torque4-test-project-hsqldb/ws/target/generated-sql/databaseMapInit-schema-idtable-init.sql>
INFO org.apache.torque.generator.control.Controller - Processing source <https://builds.apache.org/job/torque4-test-project-hsqldb/ws/target/torque/test/schema/./default-value-schema.xml>
INFO org.apache.torque.generator.control.Controller - Start generation of File <https://builds.apache.org/job/torque4-test-project-hsqldb/ws/target/generated-sql/default-value-schema-idtable-init.sql>
INFO org.apache.torque.generator.control.Controller - Processing source <https://builds.apache.org/job/torque4-test-project-hsqldb/ws/target/torque/test/schema/./ext-schema.xml>
INFO org.apache.torque.generator.control.Controller - Start generation of File <https://builds.apache.org/job/torque4-test-project-hsqldb/ws/target/generated-sql/ext-schema-idtable-init.sql>
INFO org.apache.torque.generator.control.Controller - Processing source <https://builds.apache.org/job/torque4-test-project-hsqldb/ws/target/torque/test/schema/./extext-schema.xml>
INFO org.apache.torque.generator.control.Controller - Start generation of File <https://builds.apache.org/job/torque4-test-project-hsqldb/ws/target/generated-sql/extext-schema-idtable-init.sql>
INFO org.apache.torque.generator.control.Controller - Processing source <https://builds.apache.org/job/torque4-test-project-hsqldb/ws/target/torque/test/schema/./foreign-key-schema.xml>
INFO org.apache.torque.generator.control.Controller - Start generation of File <https://builds.apache.org/job/torque4-test-project-hsqldb/ws/target/generated-sql/foreign-key-schema-idtable-init.sql>
INFO org.apache.torque.generator.control.Controller - Processing source <https://builds.apache.org/job/torque4-test-project-hsqldb/ws/target/torque/test/schema/./included-from-included-schema.xml>
INFO org.apache.torque.generator.control.Controller - Start generation of File <https://builds.apache.org/job/torque4-test-project-hsqldb/ws/target/generated-sql/included-from-included-schema-idtable-init.sql>
INFO org.apache.torque.generator.control.Controller - Processing source <https://builds.apache.org/job/torque4-test-project-hsqldb/ws/target/torque/test/schema/./included-schema.xml>
INFO org.apache.torque.generator.control.Controller - Start generation of File <https://builds.apache.org/job/torque4-test-project-hsqldb/ws/target/generated-sql/included-schema-idtable-init.sql>
INFO org.apache.torque.generator.control.Controller - Processing source <https://builds.apache.org/job/torque4-test-project-hsqldb/ws/target/torque/test/schema/./pk-schema.xml>
INFO org.apache.torque.generator.control.Controller - Start generation of File <https://builds.apache.org/job/torque4-test-project-hsqldb/ws/target/generated-sql/pk-schema-idtable-init.sql>
INFO org.apache.torque.generator.control.Controller - Processing source <https://builds.apache.org/job/torque4-test-project-hsqldb/ws/target/torque/test/schema/./save-method-in-peer-schema.xml>
INFO org.apache.torque.generator.control.Controller - Start generation of File <https://builds.apache.org/job/torque4-test-project-hsqldb/ws/target/generated-sql/save-method-in-peer-schema-idtable-init.sql>
INFO org.apache.torque.generator.control.Controller - Processing source <https://builds.apache.org/job/torque4-test-project-hsqldb/ws/target/torque/test/schema/./test-schema.xml>
INFO org.apache.torque.generator.control.Controller - Start generation of File <https://builds.apache.org/job/torque4-test-project-hsqldb/ws/target/generated-sql/test-schema-idtable-init.sql>
INFO org.apache.torque.generator.control.Controller - Processing source <https://builds.apache.org/job/torque4-test-project-hsqldb/ws/target/torque/test/schema/./types-schema.xml>
INFO org.apache.torque.generator.control.Controller - Start generation of File <https://builds.apache.org/job/torque4-test-project-hsqldb/ws/target/generated-sql/types-schema-idtable-init.sql>
[INFO] Generation successful
[INFO] [torque:generate {execution: generate-html-doc}]
INFO org.apache.torque.generator.control.Controller - readConfiguration() : Starting to read configuration files
INFO org.apache.torque.generator.control.Controller - readConfiguration() : Configuration read.
INFO org.apache.torque.generator.control.Controller - Processing output torque.doc.html.css
INFO org.apache.torque.generator.control.Controller - Processing source <https://builds.apache.org/job/torque4-test-project-hsqldb/ws/target/torque/test/schema/bookstore-schema.xml>
INFO org.apache.torque.generator.control.Controller - Start generation of File <https://builds.apache.org/job/torque4-test-project-hsqldb/ws/target/generated-docs/datamodel.css>
INFO org.apache.torque.generator.control.Controller - Processing source <https://builds.apache.org/job/torque4-test-project-hsqldb/ws/target/torque/test/schema/databaseMapInit-schema.xml>
INFO org.apache.torque.generator.control.Controller - Start generation of File <https://builds.apache.org/job/torque4-test-project-hsqldb/ws/target/generated-docs/datamodel.css>
INFO org.apache.torque.generator.control.Controller - Processing source <https://builds.apache.org/job/torque4-test-project-hsqldb/ws/target/torque/test/schema/default-value-schema.xml>
INFO org.apache.torque.generator.control.Controller - Start generation of File <https://builds.apache.org/job/torque4-test-project-hsqldb/ws/target/generated-docs/datamodel.css>
INFO org.apache.torque.generator.control.Controller - Processing source <https://builds.apache.org/job/torque4-test-project-hsqldb/ws/target/torque/test/schema/foreign-key-schema.xml>
INFO org.apache.torque.generator.control.Controller - Start generation of File <https://builds.apache.org/job/torque4-test-project-hsqldb/ws/target/generated-docs/datamodel.css>
INFO org.apache.torque.generator.control.Controller - Processing source <https://builds.apache.org/job/torque4-test-project-hsqldb/ws/target/torque/test/schema/index.xml>
INFO org.apache.torque.generator.control.Controller - Start generation of File <https://builds.apache.org/job/torque4-test-project-hsqldb/ws/target/generated-docs/datamodel.css>
INFO org.apache.torque.generator.control.Controller - Processing source <https://builds.apache.org/job/torque4-test-project-hsqldb/ws/target/torque/test/schema/pk-schema.xml>
INFO org.apache.torque.generator.control.Controller - Start generation of File <https://builds.apache.org/job/torque4-test-project-hsqldb/ws/target/generated-docs/datamodel.css>
INFO org.apache.torque.generator.control.Controller - Processing source <https://builds.apache.org/job/torque4-test-project-hsqldb/ws/target/torque/test/schema/save-method-in-peer-schema.xml>
INFO org.apache.torque.generator.control.Controller - Start generation of File <https://builds.apache.org/job/torque4-test-project-hsqldb/ws/target/generated-docs/datamodel.css>
INFO org.apache.torque.generator.control.Controller - Processing source <https://builds.apache.org/job/torque4-test-project-hsqldb/ws/target/torque/test/schema/test-schema.xml>
INFO org.apache.torque.generator.control.Controller - Start generation of File <https://builds.apache.org/job/torque4-test-project-hsqldb/ws/target/generated-docs/datamodel.css>
INFO org.apache.torque.generator.control.Controller - Processing source <https://builds.apache.org/job/torque4-test-project-hsqldb/ws/target/torque/test/schema/types-schema.xml>
INFO org.apache.torque.generator.control.Controller - Start generation of File <https://builds.apache.org/job/torque4-test-project-hsqldb/ws/target/generated-docs/datamodel.css>
INFO org.apache.torque.generator.control.Controller - Processing output torque.doc.html.html
INFO org.apache.torque.generator.control.Controller - Processing source <https://builds.apache.org/job/torque4-test-project-hsqldb/ws/target/torque/test/schema/bookstore-schema.xml>
INFO org.apache.torque.generator.control.Controller - Start generation of File <https://builds.apache.org/job/torque4-test-project-hsqldb/ws/target/generated-docs/bookstore-schema.html>
INFO org.apache.torque.generator.control.Controller - Processing source <https://builds.apache.org/job/torque4-test-project-hsqldb/ws/target/torque/test/schema/databaseMapInit-schema.xml>
INFO org.apache.torque.generator.control.Controller - Start generation of File <https://builds.apache.org/job/torque4-test-project-hsqldb/ws/target/generated-docs/databaseMapInit-schema.html>
INFO org.apache.torque.generator.control.Controller - Processing source <https://builds.apache.org/job/torque4-test-project-hsqldb/ws/target/torque/test/schema/default-value-schema.xml>
INFO org.apache.torque.generator.control.Controller - Start generation of File <https://builds.apache.org/job/torque4-test-project-hsqldb/ws/target/generated-docs/default-value-schema.html>
INFO org.apache.torque.generator.control.Controller - Processing source <https://builds.apache.org/job/torque4-test-project-hsqldb/ws/target/torque/test/schema/foreign-key-schema.xml>
INFO org.apache.torque.generator.control.Controller - Start generation of File <https://builds.apache.org/job/torque4-test-project-hsqldb/ws/target/generated-docs/foreign-key-schema.html>
INFO org.apache.torque.generator.control.Controller - Processing source <https://builds.apache.org/job/torque4-test-project-hsqldb/ws/target/torque/test/schema/index.xml>
INFO org.apache.torque.generator.control.Controller - Start generation of File <https://builds.apache.org/job/torque4-test-project-hsqldb/ws/target/generated-docs/index.html>
INFO org.apache.torque.generator.control.Controller - Processing source <https://builds.apache.org/job/torque4-test-project-hsqldb/ws/target/torque/test/schema/pk-schema.xml>
INFO org.apache.torque.generator.control.Controller - Start generation of File <https://builds.apache.org/job/torque4-test-project-hsqldb/ws/target/generated-docs/pk-schema.html>
INFO org.apache.torque.generator.control.Controller - Processing source <https://builds.apache.org/job/torque4-test-project-hsqldb/ws/target/torque/test/schema/save-method-in-peer-schema.xml>
INFO org.apache.torque.generator.control.Controller - Start generation of File <https://builds.apache.org/job/torque4-test-project-hsqldb/ws/target/generated-docs/save-method-in-peer-schema.html>
INFO org.apache.torque.generator.control.Controller - Processing source <https://builds.apache.org/job/torque4-test-project-hsqldb/ws/target/torque/test/schema/test-schema.xml>
INFO org.apache.torque.generator.control.Controller - Start generation of File <https://builds.apache.org/job/torque4-test-project-hsqldb/ws/target/generated-docs/test-schema.html>
INFO org.apache.torque.generator.control.Controller - Processing source <https://builds.apache.org/job/torque4-test-project-hsqldb/ws/target/torque/test/schema/types-schema.xml>
INFO org.apache.torque.generator.control.Controller - Start generation of File <https://builds.apache.org/job/torque4-test-project-hsqldb/ws/target/generated-docs/types-schema.html>
[INFO] Generation successful
[INFO] [remote-resources:process {execution: default}]
[debug] execute contextualize
[INFO] [resources:resources {execution: default-resources}]
[INFO] Using 'ISO-8859-1' encoding to copy filtered resources.
[INFO] skip non existing resourceDirectory <https://builds.apache.org/job/torque4-test-project-hsqldb/ws/src/main/resources>
[INFO] Copying 3 resources
[INFO] [compiler:compile {execution: default-compile}]
[INFO] Compiling 1209 source files to <https://builds.apache.org/job/torque4-test-project-hsqldb/ws/target/classes>
[INFO] [sql:execute {execution: execute-ddl}]
[FATAL ERROR] org.codehaus.mojo.sql.SqlExecMojo#execute() caused a linkage error (java.lang.UnsupportedClassVersionError) and may be out-of-date. Check the realms:
[FATAL ERROR] Plugin realm = app0.child-container[org.codehaus.mojo:sql-maven-plugin:1.4]
urls[0] = file:/home/jenkins/jenkins-slave/maven-repositories/0/org/codehaus/mojo/sql-maven-plugin/1.4/sql-maven-plugin-1.4.jar
urls[1] = file:/home/jenkins/jenkins-slave/maven-repositories/0/org/hsqldb/hsqldb/2.2.6/hsqldb-2.2.6.jar
urls[2] = file:/home/jenkins/jenkins-slave/maven-repositories/0/org/codehaus/plexus/plexus-utils/1.5.8/plexus-utils-1.5.8.jar
urls[3] = file:/home/jenkins/jenkins-slave/maven-repositories/0/commons-lang/commons-lang/2.4/commons-lang-2.4.jar
urls[4] = file:/home/jenkins/jenkins-slave/maven-repositories/0/org/apache/maven/shared/maven-filtering/1.0-beta-3/maven-filtering-1.0-beta-3.jar
urls[5] = file:/home/jenkins/jenkins-slave/maven-repositories/0/org/codehaus/plexus/plexus-interpolation/1.12/plexus-interpolation-1.12.jar
urls[6] = file:/home/jenkins/jenkins-slave/maven-repositories/0/org/sonatype/plexus/plexus-build-api/0.0.4/plexus-build-api-0.0.4.jar
[FATAL ERROR] Container realm = plexus.core.maven
[JENKINS] Archiving <https://builds.apache.org/job/torque4-test-project-hsqldb/ws/pom.xml> to /home/hudson/hudson/jobs/torque4-test-project-hsqldb/modules/org.apache.torque$torque-test/builds/2012-07-16_17-37-35/archive/org.apache.torque/torque-test/4.0-beta1-SNAPSHOT/torque-test-4.0-beta1-SNAPSHOT.pom
[INFO] ------------------------------------------------------------------------
[ERROR] FATAL ERROR
[INFO] ------------------------------------------------------------------------
[INFO] Bad version number in .class file
[INFO] ------------------------------------------------------------------------
[INFO] Trace
java.lang.UnsupportedClassVersionError: Bad version number in .class file
at java.lang.ClassLoader.defineClass1(Native Method)
at java.lang.ClassLoader.defineClass(ClassLoader.java:621)
at java.security.SecureClassLoader.defineClass(SecureClassLoader.java:124)
at java.net.URLClassLoader.defineClass(URLClassLoader.java:260)
at java.net.URLClassLoader.access$100(URLClassLoader.java:56)
at java.net.URLClassLoader$1.run(URLClassLoader.java:195)
at java.security.AccessController.doPrivileged(Native Method)
at java.net.URLClassLoader.findClass(URLClassLoader.java:188)
at java.lang.ClassLoader.loadClass(ClassLoader.java:307)
at org.codehaus.classworlds.RealmClassLoader.loadClassDirect(RealmClassLoader.java:195)
at org.codehaus.classworlds.DefaultClassRealm.loadClass(DefaultClassRealm.java:255)
at org.codehaus.classworlds.RealmClassLoader.loadClass(RealmClassLoader.java:214)
at java.lang.ClassLoader.loadClass(ClassLoader.java:252)
at java.lang.ClassLoader.loadClassInternal(ClassLoader.java:320)
at java.lang.Class.forName0(Native Method)
at java.lang.Class.forName(Class.java:164)
at org.codehaus.mojo.sql.SqlExecMojo.getConnection(SqlExecMojo.java:846)
at org.codehaus.mojo.sql.SqlExecMojo.execute(SqlExecMojo.java:577)
at org.apache.maven.plugin.DefaultPluginManager.executeMojo(DefaultPluginManager.java:490)
at hudson.maven.agent.PluginManagerInterceptor.executeMojo(PluginManagerInterceptor.java:182)
at org.apache.maven.lifecycle.DefaultLifecycleExecutor.executeGoals(DefaultLifecycleExecutor.java:694)
at org.apache.maven.lifecycle.DefaultLifecycleExecutor.executeGoalWithLifecycle(DefaultLifecycleExecutor.java:556)
at org.apache.maven.lifecycle.DefaultLifecycleExecutor.executeGoal(DefaultLifecycleExecutor.java:535)
at org.apache.maven.lifecycle.DefaultLifecycleExecutor.executeGoalAndHandleFailures(DefaultLifecycleExecutor.java:387)
at org.apache.maven.lifecycle.DefaultLifecycleExecutor.executeTaskSegments(DefaultLifecycleExecutor.java:348)
at org.apache.maven.lifecycle.DefaultLifecycleExecutor.execute(DefaultLifecycleExecutor.java:180)
at org.apache.maven.lifecycle.LifecycleExecutorInterceptor.execute(LifecycleExecutorInterceptor.java:65)
at org.apache.maven.DefaultMaven.doExecute(DefaultMaven.java:328)
at org.apache.maven.DefaultMaven.execute(DefaultMaven.java:138)
at org.apache.maven.cli.MavenCli.main(MavenCli.java:362)
at sun.reflect.NativeMethodAccessorImpl.invoke0(Native Method)
at sun.reflect.NativeMethodAccessorImpl.invoke(NativeMethodAccessorImpl.java:39)
at sun.reflect.DelegatingMethodAccessorImpl.invoke(DelegatingMethodAccessorImpl.java:25)
at java.lang.reflect.Method.invoke(Method.java:592)
at org.codehaus.classworlds.Launcher.launchEnhanced(Launcher.java:315)
at org.codehaus.classworlds.Launcher.launch(Launcher.java:255)
at hudson.maven.agent.Main.launch(Main.java:185)
at hudson.maven.MavenBuilder.call(MavenBuilder.java:151)
at hudson.maven.Maven2Builder.call(Maven2Builder.java:77)
at hudson.maven.Maven2Builder.call(Maven2Builder.java:53)
at hudson.remoting.UserRequest.perform(UserRequest.java:118)
at hudson.remoting.UserRequest.perform(UserRequest.java:48)
at hudson.remoting.Request$2.run(Request.java:326)
at hudson.remoting.InterceptingExecutorService$1.call(InterceptingExecutorService.java:72)
at java.util.concurrent.FutureTask$Sync.innerRun(FutureTask.java:269)
at java.util.concurrent.FutureTask.run(FutureTask.java:123)
at java.util.concurrent.ThreadPoolExecutor$Worker.runTask(ThreadPoolExecutor.java:651)
at java.util.concurrent.ThreadPoolExecutor$Worker.run(ThreadPoolExecutor.java:676)
at java.lang.Thread.run(Thread.java:595)
[INFO] ------------------------------------------------------------------------
[INFO] Total time: 55 seconds
[INFO] Finished at: Mon Jul 16 17:39:05 UTC 2012
[INFO] Final Memory: 45M/316M
[INFO] ------------------------------------------------------------------------
channel stopped
---------------------------------------------------------------------
To unsubscribe, e-mail: torque-dev-unsubscribe@db.apache.org
For additional commands, e-mail: torque-dev-help@db.apache.org
Jenkins build is back to normal : torque4-test-project-hsqldb #116
Posted by Apache Jenkins Server <je...@builds.apache.org>.
See <https://builds.apache.org/job/torque4-test-project-hsqldb/116/>
---------------------------------------------------------------------
To unsubscribe, e-mail: torque-dev-unsubscribe@db.apache.org
For additional commands, e-mail: torque-dev-help@db.apache.org
Build failed in Jenkins: torque4-test-project-hsqldb #115
Posted by Apache Jenkins Server <je...@builds.apache.org>.
See <https://builds.apache.org/job/torque4-test-project-hsqldb/115/>
------------------------------------------
[...truncated 1455 lines...]
AU torque-templates/src/main/resources/org/apache/torque/templates/om/templates/dbObject/base/savingMethods.vm
A torque-templates/src/main/resources/org/apache/torque/templates/om/templates/dbObject/base/isCacheOnSave.vm
AU torque-templates/src/main/resources/org/apache/torque/templates/om/templates/dbObject/base/foreignKeyGetter.vm
AU torque-templates/src/main/resources/org/apache/torque/templates/om/templates/dbObject/base/adderReferencingObject.vm
AU torque-templates/src/main/resources/org/apache/torque/templates/om/templates/dbObject/base/newModifiedMethods.vm
AU torque-templates/src/main/resources/org/apache/torque/templates/om/templates/dbObject/base/primaryKeyMethods.vm
AU torque-templates/src/main/resources/org/apache/torque/templates/om/templates/dbObject/base/loadingField.vm
AU torque-templates/src/main/resources/org/apache/torque/templates/om/templates/dbObject/base/newModifiedFields.vm
AU torque-templates/src/main/resources/org/apache/torque/templates/om/templates/dbObject/base/initializerReferencingObject.vm
A torque-templates/src/main/resources/org/apache/torque/templates/om/templates/dbObject/base/bean
AU torque-templates/src/main/resources/org/apache/torque/templates/om/templates/dbObject/base/bean/objectBeanMethods.vm
AU torque-templates/src/main/resources/org/apache/torque/templates/om/templates/dbObject/base/bean/objectBeanImports.vm
AU torque-templates/src/main/resources/org/apache/torque/templates/om/templates/dbObject/base/getterReferencingObject.vm
AU torque-templates/src/main/resources/org/apache/torque/templates/om/templates/dbObject/base/equalsHashCode.vm
AU torque-templates/src/main/resources/org/apache/torque/templates/om/templates/dbObject/base/deletedMethods.vm
AU torque-templates/src/main/resources/org/apache/torque/templates/om/templates/dbObject/base/savingField.vm
AU torque-templates/src/main/resources/org/apache/torque/templates/om/templates/dbObject/base/classJavadoc.vm
AU torque-templates/src/main/resources/org/apache/torque/templates/om/templates/dbObject/dbObject.vm
AU torque-templates/src/main/resources/org/apache/torque/templates/om/templates/dbObject/classJavadoc.vm
A torque-templates/src/main/resources/org/apache/torque/templates/om/templates/general
AU torque-templates/src/main/resources/org/apache/torque/templates/om/templates/general/setterMethodEnd.vm
AU torque-templates/src/main/resources/org/apache/torque/templates/om/templates/general/setterReferencedObject.vm
AU torque-templates/src/main/resources/org/apache/torque/templates/om/templates/general/getterSetter.vm
AU torque-templates/src/main/resources/org/apache/torque/templates/om/templates/general/saveMethods.vm
AU torque-templates/src/main/resources/org/apache/torque/templates/om/templates/general/createDbObjectInstance.vm
AU torque-templates/src/main/resources/org/apache/torque/templates/om/templates/general/setterMethodStart.vm
AU torque-templates/src/main/resources/org/apache/torque/templates/om/templates/general/setter.vm
AU torque-templates/src/main/resources/org/apache/torque/templates/om/templates/general/serialVersionUid.vm
AU torque-templates/src/main/resources/org/apache/torque/templates/om/templates/general/getter.vm
AU torque-templates/src/main/resources/org/apache/torque/templates/om/templates/general/fieldDefinition.vm
A torque-templates/src/main/resources/org/apache/torque/templates/xsd
AU torque-templates/src/main/resources/org/apache/torque/templates/xsd/database-4-0.xsd
AU torque-templates/src/main/resources/org/apache/torque/templates/xsd/database-4-0-strict.xsd
A torque-templates/src/changes
A torque-templates/src/changes/changes.xml
A torque-templates/pom.xml
A torque-test
A torque-test/torque-gen.properties
AU torque-test/profiles.xml
A torque-test/src
A torque-test/src/test
A torque-test/src/test/sql
AU torque-test/src/test/sql/schema.sql.ref.xml
AU torque-test/src/test/sql/schema.sql
A torque-test/src/test/profile
A torque-test/src/test/profile/derbyEmbedded
A torque-test/src/test/profile/derbyEmbedded/notes.txt
A torque-test/src/test/profile/derbyEmbedded/Torque.properties
A torque-test/src/test/profile/mssql
A torque-test/src/test/profile/mssql/Torque.properties
A torque-test/src/test/profile/postgresql
AU torque-test/src/test/profile/postgresql/Torque.properties
A torque-test/src/test/profile/derby
A torque-test/src/test/profile/derby/notes.txt
AU torque-test/src/test/profile/derby/Torque.properties
A torque-test/src/test/profile/mysql
AU torque-test/src/test/profile/mysql/Torque.properties
A torque-test/src/test/profile/oracle
AU torque-test/src/test/profile/oracle/Torque.properties
A torque-test/src/test/profile/henning
AU torque-test/src/test/profile/henning/Torque.properties
A torque-test/src/test/profile/jmcnally
AU torque-test/src/test/profile/jmcnally/Torque.properties
A torque-test/src/test/profile/tv
A torque-test/src/test/profile/tv/Torque.properties
A torque-test/src/test/profile/hsqldb
AU torque-test/src/test/profile/hsqldb/Torque.properties
A torque-test/src/test/java
A torque-test/src/test/java/org
A torque-test/src/test/java/org/apache
A torque-test/src/test/java/org/apache/torque
A torque-test/src/test/java/org/apache/torque/test
AU torque-test/src/test/java/org/apache/torque/test/InheritanceClassnameTestChild1.java
AU torque-test/src/test/java/org/apache/torque/test/InheritanceClassnameTestChild2.java
AU torque-test/src/test/java/org/apache/torque/InitShutdownTest.java
A torque-test/src/test/java/org/apache/torque/adapter
AU torque-test/src/test/java/org/apache/torque/adapter/AdapterTest.java
A torque-test/src/test/java/org/apache/torque/avalon
AU torque-test/src/test/java/org/apache/torque/avalon/AvalonMapBuildersTest.java
AU torque-test/src/test/java/org/apache/torque/DataTest.java
AU torque-test/src/test/java/org/apache/torque/JndiConfigurationTest.java
AU torque-test/src/test/java/org/apache/torque/ForeignKeySchemaData.java
A torque-test/src/test/java/org/apache/torque/datatypes
AU torque-test/src/test/java/org/apache/torque/datatypes/BooleanIntCharTest.java
AU torque-test/src/test/java/org/apache/torque/datatypes/BitTest.java
A torque-test/src/test/java/org/apache/torque/generated
A torque-test/src/test/java/org/apache/torque/generated/dataobject
AU torque-test/src/test/java/org/apache/torque/generated/dataobject/ForeignKeyAdderTest.java
AU torque-test/src/test/java/org/apache/torque/generated/dataobject/ViewTest.java
AU torque-test/src/test/java/org/apache/torque/generated/dataobject/ForeignKeyGetterTest.java
AU torque-test/src/test/java/org/apache/torque/generated/dataobject/SaveTest.java
A torque-test/src/test/java/org/apache/torque/generated/peer
AU torque-test/src/test/java/org/apache/torque/generated/peer/JoinTest.java
AU torque-test/src/test/java/org/apache/torque/generated/peer/SelectTest.java
A torque-test/src/test/java/org/apache/torque/generated/peer/DefaultValueTest.java
AU torque-test/src/test/java/org/apache/torque/generated/peer/WhereClauseSubselectTest.java
AU torque-test/src/test/java/org/apache/torque/generated/peer/DeleteTest.java
AU torque-test/src/test/java/org/apache/torque/generated/peer/SaveMethodsInPeerTest.java
A torque-test/src/test/java/org/apache/torque/generated/peer/SelectFunctionTest.java
AU torque-test/src/test/java/org/apache/torque/generated/peer/SelectInTest.java
AU torque-test/src/test/java/org/apache/torque/generated/peer/UseDefaultValueFromDatabaseTest.java
AU torque-test/src/test/java/org/apache/torque/generated/peer/GetRelatedObjectsTest.java
AU torque-test/src/test/java/org/apache/torque/generated/peer/DateTest.java
AU torque-test/src/test/java/org/apache/torque/generated/peer/FillerTest.java
A torque-test/src/test/java/org/apache/torque/sql
AU torque-test/src/test/java/org/apache/torque/sql/DatabaseTools.java
AU torque-test/src/test/java/org/apache/torque/sql/SkipSqlTest.java
AU torque-test/src/test/java/org/apache/torque/PkSchemaData.java
AU torque-test/src/test/java/org/apache/torque/DocsTest.java
AU torque-test/src/test/java/org/apache/torque/BeanTestConditional.java
AU torque-test/src/test/java/org/apache/torque/BaseDatabaseTestCase.java
A torque-test/src/test/java/org/apache/torque/oid
AU torque-test/src/test/java/org/apache/torque/oid/IDBrokerTest.java
A torque-test/src/test/java/org/apache/torque/om
AU torque-test/src/test/java/org/apache/torque/om/OMByNameMethodsTest.java
A torque-test/src/test/java/org/apache/torque/map
AU torque-test/src/test/java/org/apache/torque/map/DatabaseMapTest.java
A torque-test/src/test/java/org/apache/torque/util
AU torque-test/src/test/java/org/apache/torque/util/BasePeerTest.java
AU torque-test/src/test/java/org/apache/torque/util/LargeSelectTest.java
AU torque-test/src/test/java/org/apache/torque/util/SummaryHelperTest.java
AU torque-test/src/test/java/org/apache/torque/util/CopyTestConditional.java
AU torque-test/src/test/java/org/apache/torque/ManagerTestConditional.java
A torque-test/src/test/resources
AU torque-test/src/test/resources/TestRoleConfig.xml
AU torque-test/src/test/resources/TestComponentConfig.xml
AU torque-test/src/test/resources/commons-logging.properties
AU torque-test/src/test/resources/log4j.properties
AU torque-test/src/test/resources/cache.ccf
AU torque-test/src/test/resources/TurbineResources.properties
A torque-test/src/main
A torque-test/src/main/schema
A torque-test/src/main/schema/types-schema.xml
A torque-test/src/main/schema/databaseMapInit-schema.xml
AU torque-test/src/main/schema/bookstore-schema.xml
A torque-test/src/main/schema/included-schema.xml
A torque-test/src/main/schema/index.xml
A torque-test/src/main/schema/save-method-in-peer-schema.xml
A torque-test/src/main/schema/pk-schema.xml
A torque-test/src/main/schema/included-from-included-schema.xml
A torque-test/src/main/schema/default-value-schema.xml
A torque-test/src/main/schema/foreign-key-schema.xml
AU torque-test/src/main/schema/test-schema.xml
AU torque-test/src/main/schema/ext-schema.xml
AU torque-test/src/main/schema/extext-schema.xml
AU torque-test/src/main/schema/id-table-schema.xml
A torque-test/src/main/java
A torque-test/src/main/java/org
A torque-test/src/main/java/org/apache
A torque-test/src/main/java/org/apache/torque
AU torque-test/src/main/java/org/apache/torque/TestInterface.java
A torque-test/src/main/torque-gen
A torque-test/src/main/torque-gen/outlets
A torque-test/src/main/torque-gen/outlets/peer.xml
A torque-test/src/main/torque-gen/conf
A torque-test/src/main/torque-gen/conf/control.xml
A torque-test/src/main/torque-gen/templates
A torque-test/src/main/torque-gen/templates/peer
A torque-test/src/main/torque-gen/templates/peer/base
A torque-test/src/main/torque-gen/templates/peer/base/classAnnotations.vm
AU torque-test/pom.xml
At revision 1362754
no revision recorded for http://svn.apache.org/repos/asf/db/torque/torque4/trunk in the previous build
Parsing POMs
Discovered a new module org.apache.torque:torque-maven-parent Torque Maven Parent
Discovered a new module org.apache.torque:torque-runtime Torque Runtime
Discovered a new module org.apache.torque:torque-generator Torque Generator
Discovered a new module org.apache.torque:torque-templates Torque Templates
Discovered a new module org.apache.torque:torque-maven-plugin Torque Generator Maven 2 Plugin
Discovered a new module org.apache.torque:torque-ant-tasks Torque Generator Ant tasks
Discovered a new module org.apache.torque:torque-site Torque Site
Modules changed, recalculating dependency graph
[torque-maven-parent] $ /home/hudson/tools/java/latest1.5/bin/java -cp /home/jenkins/jenkins-slave/maven-agent.jar:/home/jenkins/jenkins-slave/classworlds.jar hudson.maven.agent.Main /home/hudson/tools/maven/apache-maven-2.2.1 /home/jenkins/jenkins-slave/slave.jar /home/jenkins/jenkins-slave/maven-interceptor.jar 43439 /home/jenkins/jenkins-slave/maven2.1-interceptor.jar
<===[JENKINS REMOTING channel started
CAPACITY]===> log4j:WARN No appenders could be found for logger (org.apache.commons.beanutils.converters.BooleanConverter).
log4j:WARN Please initialize the log4j system properly.
Executing Maven: -B -f <https://builds.apache.org/job/torque4-test-project-hsqldb/ws/torque-maven-parent/pom.xml> -Dmaven.repo.local=/home/jenkins/jenkins-slave/maven-repositories/0 -Ptest,hsqldb,beans,managers clean install
[INFO] Scanning for projects...
[INFO] Reactor build order:
[INFO] Torque Maven Parent
[INFO] Torque Runtime
[INFO] Torque Generator
[INFO] Torque Templates
[INFO] Torque Generator Maven 2 Plugin
[INFO] Torque Generator Ant tasks
[INFO] Torque Site
[INFO] Torque Test Project
[INFO] ------------------------------------------------------------------------
[INFO] Building Torque Maven Parent
[INFO] task-segment: [clean, install]
[INFO] ------------------------------------------------------------------------
[INFO] [clean:clean {execution: default-clean}]
[INFO] [remote-resources:process {execution: default}]
[INFO] [site:attach-descriptor {execution: default-attach-descriptor}]
[INFO] Preparing source:jar
[WARNING] Removing: jar from forked lifecycle, to prevent recursive invocation.
[INFO] No goals needed for project - skipping
[INFO] [source:jar {execution: default}]
[INFO] [apache-rat:check {execution: default}]
[INFO] Exclude: velocity.log
[INFO] Exclude: .checkstyle
[INFO] Exclude: checkstyle-cache.ccf
[INFO] Exclude: derby.log
[INFO] Exclude: LICENSE-EDL.txt
[INFO] [install:install {execution: default-install}]
[INFO] Installing <https://builds.apache.org/job/torque4-test-project-hsqldb/ws/torque-maven-parent/pom.xml> to /home/jenkins/jenkins-slave/maven-repositories/0/org/apache/torque/torque-maven-parent/4.0-beta1-SNAPSHOT/torque-maven-parent-4.0-beta1-SNAPSHOT.pom
[JENKINS] Archiving <https://builds.apache.org/job/torque4-test-project-hsqldb/ws/torque-maven-parent/pom.xml> to /home/hudson/hudson/jobs/torque4-test-project-hsqldb/modules/org.apache.torque$torque-maven-parent/builds/2012-07-18_03-55-14/archive/org.apache.torque/torque-maven-parent/4.0-beta1-SNAPSHOT/torque-maven-parent-4.0-beta1-SNAPSHOT.pom
[INFO] ------------------------------------------------------------------------
[INFO] Building Torque Runtime
[INFO] task-segment: [clean, install]
[INFO] ------------------------------------------------------------------------
[INFO] [clean:clean {execution: default-clean}]
[INFO] [remote-resources:process {execution: default}]
[debug] execute contextualize
[INFO] [resources:resources {execution: default-resources}]
[INFO] Using 'ISO-8859-1' encoding to copy filtered resources.
[INFO] skip non existing resourceDirectory <https://builds.apache.org/job/torque4-test-project-hsqldb/ws/torque-runtime/src/main/resources>
[INFO] Copying 3 resources
[INFO] [compiler:compile {execution: default-compile}]
[INFO] Compiling 106 source files to <https://builds.apache.org/job/torque4-test-project-hsqldb/ws/torque-runtime/target/classes>
[INFO] -------------------------------------------------------------
[ERROR] COMPILATION ERROR :
[INFO] -------------------------------------------------------------
[ERROR] <https://builds.apache.org/job/torque4-test-project-hsqldb/ws/torque-runtime/src/main/java/org/apache/torque/Torque.java>:[197,39] type parameters of <T>T cannot be determined; no unique maximal instance exists for type variable T with upper bounds T,org.apache.torque.manager.AbstractBaseManager<? extends org.apache.torque.om.Persistent>
[ERROR] <https://builds.apache.org/job/torque4-test-project-hsqldb/ws/torque-runtime/src/main/java/org/apache/torque/Torque.java>:[212,39] type parameters of <T>T cannot be determined; no unique maximal instance exists for type variable T with upper bounds T,org.apache.torque.manager.AbstractBaseManager<? extends org.apache.torque.om.Persistent>
[INFO] 2 errors
[INFO] -------------------------------------------------------------
[JENKINS] Archiving <https://builds.apache.org/job/torque4-test-project-hsqldb/ws/torque-runtime/pom.xml> to /home/hudson/hudson/jobs/torque4-test-project-hsqldb/modules/org.apache.torque$torque-runtime/builds/2012-07-18_03-55-14/archive/org.apache.torque/torque-runtime/4.0-beta1-SNAPSHOT/torque-runtime-4.0-beta1-SNAPSHOT.pom
[INFO] ------------------------------------------------------------------------
[ERROR] BUILD FAILURE
[INFO] ------------------------------------------------------------------------
[INFO] Compilation failure
<https://builds.apache.org/job/torque4-test-project-hsqldb/ws/torque-runtime/src/main/java/org/apache/torque/Torque.java>:[197,39] type parameters of <T>T cannot be determined; no unique maximal instance exists for type variable T with upper bounds T,org.apache.torque.manager.AbstractBaseManager<? extends org.apache.torque.om.Persistent>
<https://builds.apache.org/job/torque4-test-project-hsqldb/ws/torque-runtime/src/main/java/org/apache/torque/Torque.java>:[212,39] type parameters of <T>T cannot be determined; no unique maximal instance exists for type variable T with upper bounds T,org.apache.torque.manager.AbstractBaseManager<? extends org.apache.torque.om.Persistent>
[INFO] ------------------------------------------------------------------------
[INFO] For more information, run Maven with the -e switch
[INFO] ------------------------------------------------------------------------
[INFO] Total time: 29 seconds
[INFO] Finished at: Wed Jul 18 03:56:10 UTC 2012
[INFO] Final Memory: 48M/323M
[INFO] ------------------------------------------------------------------------
Sending e-mails to: torque-dev@db.apache.org
channel stopped
---------------------------------------------------------------------
To unsubscribe, e-mail: torque-dev-unsubscribe@db.apache.org
For additional commands, e-mail: torque-dev-help@db.apache.org