You are viewing a plain text version of this content. The canonical link for it is here.
Posted to builds@beam.apache.org by Apache Jenkins Server <je...@builds.apache.org> on 2022/04/18 09:31:31 UTC

Build failed in Jenkins: beam_PostCommit_Python37 #5121

See <https://ci-beam.apache.org/job/beam_PostCommit_Python37/5121/display/redirect>

Changes:


------------------------------------------
[...truncated 57.18 MB...]
apache_beam/io/gcp/bigquery.py:2476
  <https://ci-beam.apache.org/job/beam_PostCommit_Python37/ws/src/sdks/python/apache_beam/io/gcp/bigquery.py>:2476: BeamDeprecationWarning: options is deprecated since First stable release. References to <pipeline>.options will not be supported
    | _PassThroughThenCleanup(files_to_remove_pcoll))

apache_beam/io/gcp/bigquery.py:2139
apache_beam/io/gcp/bigquery.py:2139
apache_beam/io/gcp/bigquery.py:2139
apache_beam/io/gcp/bigquery.py:2139
apache_beam/io/gcp/bigquery.py:2139
apache_beam/io/gcp/bigquery.py:2139
apache_beam/io/gcp/bigquery.py:2139
apache_beam/io/gcp/bigquery.py:2139
apache_beam/io/gcp/bigquery.py:2139
apache_beam/io/gcp/bigquery.py:2139
apache_beam/io/gcp/bigquery.py:2139
apache_beam/io/gcp/bigquery.py:2139
  <https://ci-beam.apache.org/job/beam_PostCommit_Python37/ws/src/sdks/python/apache_beam/io/gcp/bigquery.py>:2139: BeamDeprecationWarning: options is deprecated since First stable release. References to <pipeline>.options will not be supported
    self.table_reference.projectId = pcoll.pipeline.options.view_as(

apache_beam/io/gcp/bigquery_file_loads.py:1128
apache_beam/io/gcp/bigquery_file_loads.py:1128
apache_beam/io/gcp/bigquery_file_loads.py:1128
apache_beam/io/gcp/bigquery_file_loads.py:1128
apache_beam/io/gcp/bigquery_file_loads.py:1128
apache_beam/io/gcp/bigquery_file_loads.py:1128
apache_beam/io/gcp/bigquery_file_loads.py:1128
apache_beam/io/gcp/bigquery_file_loads.py:1128
apache_beam/io/gcp/bigquery_file_loads.py:1128
apache_beam/io/gcp/bigquery_file_loads.py:1128
apache_beam/io/gcp/bigquery_file_loads.py:1128
apache_beam/io/gcp/bigquery_file_loads.py:1128
apache_beam/io/gcp/bigquery_file_loads.py:1128
apache_beam/io/gcp/bigquery_file_loads.py:1128
apache_beam/io/gcp/bigquery_file_loads.py:1128
apache_beam/io/gcp/bigquery_file_loads.py:1128
apache_beam/io/gcp/bigquery_file_loads.py:1128
  <https://ci-beam.apache.org/job/beam_PostCommit_Python37/ws/src/sdks/python/apache_beam/io/gcp/bigquery_file_loads.py>:1128: BeamDeprecationWarning: options is deprecated since First stable release. References to <pipeline>.options will not be supported
    temp_location = p.options.view_as(GoogleCloudOptions).temp_location

apache_beam/io/gcp/bigquery_file_loads.py:1130
apache_beam/io/gcp/bigquery_file_loads.py:1130
apache_beam/io/gcp/bigquery_file_loads.py:1130
apache_beam/io/gcp/bigquery_file_loads.py:1130
apache_beam/io/gcp/bigquery_file_loads.py:1130
apache_beam/io/gcp/bigquery_file_loads.py:1130
apache_beam/io/gcp/bigquery_file_loads.py:1130
apache_beam/io/gcp/bigquery_file_loads.py:1130
apache_beam/io/gcp/bigquery_file_loads.py:1130
apache_beam/io/gcp/bigquery_file_loads.py:1130
apache_beam/io/gcp/bigquery_file_loads.py:1130
apache_beam/io/gcp/bigquery_file_loads.py:1130
apache_beam/io/gcp/bigquery_file_loads.py:1130
apache_beam/io/gcp/bigquery_file_loads.py:1130
apache_beam/io/gcp/bigquery_file_loads.py:1130
apache_beam/io/gcp/bigquery_file_loads.py:1130
apache_beam/io/gcp/bigquery_file_loads.py:1130
  <https://ci-beam.apache.org/job/beam_PostCommit_Python37/ws/src/sdks/python/apache_beam/io/gcp/bigquery_file_loads.py>:1130: BeamDeprecationWarning: options is deprecated since First stable release. References to <pipeline>.options will not be supported
    p.options.view_as(GoogleCloudOptions).job_name or 'AUTOMATIC_JOB_NAME')

apache_beam/io/gcp/tests/utils.py:100
  <https://ci-beam.apache.org/job/beam_PostCommit_Python37/ws/src/sdks/python/apache_beam/io/gcp/tests/utils.py>:100: PendingDeprecationWarning: Client.dataset is deprecated and will be removed in a future version. Use a string like 'my_project.my_dataset' or a cloud.google.bigquery.DatasetReference object, instead.
    table_ref = client.dataset(dataset_id).table(table_id)

apache_beam/examples/dataframe/flight_delays.py:47
  <https://ci-beam.apache.org/job/beam_PostCommit_Python37/ws/src/sdks/python/apache_beam/examples/dataframe/flight_delays.py>:47: FutureWarning: Dropping of nuisance columns in DataFrame reductions (with 'numeric_only=None') is deprecated; in a future version this will raise TypeError.  Select only valid columns before calling the reduction.
    return airline_df[at_top_airports].mean()

apache_beam/dataframe/io.py:632
apache_beam/dataframe/io.py:632
apache_beam/dataframe/io.py:632
  <https://ci-beam.apache.org/job/beam_PostCommit_Python37/ws/src/sdks/python/apache_beam/dataframe/io.py>:632: FutureWarning: WriteToFiles is experimental.
    sink=lambda _: _WriteToPandasFileSink(

apache_beam/io/fileio.py:550
apache_beam/io/fileio.py:550
apache_beam/io/fileio.py:550
  <https://ci-beam.apache.org/job/beam_PostCommit_Python37/ws/src/sdks/python/apache_beam/io/fileio.py>:550: BeamDeprecationWarning: options is deprecated since First stable release. References to <pipeline>.options will not be supported
    p.options.view_as(GoogleCloudOptions).temp_location or

apache_beam/io/gcp/bigquery_test.py:1183
  <https://ci-beam.apache.org/job/beam_PostCommit_Python37/ws/src/sdks/python/apache_beam/io/gcp/bigquery_test.py>:1183: BeamDeprecationWarning: options is deprecated since First stable release. References to <pipeline>.options will not be supported
    streaming = self.test_pipeline.options.view_as(StandardOptions).streaming

apache_beam/io/gcp/bigquery_read_it_test.py:167
  <https://ci-beam.apache.org/job/beam_PostCommit_Python37/ws/src/sdks/python/apache_beam/io/gcp/bigquery_read_it_test.py>:167: BeamDeprecationWarning: BigQuerySource is deprecated since 2.25.0. Use ReadFromBigQuery instead.
    beam.io.BigQuerySource(query=self.query, use_standard_sql=True)))

apache_beam/io/gcp/big_query_query_to_table_pipeline.py:84
apache_beam/io/gcp/big_query_query_to_table_pipeline.py:84
  <https://ci-beam.apache.org/job/beam_PostCommit_Python37/ws/src/sdks/python/apache_beam/io/gcp/big_query_query_to_table_pipeline.py>:84: BeamDeprecationWarning: BigQuerySource is deprecated since 2.25.0. Use ReadFromBigQuery instead.
    kms_key=kms_key))

apache_beam/runners/dataflow/ptransform_overrides.py:323
apache_beam/runners/dataflow/ptransform_overrides.py:323
  <https://ci-beam.apache.org/job/beam_PostCommit_Python37/ws/src/sdks/python/apache_beam/runners/dataflow/ptransform_overrides.py>:323: BeamDeprecationWarning: BigQuerySink is deprecated since 2.11.0. Use WriteToBigQuery instead.
    kms_key=self.kms_key))

apache_beam/io/gcp/bigquery_read_it_test.py:556
  <https://ci-beam.apache.org/job/beam_PostCommit_Python37/ws/src/sdks/python/apache_beam/io/gcp/bigquery_read_it_test.py>:556: BeamDeprecationWarning: BigQuerySource is deprecated since 2.25.0. Use ReadFromBigQuery instead.
    beam.io.BigQuerySource(query=self.query, use_standard_sql=True)))

apache_beam/ml/gcp/cloud_dlp_it_test.py:77
  <https://ci-beam.apache.org/job/beam_PostCommit_Python37/ws/src/sdks/python/apache_beam/ml/gcp/cloud_dlp_it_test.py>:77: FutureWarning: MaskDetectedDetails is experimental.
    inspection_config=INSPECT_CONFIG))

apache_beam/io/gcp/bigquery_read_it_test.py:670
  <https://ci-beam.apache.org/job/beam_PostCommit_Python37/ws/src/sdks/python/apache_beam/io/gcp/bigquery_read_it_test.py>:670: FutureWarning: ReadAllFromBigQuery is experimental.
    | beam.io.ReadAllFromBigQuery())

apache_beam/io/gcp/bigquery.py:2617
  <https://ci-beam.apache.org/job/beam_PostCommit_Python37/ws/src/sdks/python/apache_beam/io/gcp/bigquery.py>:2617: BeamDeprecationWarning: options is deprecated since First stable release. References to <pipeline>.options will not be supported
    job_name = pcoll.pipeline.options.view_as(GoogleCloudOptions).job_name

apache_beam/io/gcp/bigquery.py:2618
  <https://ci-beam.apache.org/job/beam_PostCommit_Python37/ws/src/sdks/python/apache_beam/io/gcp/bigquery.py>:2618: BeamDeprecationWarning: options is deprecated since First stable release. References to <pipeline>.options will not be supported
    project = pcoll.pipeline.options.view_as(GoogleCloudOptions).project

apache_beam/io/gcp/bigquery.py:2631
  <https://ci-beam.apache.org/job/beam_PostCommit_Python37/ws/src/sdks/python/apache_beam/io/gcp/bigquery.py>:2631: BeamDeprecationWarning: options is deprecated since First stable release. References to <pipeline>.options will not be supported
    options=pcoll.pipeline.options,

apache_beam/ml/gcp/cloud_dlp_it_test.py:87
  <https://ci-beam.apache.org/job/beam_PostCommit_Python37/ws/src/sdks/python/apache_beam/ml/gcp/cloud_dlp_it_test.py>:87: FutureWarning: InspectForDetails is experimental.
    | beam.ParDo(extract_inspection_results).with_outputs(

-- Docs: https://docs.pytest.org/en/latest/warnings.html
- generated xml file: <https://ci-beam.apache.org/job/beam_PostCommit_Python37/ws/src/sdks/python/pytest_postCommitIT-df-py37.xml> -
======= 1 failed, 60 passed, 8 skipped, 168 warnings in 6528.48 seconds ========

> Task :sdks:python:test-suites:dataflow:py37:postCommitIT FAILED

> Task :sdks:python:test-suites:dataflow:py37:spannerioIT
>>> RUNNING integration tests with pipeline options: --runner=TestDataflowRunner --project=apache-beam-testing --region=us-central1 --staging_location=gs://temp-storage-for-end-to-end-tests/staging-it --temp_location=gs://temp-storage-for-end-to-end-tests/temp-it --output=gs://temp-storage-for-end-to-end-tests/py-it-cloud/output --sdk_location=<https://ci-beam.apache.org/job/beam_PostCommit_Python37/ws/src/sdks/python/build/apache-beam.tar.gz> --requirements_file=postcommit_requirements.txt --num_workers=1 --sleep_secs=20 --dataflow_worker_jar=<https://ci-beam.apache.org/job/beam_PostCommit_Python37/ws/src/runners/google-cloud-dataflow-java/worker/build/libs/beam-runners-google-cloud-dataflow-java-fn-api-worker-2.39.0-SNAPSHOT.jar> --kms_key_name=projects/apache-beam-testing/locations/global/keyRings/beam-it/cryptoKeys/test --dataflow_kms_key=projects/apache-beam-testing/locations/global/keyRings/beam-it/cryptoKeys/test
>>>   pytest options: --capture=no --timeout=4500 --color=yes --log-cli-level=INFO --numprocesses=8 --dist=loadfile
>>>   collect markers: -m=spannerio_it
============================= test session starts ==============================
platform linux -- Python 3.7.12, pytest-4.6.11, py-1.11.0, pluggy-0.13.1
rootdir: <https://ci-beam.apache.org/job/beam_PostCommit_Python37/ws/src/sdks/python,> inifile: pytest.ini
plugins: xdist-1.34.0, timeout-1.4.2, forked-1.4.0, requests-mock-1.9.3
timeout: 4500.0s
timeout method: signal
timeout func_only: False
gw0 I / gw1 I / gw2 I / gw3 I / gw4 I / gw5 I / gw6 I / gw7 I
[gw0] Python 3.7.12 (default, Jan 15 2022, 18:42:10)  -- [GCC 9.3.0]
[gw1] Python 3.7.12 (default, Jan 15 2022, 18:42:10)  -- [GCC 9.3.0]
[gw2] Python 3.7.12 (default, Jan 15 2022, 18:42:10)  -- [GCC 9.3.0]
[gw3] Python 3.7.12 (default, Jan 15 2022, 18:42:10)  -- [GCC 9.3.0]
[gw4] Python 3.7.12 (default, Jan 15 2022, 18:42:10)  -- [GCC 9.3.0]
[gw6] Python 3.7.12 (default, Jan 15 2022, 18:42:10)  -- [GCC 9.3.0]
[gw5] Python 3.7.12 (default, Jan 15 2022, 18:42:10)  -- [GCC 9.3.0]
[gw7] Python 3.7.12 (default, Jan 15 2022, 18:42:10)  -- [GCC 9.3.0]
gw0 [15] / gw1 [15] / gw2 [15] / gw3 [15] / gw4 [15] / gw5 [15] / gw6 [15] / gw7 [15]

scheduling tests via LoadFileScheduling

apache_beam/io/gcp/experimental/spannerio_write_it_test.py::SpannerWriteIntegrationTest::test_metrics_error_call 
apache_beam/io/gcp/experimental/spannerio_read_it_test.py::SpannerReadIntegrationTest::test_read_via_sql 
[gw1] SKIPPED apache_beam/io/gcp/experimental/spannerio_write_it_test.py::SpannerWriteIntegrationTest::test_metrics_error_call 
apache_beam/io/gcp/experimental/spannerio_write_it_test.py::SpannerWriteIntegrationTest::test_metrics_ok_call 
[gw1] SKIPPED apache_beam/io/gcp/experimental/spannerio_write_it_test.py::SpannerWriteIntegrationTest::test_metrics_ok_call 
apache_beam/io/gcp/experimental/spannerio_write_it_test.py::SpannerWriteIntegrationTest::test_spanner_error E0418 09:11:40.005961866 2753709 fork_posix.cc:70]           Fork support is only compatible with the epoll1 and poll polling strategies
E0418 09:11:41.002733392 2753706 fork_posix.cc:70]           Fork support is only compatible with the epoll1 and poll polling strategies

[gw1] PASSED apache_beam/io/gcp/experimental/spannerio_write_it_test.py::SpannerWriteIntegrationTest::test_spanner_error 
apache_beam/io/gcp/experimental/spannerio_write_it_test.py::SpannerWriteIntegrationTest::test_spanner_update E0418 09:18:27.194140834 2753709 fork_posix.cc:70]           Fork support is only compatible with the epoll1 and poll polling strategies

[gw0] PASSED apache_beam/io/gcp/experimental/spannerio_read_it_test.py::SpannerReadIntegrationTest::test_read_via_sql 
apache_beam/io/gcp/experimental/spannerio_read_it_test.py::SpannerReadIntegrationTest::test_read_via_table E0418 09:18:29.787162067 2753706 fork_posix.cc:70]           Fork support is only compatible with the epoll1 and poll polling strategies

[gw1] PASSED apache_beam/io/gcp/experimental/spannerio_write_it_test.py::SpannerWriteIntegrationTest::test_spanner_update 
apache_beam/io/gcp/experimental/spannerio_write_it_test.py::SpannerWriteIntegrationTest::test_write_batches E0418 09:25:04.527801155 2753709 fork_posix.cc:70]           Fork support is only compatible with the epoll1 and poll polling strategies

[gw0] PASSED apache_beam/io/gcp/experimental/spannerio_read_it_test.py::SpannerReadIntegrationTest::test_read_via_table 
apache_beam/io/gcp/experimental/spannerio_read_it_test.py::SpannerReadIntegrationTest::test_sql_metrics_error_call 
[gw0] SKIPPED apache_beam/io/gcp/experimental/spannerio_read_it_test.py::SpannerReadIntegrationTest::test_sql_metrics_error_call 
apache_beam/io/gcp/experimental/spannerio_read_it_test.py::SpannerReadIntegrationTest::test_sql_metrics_ok_call 
[gw0] SKIPPED apache_beam/io/gcp/experimental/spannerio_read_it_test.py::SpannerReadIntegrationTest::test_sql_metrics_ok_call 
apache_beam/io/gcp/experimental/spannerio_read_it_test.py::SpannerReadIntegrationTest::test_table_metrics_error_call 
[gw0] SKIPPED apache_beam/io/gcp/experimental/spannerio_read_it_test.py::SpannerReadIntegrationTest::test_table_metrics_error_call 
apache_beam/io/gcp/experimental/spannerio_read_it_test.py::SpannerReadIntegrationTest::test_table_metrics_ok_call 
[gw0] SKIPPED apache_beam/io/gcp/experimental/spannerio_read_it_test.py::SpannerReadIntegrationTest::test_table_metrics_ok_call 
apache_beam/io/gcp/experimental/spannerio_read_it_test.py::SpannerReadIntegrationTest::test_transaction_sql_metrics_error_call 
[gw0] SKIPPED apache_beam/io/gcp/experimental/spannerio_read_it_test.py::SpannerReadIntegrationTest::test_transaction_sql_metrics_error_call 
apache_beam/io/gcp/experimental/spannerio_read_it_test.py::SpannerReadIntegrationTest::test_transaction_sql_metrics_ok_call 
[gw0] SKIPPED apache_beam/io/gcp/experimental/spannerio_read_it_test.py::SpannerReadIntegrationTest::test_transaction_sql_metrics_ok_call 
apache_beam/io/gcp/experimental/spannerio_read_it_test.py::SpannerReadIntegrationTest::test_transaction_table_metrics_error_call 
[gw0] SKIPPED apache_beam/io/gcp/experimental/spannerio_read_it_test.py::SpannerReadIntegrationTest::test_transaction_table_metrics_error_call 
apache_beam/io/gcp/experimental/spannerio_read_it_test.py::SpannerReadIntegrationTest::test_transaction_table_metrics_ok_call 
[gw0] SKIPPED apache_beam/io/gcp/experimental/spannerio_read_it_test.py::SpannerReadIntegrationTest::test_transaction_table_metrics_ok_call 
[gw1] PASSED apache_beam/io/gcp/experimental/spannerio_write_it_test.py::SpannerWriteIntegrationTest::test_write_batches 

=============================== warnings summary ===============================
apache_beam/io/gcp/experimental/spannerio_write_it_test.py:190
  <https://ci-beam.apache.org/job/beam_PostCommit_Python37/ws/src/sdks/python/apache_beam/io/gcp/experimental/spannerio_write_it_test.py>:190: FutureWarning: WriteToSpanner is experimental. No backwards-compatibility guarantees.
    database_id=self.TEST_DATABASE))

apache_beam/io/gcp/experimental/spannerio_read_it_test.py:128
  <https://ci-beam.apache.org/job/beam_PostCommit_Python37/ws/src/sdks/python/apache_beam/io/gcp/experimental/spannerio_read_it_test.py>:128: FutureWarning: ReadFromSpanner is experimental. No backwards-compatibility guarantees.
    sql="select * from Users")

apache_beam/io/gcp/experimental/spannerio_write_it_test.py:171
  <https://ci-beam.apache.org/job/beam_PostCommit_Python37/ws/src/sdks/python/apache_beam/io/gcp/experimental/spannerio_write_it_test.py>:171: FutureWarning: WriteToSpanner is experimental. No backwards-compatibility guarantees.
    database_id=self.TEST_DATABASE))

apache_beam/io/gcp/experimental/spannerio_read_it_test.py:117
  <https://ci-beam.apache.org/job/beam_PostCommit_Python37/ws/src/sdks/python/apache_beam/io/gcp/experimental/spannerio_read_it_test.py>:117: FutureWarning: ReadFromSpanner is experimental. No backwards-compatibility guarantees.
    columns=["UserId", "Key"])

apache_beam/io/gcp/experimental/spannerio_write_it_test.py:135
  <https://ci-beam.apache.org/job/beam_PostCommit_Python37/ws/src/sdks/python/apache_beam/io/gcp/experimental/spannerio_write_it_test.py>:135: FutureWarning: WriteToSpanner is experimental. No backwards-compatibility guarantees.
    max_batch_size_bytes=250))

-- Docs: https://docs.pytest.org/en/latest/warnings.html
- generated xml file: <https://ci-beam.apache.org/job/beam_PostCommit_Python37/ws/src/sdks/python/pytest_postCommitIT-df-py37.xml> -
============= 5 passed, 10 skipped, 5 warnings in 1202.59 seconds ==============

FAILURE: Build failed with an exception.

* Where:
Script '<https://ci-beam.apache.org/job/beam_PostCommit_Python37/ws/src/sdks/python/test-suites/dataflow/common.gradle'> line: 121

* What went wrong:
Execution failed for task ':sdks:python:test-suites:dataflow:py37:postCommitIT'.
> Process 'command 'sh'' finished with non-zero exit value 1

* Try:
> Run with --stacktrace option to get the stack trace.
> Run with --info or --debug option to get more log output.
> Run with --scan to get full insights.

* Get more help at https://help.gradle.org

Deprecated Gradle features were used in this build, making it incompatible with Gradle 8.0.

You can use '--warning-mode all' to show the individual deprecation warnings and determine if they come from your own scripts or plugins.

See https://docs.gradle.org/7.4/userguide/command_line_interface.html#sec:command_line_warnings

Execution optimizations have been disabled for 1 invalid unit(s) of work during this build to ensure correctness.
Please consult deprecation warnings for more details.

BUILD FAILED in 2h 11m 6s
224 actionable tasks: 154 executed, 64 from cache, 6 up-to-date

Publishing build scan...
https://gradle.com/s/dol7uarxjmpsw

Build step 'Invoke Gradle script' changed build result to FAILURE
Build step 'Invoke Gradle script' marked build as failure

---------------------------------------------------------------------
To unsubscribe, e-mail: builds-unsubscribe@beam.apache.org
For additional commands, e-mail: builds-help@beam.apache.org


Jenkins build is back to normal : beam_PostCommit_Python37 #5132

Posted by Apache Jenkins Server <je...@builds.apache.org>.
See <https://ci-beam.apache.org/job/beam_PostCommit_Python37/5132/display/redirect?page=changes>


---------------------------------------------------------------------
To unsubscribe, e-mail: builds-unsubscribe@beam.apache.org
For additional commands, e-mail: builds-help@beam.apache.org


Build failed in Jenkins: beam_PostCommit_Python37 #5131

Posted by Apache Jenkins Server <je...@builds.apache.org>.
See <https://ci-beam.apache.org/job/beam_PostCommit_Python37/5131/display/redirect?page=changes>

Changes:

[mmack] [BEAM-14323] Improve IDE integration of Spark cross version builds

[noreply] [BEAM-14112] Fixed ReadFromBigQuery with Interactive Beam (#17306)


------------------------------------------
[...truncated 58.37 MB...]
apache_beam/io/gcp/bigquery.py:2148
apache_beam/io/gcp/bigquery.py:2148
apache_beam/io/gcp/bigquery.py:2148
apache_beam/io/gcp/bigquery.py:2148
apache_beam/io/gcp/bigquery.py:2148
apache_beam/io/gcp/bigquery.py:2148
apache_beam/io/gcp/bigquery.py:2148
apache_beam/io/gcp/bigquery.py:2148
  <https://ci-beam.apache.org/job/beam_PostCommit_Python37/ws/src/sdks/python/apache_beam/io/gcp/bigquery.py>:2148: BeamDeprecationWarning: options is deprecated since First stable release. References to <pipeline>.options will not be supported
    self.table_reference.projectId = pcoll.pipeline.options.view_as(

apache_beam/io/gcp/bigquery_file_loads.py:1128
apache_beam/io/gcp/bigquery_file_loads.py:1128
apache_beam/io/gcp/bigquery_file_loads.py:1128
apache_beam/io/gcp/bigquery_file_loads.py:1128
apache_beam/io/gcp/bigquery_file_loads.py:1128
apache_beam/io/gcp/bigquery_file_loads.py:1128
apache_beam/io/gcp/bigquery_file_loads.py:1128
apache_beam/io/gcp/bigquery_file_loads.py:1128
apache_beam/io/gcp/bigquery_file_loads.py:1128
apache_beam/io/gcp/bigquery_file_loads.py:1128
apache_beam/io/gcp/bigquery_file_loads.py:1128
apache_beam/io/gcp/bigquery_file_loads.py:1128
apache_beam/io/gcp/bigquery_file_loads.py:1128
apache_beam/io/gcp/bigquery_file_loads.py:1128
apache_beam/io/gcp/bigquery_file_loads.py:1128
apache_beam/io/gcp/bigquery_file_loads.py:1128
apache_beam/io/gcp/bigquery_file_loads.py:1128
  <https://ci-beam.apache.org/job/beam_PostCommit_Python37/ws/src/sdks/python/apache_beam/io/gcp/bigquery_file_loads.py>:1128: BeamDeprecationWarning: options is deprecated since First stable release. References to <pipeline>.options will not be supported
    temp_location = p.options.view_as(GoogleCloudOptions).temp_location

apache_beam/io/gcp/bigquery_file_loads.py:1130
apache_beam/io/gcp/bigquery_file_loads.py:1130
apache_beam/io/gcp/bigquery_file_loads.py:1130
apache_beam/io/gcp/bigquery_file_loads.py:1130
apache_beam/io/gcp/bigquery_file_loads.py:1130
apache_beam/io/gcp/bigquery_file_loads.py:1130
apache_beam/io/gcp/bigquery_file_loads.py:1130
apache_beam/io/gcp/bigquery_file_loads.py:1130
apache_beam/io/gcp/bigquery_file_loads.py:1130
apache_beam/io/gcp/bigquery_file_loads.py:1130
apache_beam/io/gcp/bigquery_file_loads.py:1130
apache_beam/io/gcp/bigquery_file_loads.py:1130
apache_beam/io/gcp/bigquery_file_loads.py:1130
apache_beam/io/gcp/bigquery_file_loads.py:1130
apache_beam/io/gcp/bigquery_file_loads.py:1130
apache_beam/io/gcp/bigquery_file_loads.py:1130
apache_beam/io/gcp/bigquery_file_loads.py:1130
  <https://ci-beam.apache.org/job/beam_PostCommit_Python37/ws/src/sdks/python/apache_beam/io/gcp/bigquery_file_loads.py>:1130: BeamDeprecationWarning: options is deprecated since First stable release. References to <pipeline>.options will not be supported
    p.options.view_as(GoogleCloudOptions).job_name or 'AUTOMATIC_JOB_NAME')

apache_beam/io/gcp/tests/utils.py:100
  <https://ci-beam.apache.org/job/beam_PostCommit_Python37/ws/src/sdks/python/apache_beam/io/gcp/tests/utils.py>:100: PendingDeprecationWarning: Client.dataset is deprecated and will be removed in a future version. Use a string like 'my_project.my_dataset' or a cloud.google.bigquery.DatasetReference object, instead.
    table_ref = client.dataset(dataset_id).table(table_id)

apache_beam/examples/dataframe/flight_delays.py:47
  <https://ci-beam.apache.org/job/beam_PostCommit_Python37/ws/src/sdks/python/apache_beam/examples/dataframe/flight_delays.py>:47: FutureWarning: Dropping of nuisance columns in DataFrame reductions (with 'numeric_only=None') is deprecated; in a future version this will raise TypeError.  Select only valid columns before calling the reduction.
    return airline_df[at_top_airports].mean()

apache_beam/dataframe/io.py:632
apache_beam/dataframe/io.py:632
apache_beam/dataframe/io.py:632
  <https://ci-beam.apache.org/job/beam_PostCommit_Python37/ws/src/sdks/python/apache_beam/dataframe/io.py>:632: FutureWarning: WriteToFiles is experimental.
    sink=lambda _: _WriteToPandasFileSink(

apache_beam/io/fileio.py:550
apache_beam/io/fileio.py:550
apache_beam/io/fileio.py:550
  <https://ci-beam.apache.org/job/beam_PostCommit_Python37/ws/src/sdks/python/apache_beam/io/fileio.py>:550: BeamDeprecationWarning: options is deprecated since First stable release. References to <pipeline>.options will not be supported
    p.options.view_as(GoogleCloudOptions).temp_location or

apache_beam/io/gcp/bigquery_test.py:1183
  <https://ci-beam.apache.org/job/beam_PostCommit_Python37/ws/src/sdks/python/apache_beam/io/gcp/bigquery_test.py>:1183: BeamDeprecationWarning: options is deprecated since First stable release. References to <pipeline>.options will not be supported
    streaming = self.test_pipeline.options.view_as(StandardOptions).streaming

apache_beam/io/gcp/bigquery_read_it_test.py:169
  <https://ci-beam.apache.org/job/beam_PostCommit_Python37/ws/src/sdks/python/apache_beam/io/gcp/bigquery_read_it_test.py>:169: BeamDeprecationWarning: BigQuerySource is deprecated since 2.25.0. Use ReadFromBigQuery instead.
    beam.io.BigQuerySource(query=self.query, use_standard_sql=True)))

apache_beam/io/gcp/big_query_query_to_table_pipeline.py:84
apache_beam/io/gcp/big_query_query_to_table_pipeline.py:84
  <https://ci-beam.apache.org/job/beam_PostCommit_Python37/ws/src/sdks/python/apache_beam/io/gcp/big_query_query_to_table_pipeline.py>:84: BeamDeprecationWarning: BigQuerySource is deprecated since 2.25.0. Use ReadFromBigQuery instead.
    kms_key=kms_key))

apache_beam/runners/dataflow/ptransform_overrides.py:323
apache_beam/runners/dataflow/ptransform_overrides.py:323
  <https://ci-beam.apache.org/job/beam_PostCommit_Python37/ws/src/sdks/python/apache_beam/runners/dataflow/ptransform_overrides.py>:323: BeamDeprecationWarning: BigQuerySink is deprecated since 2.11.0. Use WriteToBigQuery instead.
    kms_key=self.kms_key))

apache_beam/io/gcp/bigquery_read_it_test.py:558
  <https://ci-beam.apache.org/job/beam_PostCommit_Python37/ws/src/sdks/python/apache_beam/io/gcp/bigquery_read_it_test.py>:558: BeamDeprecationWarning: BigQuerySource is deprecated since 2.25.0. Use ReadFromBigQuery instead.
    beam.io.BigQuerySource(query=self.query, use_standard_sql=True)))

apache_beam/io/gcp/bigquery_read_it_test.py:672
  <https://ci-beam.apache.org/job/beam_PostCommit_Python37/ws/src/sdks/python/apache_beam/io/gcp/bigquery_read_it_test.py>:672: FutureWarning: ReadAllFromBigQuery is experimental.
    | beam.io.ReadAllFromBigQuery())

apache_beam/io/gcp/bigquery.py:2626
  <https://ci-beam.apache.org/job/beam_PostCommit_Python37/ws/src/sdks/python/apache_beam/io/gcp/bigquery.py>:2626: BeamDeprecationWarning: options is deprecated since First stable release. References to <pipeline>.options will not be supported
    job_name = pcoll.pipeline.options.view_as(GoogleCloudOptions).job_name

apache_beam/io/gcp/bigquery.py:2627
  <https://ci-beam.apache.org/job/beam_PostCommit_Python37/ws/src/sdks/python/apache_beam/io/gcp/bigquery.py>:2627: BeamDeprecationWarning: options is deprecated since First stable release. References to <pipeline>.options will not be supported
    project = pcoll.pipeline.options.view_as(GoogleCloudOptions).project

apache_beam/io/gcp/bigquery.py:2640
  <https://ci-beam.apache.org/job/beam_PostCommit_Python37/ws/src/sdks/python/apache_beam/io/gcp/bigquery.py>:2640: BeamDeprecationWarning: options is deprecated since First stable release. References to <pipeline>.options will not be supported
    options=pcoll.pipeline.options,

apache_beam/runners/interactive/interactive_environment.py:399
  <https://ci-beam.apache.org/job/beam_PostCommit_Python37/ws/src/sdks/python/apache_beam/runners/interactive/interactive_environment.py>:399: BeamDeprecationWarning: options is deprecated since First stable release. References to <pipeline>.options will not be supported
    staging_location = pipeline.options.get_all_options(

apache_beam/runners/interactive/recording_manager.py:410
  <https://ci-beam.apache.org/job/beam_PostCommit_Python37/ws/src/sdks/python/apache_beam/runners/interactive/recording_manager.py>:410: BeamDeprecationWarning: options is deprecated since First stable release. References to <pipeline>.options will not be supported
    options=self.user_pipeline.options,

apache_beam/ml/gcp/cloud_dlp_it_test.py:77
  <https://ci-beam.apache.org/job/beam_PostCommit_Python37/ws/src/sdks/python/apache_beam/ml/gcp/cloud_dlp_it_test.py>:77: FutureWarning: MaskDetectedDetails is experimental.
    inspection_config=INSPECT_CONFIG))

apache_beam/ml/gcp/cloud_dlp_it_test.py:87
  <https://ci-beam.apache.org/job/beam_PostCommit_Python37/ws/src/sdks/python/apache_beam/ml/gcp/cloud_dlp_it_test.py>:87: FutureWarning: InspectForDetails is experimental.
    | beam.ParDo(extract_inspection_results).with_outputs(

-- Docs: https://docs.pytest.org/en/latest/warnings.html
- generated xml file: <https://ci-beam.apache.org/job/beam_PostCommit_Python37/ws/src/sdks/python/pytest_postCommitIT-df-py37.xml> -
======= 1 failed, 61 passed, 8 skipped, 183 warnings in 5645.43 seconds ========

> Task :sdks:python:test-suites:dataflow:py37:postCommitIT FAILED

> Task :sdks:python:test-suites:dataflow:py37:spannerioIT
>>> RUNNING integration tests with pipeline options: --runner=TestDataflowRunner --project=apache-beam-testing --region=us-central1 --staging_location=gs://temp-storage-for-end-to-end-tests/staging-it --temp_location=gs://temp-storage-for-end-to-end-tests/temp-it --output=gs://temp-storage-for-end-to-end-tests/py-it-cloud/output --sdk_location=<https://ci-beam.apache.org/job/beam_PostCommit_Python37/ws/src/sdks/python/build/apache-beam.tar.gz> --requirements_file=postcommit_requirements.txt --num_workers=1 --sleep_secs=20 --dataflow_worker_jar=<https://ci-beam.apache.org/job/beam_PostCommit_Python37/ws/src/runners/google-cloud-dataflow-java/worker/build/libs/beam-runners-google-cloud-dataflow-java-fn-api-worker-2.39.0-SNAPSHOT.jar> --kms_key_name=projects/apache-beam-testing/locations/global/keyRings/beam-it/cryptoKeys/test --dataflow_kms_key=projects/apache-beam-testing/locations/global/keyRings/beam-it/cryptoKeys/test
>>>   pytest options: --capture=no --timeout=4500 --color=yes --log-cli-level=INFO --numprocesses=8 --dist=loadfile
>>>   collect markers: -m=spannerio_it
============================= test session starts ==============================
platform linux -- Python 3.7.12, pytest-4.6.11, py-1.11.0, pluggy-0.13.1
rootdir: <https://ci-beam.apache.org/job/beam_PostCommit_Python37/ws/src/sdks/python,> inifile: pytest.ini
plugins: xdist-1.34.0, timeout-1.4.2, forked-1.4.0, requests-mock-1.9.3
timeout: 4500.0s
timeout method: signal
timeout func_only: False
gw0 I / gw1 I / gw2 I / gw3 I / gw4 I / gw5 I / gw6 I / gw7 I
[gw1] Python 3.7.12 (default, Jan 15 2022, 18:42:10)  -- [GCC 9.3.0]
[gw2] Python 3.7.12 (default, Jan 15 2022, 18:42:10)  -- [GCC 9.3.0]
[gw3] Python 3.7.12 (default, Jan 15 2022, 18:42:10)  -- [GCC 9.3.0]
[gw0] Python 3.7.12 (default, Jan 15 2022, 18:42:10)  -- [GCC 9.3.0]
[gw6] Python 3.7.12 (default, Jan 15 2022, 18:42:10)  -- [GCC 9.3.0]
[gw4] Python 3.7.12 (default, Jan 15 2022, 18:42:10)  -- [GCC 9.3.0]
[gw7] Python 3.7.12 (default, Jan 15 2022, 18:42:10)  -- [GCC 9.3.0]
[gw5] Python 3.7.12 (default, Jan 15 2022, 18:42:10)  -- [GCC 9.3.0]
gw0 [15] / gw1 [15] / gw2 [15] / gw3 [15] / gw4 [15] / gw5 [15] / gw6 [15] / gw7 [15]

scheduling tests via LoadFileScheduling

apache_beam/io/gcp/experimental/spannerio_write_it_test.py::SpannerWriteIntegrationTest::test_metrics_error_call 
apache_beam/io/gcp/experimental/spannerio_read_it_test.py::SpannerReadIntegrationTest::test_read_via_sql 
[gw2] SKIPPED apache_beam/io/gcp/experimental/spannerio_write_it_test.py::SpannerWriteIntegrationTest::test_metrics_error_call 
apache_beam/io/gcp/experimental/spannerio_write_it_test.py::SpannerWriteIntegrationTest::test_metrics_ok_call 
[gw2] SKIPPED apache_beam/io/gcp/experimental/spannerio_write_it_test.py::SpannerWriteIntegrationTest::test_metrics_ok_call 
apache_beam/io/gcp/experimental/spannerio_write_it_test.py::SpannerWriteIntegrationTest::test_spanner_error E0420 19:40:19.963774919 1656544 fork_posix.cc:70]           Fork support is only compatible with the epoll1 and poll polling strategies
E0420 19:40:20.264233465 1656539 fork_posix.cc:70]           Fork support is only compatible with the epoll1 and poll polling strategies

[gw1] PASSED apache_beam/io/gcp/experimental/spannerio_read_it_test.py::SpannerReadIntegrationTest::test_read_via_sql 
apache_beam/io/gcp/experimental/spannerio_read_it_test.py::SpannerReadIntegrationTest::test_read_via_table E0420 19:47:01.320786363 1656539 fork_posix.cc:70]           Fork support is only compatible with the epoll1 and poll polling strategies

[gw2] PASSED apache_beam/io/gcp/experimental/spannerio_write_it_test.py::SpannerWriteIntegrationTest::test_spanner_error 
apache_beam/io/gcp/experimental/spannerio_write_it_test.py::SpannerWriteIntegrationTest::test_spanner_update E0420 19:47:47.516434377 1656544 fork_posix.cc:70]           Fork support is only compatible with the epoll1 and poll polling strategies

[gw1] PASSED apache_beam/io/gcp/experimental/spannerio_read_it_test.py::SpannerReadIntegrationTest::test_read_via_table 
apache_beam/io/gcp/experimental/spannerio_read_it_test.py::SpannerReadIntegrationTest::test_sql_metrics_error_call 
[gw1] SKIPPED apache_beam/io/gcp/experimental/spannerio_read_it_test.py::SpannerReadIntegrationTest::test_sql_metrics_error_call 
apache_beam/io/gcp/experimental/spannerio_read_it_test.py::SpannerReadIntegrationTest::test_sql_metrics_ok_call 
[gw1] SKIPPED apache_beam/io/gcp/experimental/spannerio_read_it_test.py::SpannerReadIntegrationTest::test_sql_metrics_ok_call 
apache_beam/io/gcp/experimental/spannerio_read_it_test.py::SpannerReadIntegrationTest::test_table_metrics_error_call 
[gw1] SKIPPED apache_beam/io/gcp/experimental/spannerio_read_it_test.py::SpannerReadIntegrationTest::test_table_metrics_error_call 
apache_beam/io/gcp/experimental/spannerio_read_it_test.py::SpannerReadIntegrationTest::test_table_metrics_ok_call 
[gw1] SKIPPED apache_beam/io/gcp/experimental/spannerio_read_it_test.py::SpannerReadIntegrationTest::test_table_metrics_ok_call 
apache_beam/io/gcp/experimental/spannerio_read_it_test.py::SpannerReadIntegrationTest::test_transaction_sql_metrics_error_call 
[gw1] SKIPPED apache_beam/io/gcp/experimental/spannerio_read_it_test.py::SpannerReadIntegrationTest::test_transaction_sql_metrics_error_call 
apache_beam/io/gcp/experimental/spannerio_read_it_test.py::SpannerReadIntegrationTest::test_transaction_sql_metrics_ok_call 
[gw1] SKIPPED apache_beam/io/gcp/experimental/spannerio_read_it_test.py::SpannerReadIntegrationTest::test_transaction_sql_metrics_ok_call 
apache_beam/io/gcp/experimental/spannerio_read_it_test.py::SpannerReadIntegrationTest::test_transaction_table_metrics_error_call 
[gw1] SKIPPED apache_beam/io/gcp/experimental/spannerio_read_it_test.py::SpannerReadIntegrationTest::test_transaction_table_metrics_error_call 
apache_beam/io/gcp/experimental/spannerio_read_it_test.py::SpannerReadIntegrationTest::test_transaction_table_metrics_ok_call 
[gw1] SKIPPED apache_beam/io/gcp/experimental/spannerio_read_it_test.py::SpannerReadIntegrationTest::test_transaction_table_metrics_ok_call 
[gw2] PASSED apache_beam/io/gcp/experimental/spannerio_write_it_test.py::SpannerWriteIntegrationTest::test_spanner_update 
apache_beam/io/gcp/experimental/spannerio_write_it_test.py::SpannerWriteIntegrationTest::test_write_batches E0420 19:54:30.301327730 1656544 fork_posix.cc:70]           Fork support is only compatible with the epoll1 and poll polling strategies

[gw2] PASSED apache_beam/io/gcp/experimental/spannerio_write_it_test.py::SpannerWriteIntegrationTest::test_write_batches 

=============================== warnings summary ===============================
apache_beam/io/gcp/experimental/spannerio_read_it_test.py:128
  <https://ci-beam.apache.org/job/beam_PostCommit_Python37/ws/src/sdks/python/apache_beam/io/gcp/experimental/spannerio_read_it_test.py>:128: FutureWarning: ReadFromSpanner is experimental. No backwards-compatibility guarantees.
    sql="select * from Users")

apache_beam/io/gcp/experimental/spannerio_write_it_test.py:190
  <https://ci-beam.apache.org/job/beam_PostCommit_Python37/ws/src/sdks/python/apache_beam/io/gcp/experimental/spannerio_write_it_test.py>:190: FutureWarning: WriteToSpanner is experimental. No backwards-compatibility guarantees.
    database_id=self.TEST_DATABASE))

apache_beam/io/gcp/experimental/spannerio_read_it_test.py:117
  <https://ci-beam.apache.org/job/beam_PostCommit_Python37/ws/src/sdks/python/apache_beam/io/gcp/experimental/spannerio_read_it_test.py>:117: FutureWarning: ReadFromSpanner is experimental. No backwards-compatibility guarantees.
    columns=["UserId", "Key"])

apache_beam/io/gcp/experimental/spannerio_write_it_test.py:171
  <https://ci-beam.apache.org/job/beam_PostCommit_Python37/ws/src/sdks/python/apache_beam/io/gcp/experimental/spannerio_write_it_test.py>:171: FutureWarning: WriteToSpanner is experimental. No backwards-compatibility guarantees.
    database_id=self.TEST_DATABASE))

apache_beam/io/gcp/experimental/spannerio_write_it_test.py:135
  <https://ci-beam.apache.org/job/beam_PostCommit_Python37/ws/src/sdks/python/apache_beam/io/gcp/experimental/spannerio_write_it_test.py>:135: FutureWarning: WriteToSpanner is experimental. No backwards-compatibility guarantees.
    max_batch_size_bytes=250))

-- Docs: https://docs.pytest.org/en/latest/warnings.html
- generated xml file: <https://ci-beam.apache.org/job/beam_PostCommit_Python37/ws/src/sdks/python/pytest_postCommitIT-df-py37.xml> -
============= 5 passed, 10 skipped, 5 warnings in 1296.13 seconds ==============

FAILURE: Build failed with an exception.

* Where:
Script '<https://ci-beam.apache.org/job/beam_PostCommit_Python37/ws/src/sdks/python/test-suites/dataflow/common.gradle'> line: 121

* What went wrong:
Execution failed for task ':sdks:python:test-suites:dataflow:py37:postCommitIT'.
> Process 'command 'sh'' finished with non-zero exit value 1

* Try:
> Run with --stacktrace option to get the stack trace.
> Run with --info or --debug option to get more log output.
> Run with --scan to get full insights.

* Get more help at https://help.gradle.org

Deprecated Gradle features were used in this build, making it incompatible with Gradle 8.0.

You can use '--warning-mode all' to show the individual deprecation warnings and determine if they come from your own scripts or plugins.

See https://docs.gradle.org/7.4/userguide/command_line_interface.html#sec:command_line_warnings

Execution optimizations have been disabled for 1 invalid unit(s) of work during this build to ensure correctness.
Please consult deprecation warnings for more details.

BUILD FAILED in 2h 57s
225 actionable tasks: 155 executed, 64 from cache, 6 up-to-date

Publishing build scan...
https://gradle.com/s/ziephwtqggzao

Build step 'Invoke Gradle script' changed build result to FAILURE
Build step 'Invoke Gradle script' marked build as failure

---------------------------------------------------------------------
To unsubscribe, e-mail: builds-unsubscribe@beam.apache.org
For additional commands, e-mail: builds-help@beam.apache.org


Build failed in Jenkins: beam_PostCommit_Python37 #5130

Posted by Apache Jenkins Server <je...@builds.apache.org>.
See <https://ci-beam.apache.org/job/beam_PostCommit_Python37/5130/display/redirect>

Changes:


------------------------------------------
[...truncated 23.94 MB...]

Exception in thread read_state:
Traceback (most recent call last):
  File "/usr/lib/python3.7/threading.py", line 926, in _bootstrap_inner
    self.run()
  File "/usr/lib/python3.7/threading.py", line 870, in run
    self._target(*self._args, **self._kwargs)
  File "<https://ci-beam.apache.org/job/beam_PostCommit_Python37/ws/src/sdks/python/apache_beam/runners/worker/sdk_worker.py",> line 990, in pull_responses
    for response in responses:
  File "<https://ci-beam.apache.org/job/beam_PostCommit_Python37/ws/src/build/gradleenv/2022703441/lib/python3.7/site-packages/grpc/_channel.py",> line 426, in __next__
    return self._next()
  File "<https://ci-beam.apache.org/job/beam_PostCommit_Python37/ws/src/build/gradleenv/2022703441/lib/python3.7/site-packages/grpc/_channel.py",> line 826, in _next
    raise self
grpc._channel._MultiThreadedRendezvous: <_MultiThreadedRendezvous of RPC that terminated with:
	status = StatusCode.UNAVAILABLE
	details = "Socket closed"
	debug_error_string = "{"created":"@1650461635.164034449","description":"Error received from peer ipv6:[::1]:34185","file":"src/core/lib/surface/call.cc","file_line":903,"grpc_message":"Socket closed","grpc_status":14}"
>

Exception in thread run_worker_1-1:
Traceback (most recent call last):
  File "/usr/lib/python3.7/threading.py", line 926, in _bootstrap_inner
    self.run()
  File "/usr/lib/python3.7/threading.py", line 870, in run
    self._target(*self._args, **self._kwargs)
  File "<https://ci-beam.apache.org/job/beam_PostCommit_Python37/ws/src/sdks/python/apache_beam/runners/worker/sdk_worker.py",> line 234, in run
    for work_request in self._control_stub.Control(get_responses()):
  File "<https://ci-beam.apache.org/job/beam_PostCommit_Python37/ws/src/build/gradleenv/2022703441/lib/python3.7/site-packages/grpc/_channel.py",> line 426, in __next__
    return self._next()
  File "<https://ci-beam.apache.org/job/beam_PostCommit_Python37/ws/src/build/gradleenv/2022703441/lib/python3.7/site-packages/grpc/_channel.py",> line 826, in _next
    raise self
grpc._channel._MultiThreadedRendezvous: <_MultiThreadedRendezvous of RPC that terminated with:
	status = StatusCode.UNAVAILABLE
	details = "Socket closed"
	debug_error_string = "{"created":"@1650461635.164021667","description":"Error received from peer ipv6:[::1]:37569","file":"src/core/lib/surface/call.cc","file_line":903,"grpc_message":"Socket closed","grpc_status":14}"
>


> Task :sdks:python:test-suites:portable:py37:postCommitPy37
> Task :sdks:python:test-suites:portable:py37:xlangSpannerIOIT

> Task :sdks:python:test-suites:dataflow:py37:postCommitIT
E0420 13:34:29.072593498  945299 fork_posix.cc:70]           Fork support is only compatible with the epoll1 and poll polling strategies

> Task :sdks:python:test-suites:portable:py37:xlangSpannerIOIT
E0420 13:36:12.700353602  972175 fork_posix.cc:70]           Fork support is only compatible with the epoll1 and poll polling strategies

> Task :sdks:python:test-suites:dataflow:py37:postCommitIT
E0420 13:37:56.467129472  945238 fork_posix.cc:70]           Fork support is only compatible with the epoll1 and poll polling strategies

> Task :sdks:python:test-suites:portable:py37:xlangSpannerIOIT
Exception in thread read_grpc_client_inputs:
Traceback (most recent call last):
  File "/usr/lib/python3.7/threading.py", line 926, in _bootstrap_inner
    self.run()
  File "/usr/lib/python3.7/threading.py", line 870, in run
    self._target(*self._args, **self._kwargs)
  File "<https://ci-beam.apache.org/job/beam_PostCommit_Python37/ws/src/sdks/python/apache_beam/runners/worker/data_plane.py",> line 651, in <lambda>
    target=lambda: self._read_inputs(elements_iterator),
  File "<https://ci-beam.apache.org/job/beam_PostCommit_Python37/ws/src/sdks/python/apache_beam/runners/worker/data_plane.py",> line 634, in _read_inputs
    for elements in elements_iterator:
  File "<https://ci-beam.apache.org/job/beam_PostCommit_Python37/ws/src/build/gradleenv/2022703441/lib/python3.7/site-packages/grpc/_channel.py",> line 426, in __next__
    return self._next()
  File "<https://ci-beam.apache.org/job/beam_PostCommit_Python37/ws/src/build/gradleenv/2022703441/lib/python3.7/site-packages/grpc/_channel.py",> line 826, in _next
    raise self
grpc._channel._MultiThreadedRendezvous: <_MultiThreadedRendezvous of RPC that terminated with:
	status = StatusCode.CANCELLED
	details = "Multiplexer hanging up"
	debug_error_string = "{"created":"@1650461678.654064130","description":"Error received from peer ipv6:[::1]:45675","file":"src/core/lib/surface/call.cc","file_line":903,"grpc_message":"Multiplexer hanging up","grpc_status":1}"
>

Exception in thread read_grpc_client_inputs:
Traceback (most recent call last):
  File "/usr/lib/python3.7/threading.py", line 926, in _bootstrap_inner
    self.run()
  File "/usr/lib/python3.7/threading.py", line 870, in run
    self._target(*self._args, **self._kwargs)
  File "<https://ci-beam.apache.org/job/beam_PostCommit_Python37/ws/src/sdks/python/apache_beam/runners/worker/data_plane.py",> line 651, in <lambda>
    target=lambda: self._read_inputs(elements_iterator),
  File "<https://ci-beam.apache.org/job/beam_PostCommit_Python37/ws/src/sdks/python/apache_beam/runners/worker/data_plane.py",> line 634, in _read_inputs
    for elements in elements_iterator:
  File "<https://ci-beam.apache.org/job/beam_PostCommit_Python37/ws/src/build/gradleenv/2022703441/lib/python3.7/site-packages/grpc/_channel.py",> line 426, in __next__
    return self._next()
  File "<https://ci-beam.apache.org/job/beam_PostCommit_Python37/ws/src/build/gradleenv/2022703441/lib/python3.7/site-packages/grpc/_channel.py",> line 826, in _next
    raise self
grpc._channel._MultiThreadedRendezvous: <_MultiThreadedRendezvous of RPC that terminated with:
	status = StatusCode.CANCELLED
	details = "Multiplexer hanging up"
	debug_error_string = "{"created":"@1650461772.411145745","description":"Error received from peer ipv6:[::1]:39047","file":"src/core/lib/surface/call.cc","file_line":903,"grpc_message":"Multiplexer hanging up","grpc_status":1}"
>

Exception in thread read_grpc_client_inputs:
Traceback (most recent call last):
  File "/usr/lib/python3.7/threading.py", line 926, in _bootstrap_inner
    self.run()
  File "/usr/lib/python3.7/threading.py", line 870, in run
    self._target(*self._args, **self._kwargs)
  File "<https://ci-beam.apache.org/job/beam_PostCommit_Python37/ws/src/sdks/python/apache_beam/runners/worker/data_plane.py",> line 651, in <lambda>
    target=lambda: self._read_inputs(elements_iterator),
  File "<https://ci-beam.apache.org/job/beam_PostCommit_Python37/ws/src/sdks/python/apache_beam/runners/worker/data_plane.py",> line 634, in _read_inputs
    for elements in elements_iterator:
  File "<https://ci-beam.apache.org/job/beam_PostCommit_Python37/ws/src/build/gradleenv/2022703441/lib/python3.7/site-packages/grpc/_channel.py",> line 426, in __next__
    return self._next()
  File "<https://ci-beam.apache.org/job/beam_PostCommit_Python37/ws/src/build/gradleenv/2022703441/lib/python3.7/site-packages/grpc/_channel.py",> line 826, in _next
    raise self
grpc._channel._MultiThreadedRendezvous: <_MultiThreadedRendezvous of RPC that terminated with:
	status = StatusCode.CANCELLED
	details = "Multiplexer hanging up"
	debug_error_string = "{"created":"@1650461877.066142282","description":"Error received from peer ipv6:[::1]:41415","file":"src/core/lib/surface/call.cc","file_line":903,"grpc_message":"Multiplexer hanging up","grpc_status":1}"
>


> Task :sdks:python:test-suites:dataflow:py37:postCommitIT
E0420 13:41:07.613452230  945299 fork_posix.cc:70]           Fork support is only compatible with the epoll1 and poll polling strategies
E0420 13:45:09.996159535  945238 fork_posix.cc:70]           Fork support is only compatible with the epoll1 and poll polling strategies
E0420 13:54:29.643868662  945238 fork_posix.cc:70]           Fork support is only compatible with the epoll1 and poll polling strategies
E0420 13:58:49.812559022  945232 fork_posix.cc:70]           Fork support is only compatible with the epoll1 and poll polling strategies
E0420 14:03:14.981691587  945238 fork_posix.cc:70]           Fork support is only compatible with the epoll1 and poll polling strategies
E0420 14:10:57.095361721  945238 fork_posix.cc:70]           Fork support is only compatible with the epoll1 and poll polling strategies
E0420 14:16:05.379386075  945232 fork_posix.cc:70]           Fork support is only compatible with the epoll1 and poll polling strategies
E0420 14:17:45.036959562  945238 fork_posix.cc:70]           Fork support is only compatible with the epoll1 and poll polling strategies
E0420 14:24:39.335157218  945238 fork_posix.cc:70]           Fork support is only compatible with the epoll1 and poll polling strategies
E0420 14:30:50.209716667  945278 fork_posix.cc:70]           Fork support is only compatible with the epoll1 and poll polling strategies
E0420 14:31:01.845491781  945238 fork_posix.cc:70]           Fork support is only compatible with the epoll1 and poll polling strategies
E0420 14:32:46.903682246  945232 fork_posix.cc:70]           Fork support is only compatible with the epoll1 and poll polling strategies
E0420 14:38:49.656276334  945238 fork_posix.cc:70]           Fork support is only compatible with the epoll1 and poll polling strategies
E0420 14:41:04.152822042  945278 fork_posix.cc:70]           Fork support is only compatible with the epoll1 and poll polling strategies
E0420 14:46:02.513383234  945238 fork_posix.cc:70]           Fork support is only compatible with the epoll1 and poll polling strategies

> Task :sdks:python:test-suites:dataflow:py37:postCommitIT FAILED

> Task :sdks:python:test-suites:dataflow:py37:spannerioIT
>>> RUNNING integration tests with pipeline options: --runner=TestDataflowRunner --project=apache-beam-testing --region=us-central1 --staging_location=gs://temp-storage-for-end-to-end-tests/staging-it --temp_location=gs://temp-storage-for-end-to-end-tests/temp-it --output=gs://temp-storage-for-end-to-end-tests/py-it-cloud/output --sdk_location=<https://ci-beam.apache.org/job/beam_PostCommit_Python37/ws/src/sdks/python/build/apache-beam.tar.gz> --requirements_file=postcommit_requirements.txt --num_workers=1 --sleep_secs=20 --dataflow_worker_jar=<https://ci-beam.apache.org/job/beam_PostCommit_Python37/ws/src/runners/google-cloud-dataflow-java/worker/build/libs/beam-runners-google-cloud-dataflow-java-fn-api-worker-2.39.0-SNAPSHOT.jar> --kms_key_name=projects/apache-beam-testing/locations/global/keyRings/beam-it/cryptoKeys/test --dataflow_kms_key=projects/apache-beam-testing/locations/global/keyRings/beam-it/cryptoKeys/test
>>>   pytest options: --capture=no --timeout=4500 --color=yes --log-cli-level=INFO --numprocesses=8 --dist=loadfile
>>>   collect markers: -m=spannerio_it
============================= test session starts ==============================
platform linux -- Python 3.7.12, pytest-4.6.11, py-1.11.0, pluggy-0.13.1
rootdir: <https://ci-beam.apache.org/job/beam_PostCommit_Python37/ws/src/sdks/python,> inifile: pytest.ini
plugins: xdist-1.34.0, timeout-1.4.2, forked-1.4.0, requests-mock-1.9.3
timeout: 4500.0s
timeout method: signal
timeout func_only: False
gw0 I / gw1 I / gw2 I / gw3 I / gw4 I / gw5 I / gw6 I / gw7 I
[gw0] Python 3.7.12 (default, Jan 15 2022, 18:42:10)  -- [GCC 9.3.0]
[gw1] Python 3.7.12 (default, Jan 15 2022, 18:42:10)  -- [GCC 9.3.0]
[gw2] Python 3.7.12 (default, Jan 15 2022, 18:42:10)  -- [GCC 9.3.0]
[gw3] Python 3.7.12 (default, Jan 15 2022, 18:42:10)  -- [GCC 9.3.0]
[gw4] Python 3.7.12 (default, Jan 15 2022, 18:42:10)  -- [GCC 9.3.0]
[gw5] Python 3.7.12 (default, Jan 15 2022, 18:42:10)  -- [GCC 9.3.0]
[gw6] Python 3.7.12 (default, Jan 15 2022, 18:42:10)  -- [GCC 9.3.0]
[gw7] Python 3.7.12 (default, Jan 15 2022, 18:42:10)  -- [GCC 9.3.0]
gw0 [15] / gw1 [15] / gw2 [15] / gw3 [15] / gw4 [15] / gw5 [15] / gw6 [15] / gw7 [15]

scheduling tests via LoadFileScheduling

apache_beam/io/gcp/experimental/spannerio_read_it_test.py::SpannerReadIntegrationTest::test_read_via_sql 
apache_beam/io/gcp/experimental/spannerio_write_it_test.py::SpannerWriteIntegrationTest::test_metrics_error_call 
[gw1] SKIPPED apache_beam/io/gcp/experimental/spannerio_write_it_test.py::SpannerWriteIntegrationTest::test_metrics_error_call 
apache_beam/io/gcp/experimental/spannerio_write_it_test.py::SpannerWriteIntegrationTest::test_metrics_ok_call 
[gw1] SKIPPED apache_beam/io/gcp/experimental/spannerio_write_it_test.py::SpannerWriteIntegrationTest::test_metrics_ok_call 
apache_beam/io/gcp/experimental/spannerio_write_it_test.py::SpannerWriteIntegrationTest::test_spanner_error E0420 14:53:52.634053095 1000919 fork_posix.cc:70]           Fork support is only compatible with the epoll1 and poll polling strategies
E0420 14:53:54.053757862 1000916 fork_posix.cc:70]           Fork support is only compatible with the epoll1 and poll polling strategies

[gw1] PASSED apache_beam/io/gcp/experimental/spannerio_write_it_test.py::SpannerWriteIntegrationTest::test_spanner_error 
apache_beam/io/gcp/experimental/spannerio_write_it_test.py::SpannerWriteIntegrationTest::test_spanner_update E0420 15:00:01.841459228 1000919 fork_posix.cc:70]           Fork support is only compatible with the epoll1 and poll polling strategies

[gw0] PASSED apache_beam/io/gcp/experimental/spannerio_read_it_test.py::SpannerReadIntegrationTest::test_read_via_sql 
apache_beam/io/gcp/experimental/spannerio_read_it_test.py::SpannerReadIntegrationTest::test_read_via_table E0420 15:00:42.453813456 1000916 fork_posix.cc:70]           Fork support is only compatible with the epoll1 and poll polling strategies

[gw1] PASSED apache_beam/io/gcp/experimental/spannerio_write_it_test.py::SpannerWriteIntegrationTest::test_spanner_update 
apache_beam/io/gcp/experimental/spannerio_write_it_test.py::SpannerWriteIntegrationTest::test_write_batches E0420 15:06:54.447860867 1000919 fork_posix.cc:70]           Fork support is only compatible with the epoll1 and poll polling strategies

[gw0] PASSED apache_beam/io/gcp/experimental/spannerio_read_it_test.py::SpannerReadIntegrationTest::test_read_via_table 
apache_beam/io/gcp/experimental/spannerio_read_it_test.py::SpannerReadIntegrationTest::test_sql_metrics_error_call 
[gw0] SKIPPED apache_beam/io/gcp/experimental/spannerio_read_it_test.py::SpannerReadIntegrationTest::test_sql_metrics_error_call 
apache_beam/io/gcp/experimental/spannerio_read_it_test.py::SpannerReadIntegrationTest::test_sql_metrics_ok_call 
[gw0] SKIPPED apache_beam/io/gcp/experimental/spannerio_read_it_test.py::SpannerReadIntegrationTest::test_sql_metrics_ok_call 
apache_beam/io/gcp/experimental/spannerio_read_it_test.py::SpannerReadIntegrationTest::test_table_metrics_error_call 
[gw0] SKIPPED apache_beam/io/gcp/experimental/spannerio_read_it_test.py::SpannerReadIntegrationTest::test_table_metrics_error_call 
apache_beam/io/gcp/experimental/spannerio_read_it_test.py::SpannerReadIntegrationTest::test_table_metrics_ok_call 
[gw0] SKIPPED apache_beam/io/gcp/experimental/spannerio_read_it_test.py::SpannerReadIntegrationTest::test_table_metrics_ok_call 
apache_beam/io/gcp/experimental/spannerio_read_it_test.py::SpannerReadIntegrationTest::test_transaction_sql_metrics_error_call 
[gw0] SKIPPED apache_beam/io/gcp/experimental/spannerio_read_it_test.py::SpannerReadIntegrationTest::test_transaction_sql_metrics_error_call 
apache_beam/io/gcp/experimental/spannerio_read_it_test.py::SpannerReadIntegrationTest::test_transaction_sql_metrics_ok_call 
[gw0] SKIPPED apache_beam/io/gcp/experimental/spannerio_read_it_test.py::SpannerReadIntegrationTest::test_transaction_sql_metrics_ok_call 
apache_beam/io/gcp/experimental/spannerio_read_it_test.py::SpannerReadIntegrationTest::test_transaction_table_metrics_error_call 
[gw0] SKIPPED apache_beam/io/gcp/experimental/spannerio_read_it_test.py::SpannerReadIntegrationTest::test_transaction_table_metrics_error_call 
apache_beam/io/gcp/experimental/spannerio_read_it_test.py::SpannerReadIntegrationTest::test_transaction_table_metrics_ok_call 
[gw0] SKIPPED apache_beam/io/gcp/experimental/spannerio_read_it_test.py::SpannerReadIntegrationTest::test_transaction_table_metrics_ok_call 
[gw1] PASSED apache_beam/io/gcp/experimental/spannerio_write_it_test.py::SpannerWriteIntegrationTest::test_write_batches 

=============================== warnings summary ===============================
apache_beam/io/gcp/experimental/spannerio_write_it_test.py:190
  <https://ci-beam.apache.org/job/beam_PostCommit_Python37/ws/src/sdks/python/apache_beam/io/gcp/experimental/spannerio_write_it_test.py>:190: FutureWarning: WriteToSpanner is experimental. No backwards-compatibility guarantees.
    database_id=self.TEST_DATABASE))

apache_beam/io/gcp/experimental/spannerio_read_it_test.py:128
  <https://ci-beam.apache.org/job/beam_PostCommit_Python37/ws/src/sdks/python/apache_beam/io/gcp/experimental/spannerio_read_it_test.py>:128: FutureWarning: ReadFromSpanner is experimental. No backwards-compatibility guarantees.
    sql="select * from Users")

apache_beam/io/gcp/experimental/spannerio_write_it_test.py:171
  <https://ci-beam.apache.org/job/beam_PostCommit_Python37/ws/src/sdks/python/apache_beam/io/gcp/experimental/spannerio_write_it_test.py>:171: FutureWarning: WriteToSpanner is experimental. No backwards-compatibility guarantees.
    database_id=self.TEST_DATABASE))

apache_beam/io/gcp/experimental/spannerio_read_it_test.py:117
  <https://ci-beam.apache.org/job/beam_PostCommit_Python37/ws/src/sdks/python/apache_beam/io/gcp/experimental/spannerio_read_it_test.py>:117: FutureWarning: ReadFromSpanner is experimental. No backwards-compatibility guarantees.
    columns=["UserId", "Key"])

apache_beam/io/gcp/experimental/spannerio_write_it_test.py:135
  <https://ci-beam.apache.org/job/beam_PostCommit_Python37/ws/src/sdks/python/apache_beam/io/gcp/experimental/spannerio_write_it_test.py>:135: FutureWarning: WriteToSpanner is experimental. No backwards-compatibility guarantees.
    max_batch_size_bytes=250))

-- Docs: https://docs.pytest.org/en/latest/warnings.html
- generated xml file: <https://ci-beam.apache.org/job/beam_PostCommit_Python37/ws/src/sdks/python/pytest_postCommitIT-df-py37.xml> -
============= 5 passed, 10 skipped, 5 warnings in 1396.73 seconds ==============

FAILURE: Build failed with an exception.

* Where:
Script '<https://ci-beam.apache.org/job/beam_PostCommit_Python37/ws/src/sdks/python/test-suites/dataflow/common.gradle'> line: 121

* What went wrong:
Execution failed for task ':sdks:python:test-suites:dataflow:py37:postCommitIT'.
> Process 'command 'sh'' finished with non-zero exit value 1

* Try:
> Run with --stacktrace option to get the stack trace.
> Run with --info or --debug option to get more log output.
> Run with --scan to get full insights.

* Get more help at https://help.gradle.org

Deprecated Gradle features were used in this build, making it incompatible with Gradle 8.0.

You can use '--warning-mode all' to show the individual deprecation warnings and determine if they come from your own scripts or plugins.

See https://docs.gradle.org/7.4/userguide/command_line_interface.html#sec:command_line_warnings

Execution optimizations have been disabled for 1 invalid unit(s) of work during this build to ensure correctness.
Please consult deprecation warnings for more details.

BUILD FAILED in 1h 56m 30s
224 actionable tasks: 154 executed, 64 from cache, 6 up-to-date

Publishing build scan...
https://gradle.com/s/p5tt5gq4s3utw

Build step 'Invoke Gradle script' changed build result to FAILURE
Build step 'Invoke Gradle script' marked build as failure

---------------------------------------------------------------------
To unsubscribe, e-mail: builds-unsubscribe@beam.apache.org
For additional commands, e-mail: builds-help@beam.apache.org


Build failed in Jenkins: beam_PostCommit_Python37 #5129

Posted by Apache Jenkins Server <je...@builds.apache.org>.
See <https://ci-beam.apache.org/job/beam_PostCommit_Python37/5129/display/redirect>

Changes:


------------------------------------------
[...truncated 18.03 MB...]
    for work_request in self._control_stub.Control(get_responses()):
  File "<https://ci-beam.apache.org/job/beam_PostCommit_Python37/ws/src/build/gradleenv/2022703441/lib/python3.7/site-packages/grpc/_channel.py",> line 426, in __next__
    return self._next()
  File "<https://ci-beam.apache.org/job/beam_PostCommit_Python37/ws/src/build/gradleenv/2022703441/lib/python3.7/site-packages/grpc/_channel.py",> line 826, in _next
    raise self
grpc._channel._MultiThreadedRendezvous: <_MultiThreadedRendezvous of RPC that terminated with:
	status = StatusCode.UNAVAILABLE
	details = "Socket closed"
	debug_error_string = "{"created":"@1650440625.667905073","description":"Error received from peer ipv6:[::1]:41769","file":"src/core/lib/surface/call.cc","file_line":903,"grpc_message":"Socket closed","grpc_status":14}"
>

ERROR:apache_beam.runners.worker.data_plane:Failed to read inputs in the data plane.
Traceback (most recent call last):
  File "<https://ci-beam.apache.org/job/beam_PostCommit_Python37/ws/src/sdks/python/apache_beam/runners/worker/data_plane.py",> line 634, in _read_inputs
    for elements in elements_iterator:
  File "<https://ci-beam.apache.org/job/beam_PostCommit_Python37/ws/src/build/gradleenv/2022703441/lib/python3.7/site-packages/grpc/_channel.py",> line 426, in __next__
    return self._next()
  File "<https://ci-beam.apache.org/job/beam_PostCommit_Python37/ws/src/build/gradleenv/2022703441/lib/python3.7/site-packages/grpc/_channel.py",> line 826, in _next
    raise self
grpc._channel._MultiThreadedRendezvous: <_MultiThreadedRendezvous of RPC that terminated with:
	status = StatusCode.UNAVAILABLE
	details = "Socket closed"
	debug_error_string = "{"created":"@1650440625.667801261","description":"Error received from peer ipv6:[::1]:39707","file":"src/core/lib/surface/call.cc","file_line":903,"grpc_message":"Socket closed","grpc_status":14}"
>
Exception in thread read_grpc_client_inputs:
Traceback (most recent call last):
  File "/usr/lib/python3.7/threading.py", line 926, in _bootstrap_inner
    self.run()
  File "/usr/lib/python3.7/threading.py", line 870, in run
    self._target(*self._args, **self._kwargs)
  File "<https://ci-beam.apache.org/job/beam_PostCommit_Python37/ws/src/sdks/python/apache_beam/runners/worker/data_plane.py",> line 651, in <lambda>
    target=lambda: self._read_inputs(elements_iterator),
  File "<https://ci-beam.apache.org/job/beam_PostCommit_Python37/ws/src/sdks/python/apache_beam/runners/worker/data_plane.py",> line 634, in _read_inputs
    for elements in elements_iterator:
  File "<https://ci-beam.apache.org/job/beam_PostCommit_Python37/ws/src/build/gradleenv/2022703441/lib/python3.7/site-packages/grpc/_channel.py",> line 426, in __next__
    return self._next()
  File "<https://ci-beam.apache.org/job/beam_PostCommit_Python37/ws/src/build/gradleenv/2022703441/lib/python3.7/site-packages/grpc/_channel.py",> line 826, in _next
    raise self
grpc._channel._MultiThreadedRendezvous: <_MultiThreadedRendezvous of RPC that terminated with:
	status = StatusCode.UNAVAILABLE
	details = "Socket closed"
	debug_error_string = "{"created":"@1650440625.667801261","description":"Error received from peer ipv6:[::1]:39707","file":"src/core/lib/surface/call.cc","file_line":903,"grpc_message":"Socket closed","grpc_status":14}"
>

Exception in thread read_state:
Traceback (most recent call last):
  File "/usr/lib/python3.7/threading.py", line 926, in _bootstrap_inner
    self.run()
  File "/usr/lib/python3.7/threading.py", line 870, in run
    self._target(*self._args, **self._kwargs)
  File "<https://ci-beam.apache.org/job/beam_PostCommit_Python37/ws/src/sdks/python/apache_beam/runners/worker/sdk_worker.py",> line 990, in pull_responses
    for response in responses:
  File "<https://ci-beam.apache.org/job/beam_PostCommit_Python37/ws/src/build/gradleenv/2022703441/lib/python3.7/site-packages/grpc/_channel.py",> line 426, in __next__
    return self._next()
  File "<https://ci-beam.apache.org/job/beam_PostCommit_Python37/ws/src/build/gradleenv/2022703441/lib/python3.7/site-packages/grpc/_channel.py",> line 826, in _next
    raise self
grpc._channel._MultiThreadedRendezvous: <_MultiThreadedRendezvous of RPC that terminated with:
	status = StatusCode.UNAVAILABLE
	details = "Socket closed"
	debug_error_string = "{"created":"@1650440625.667815396","description":"Error received from peer ipv6:[::1]:43541","file":"src/core/lib/surface/call.cc","file_line":903,"grpc_message":"Socket closed","grpc_status":14}"
>


> Task :sdks:python:test-suites:portable:py37:postCommitPy37
> Task :sdks:python:test-suites:portable:py37:xlangSpannerIOIT

> Task :sdks:python:test-suites:dataflow:py37:postCommitIT
E0420 07:46:20.330191810  843997 fork_posix.cc:70]           Fork support is only compatible with the epoll1 and poll polling strategies

> Task :sdks:python:test-suites:portable:py37:xlangSpannerIOIT
E0420 07:46:37.681775914  882631 fork_posix.cc:70]           Fork support is only compatible with the epoll1 and poll polling strategies
Exception in thread read_grpc_client_inputs:
Traceback (most recent call last):
  File "/usr/lib/python3.7/threading.py", line 926, in _bootstrap_inner
    self.run()
  File "/usr/lib/python3.7/threading.py", line 870, in run
    self._target(*self._args, **self._kwargs)
  File "<https://ci-beam.apache.org/job/beam_PostCommit_Python37/ws/src/sdks/python/apache_beam/runners/worker/data_plane.py",> line 651, in <lambda>
    target=lambda: self._read_inputs(elements_iterator),
  File "<https://ci-beam.apache.org/job/beam_PostCommit_Python37/ws/src/sdks/python/apache_beam/runners/worker/data_plane.py",> line 634, in _read_inputs
    for elements in elements_iterator:
  File "<https://ci-beam.apache.org/job/beam_PostCommit_Python37/ws/src/build/gradleenv/2022703441/lib/python3.7/site-packages/grpc/_channel.py",> line 426, in __next__
    return self._next()
  File "<https://ci-beam.apache.org/job/beam_PostCommit_Python37/ws/src/build/gradleenv/2022703441/lib/python3.7/site-packages/grpc/_channel.py",> line 826, in _next
    raise self
grpc._channel._MultiThreadedRendezvous: <_MultiThreadedRendezvous of RPC that terminated with:
	status = StatusCode.CANCELLED
	details = "Multiplexer hanging up"
	debug_error_string = "{"created":"@1650440763.700946339","description":"Error received from peer ipv6:[::1]:44525","file":"src/core/lib/surface/call.cc","file_line":903,"grpc_message":"Multiplexer hanging up","grpc_status":1}"
>

Exception in thread read_grpc_client_inputs:
Traceback (most recent call last):
  File "/usr/lib/python3.7/threading.py", line 926, in _bootstrap_inner
    self.run()
  File "/usr/lib/python3.7/threading.py", line 870, in run
    self._target(*self._args, **self._kwargs)
  File "<https://ci-beam.apache.org/job/beam_PostCommit_Python37/ws/src/sdks/python/apache_beam/runners/worker/data_plane.py",> line 651, in <lambda>
    target=lambda: self._read_inputs(elements_iterator),
  File "<https://ci-beam.apache.org/job/beam_PostCommit_Python37/ws/src/sdks/python/apache_beam/runners/worker/data_plane.py",> line 634, in _read_inputs
    for elements in elements_iterator:
  File "<https://ci-beam.apache.org/job/beam_PostCommit_Python37/ws/src/build/gradleenv/2022703441/lib/python3.7/site-packages/grpc/_channel.py",> line 426, in __next__
    return self._next()
  File "<https://ci-beam.apache.org/job/beam_PostCommit_Python37/ws/src/build/gradleenv/2022703441/lib/python3.7/site-packages/grpc/_channel.py",> line 826, in _next
    raise self
grpc._channel._MultiThreadedRendezvous: <_MultiThreadedRendezvous of RPC that terminated with:
	status = StatusCode.CANCELLED
	details = "Multiplexer hanging up"
	debug_error_string = "{"created":"@1650440826.761066363","description":"Error received from peer ipv6:[::1]:38387","file":"src/core/lib/surface/call.cc","file_line":903,"grpc_message":"Multiplexer hanging up","grpc_status":1}"
>


> Task :sdks:python:test-suites:dataflow:py37:postCommitIT
E0420 07:50:30.123333900  843967 fork_posix.cc:70]           Fork support is only compatible with the epoll1 and poll polling strategies
E0420 07:53:37.670713809  843997 fork_posix.cc:70]           Fork support is only compatible with the epoll1 and poll polling strategies
E0420 07:57:28.954448891  843967 fork_posix.cc:70]           Fork support is only compatible with the epoll1 and poll polling strategies
E0420 07:58:57.815648696  843958 fork_posix.cc:70]           Fork support is only compatible with the epoll1 and poll polling strategies
E0420 08:07:31.434466107  843967 fork_posix.cc:70]           Fork support is only compatible with the epoll1 and poll polling strategies
E0420 08:14:18.414913993  843967 fork_posix.cc:70]           Fork support is only compatible with the epoll1 and poll polling strategies
E0420 08:15:41.238275065  843958 fork_posix.cc:70]           Fork support is only compatible with the epoll1 and poll polling strategies
E0420 08:21:40.731670276  843967 fork_posix.cc:70]           Fork support is only compatible with the epoll1 and poll polling strategies
E0420 08:27:54.567702136  843978 fork_posix.cc:70]           Fork support is only compatible with the epoll1 and poll polling strategies
E0420 08:30:08.073941723  843967 fork_posix.cc:70]           Fork support is only compatible with the epoll1 and poll polling strategies
E0420 08:32:46.912700131  843958 fork_posix.cc:70]           Fork support is only compatible with the epoll1 and poll polling strategies
E0420 08:36:59.879610137  843967 fork_posix.cc:70]           Fork support is only compatible with the epoll1 and poll polling strategies
E0420 08:38:06.680237810  843978 fork_posix.cc:70]           Fork support is only compatible with the epoll1 and poll polling strategies
E0420 08:44:42.588542970  843967 fork_posix.cc:70]           Fork support is only compatible with the epoll1 and poll polling strategies
E0420 08:52:34.375172416  843967 fork_posix.cc:70]           Fork support is only compatible with the epoll1 and poll polling strategies

> Task :sdks:python:test-suites:dataflow:py37:postCommitIT FAILED

> Task :sdks:python:test-suites:dataflow:py37:spannerioIT
>>> RUNNING integration tests with pipeline options: --runner=TestDataflowRunner --project=apache-beam-testing --region=us-central1 --staging_location=gs://temp-storage-for-end-to-end-tests/staging-it --temp_location=gs://temp-storage-for-end-to-end-tests/temp-it --output=gs://temp-storage-for-end-to-end-tests/py-it-cloud/output --sdk_location=<https://ci-beam.apache.org/job/beam_PostCommit_Python37/ws/src/sdks/python/build/apache-beam.tar.gz> --requirements_file=postcommit_requirements.txt --num_workers=1 --sleep_secs=20 --dataflow_worker_jar=<https://ci-beam.apache.org/job/beam_PostCommit_Python37/ws/src/runners/google-cloud-dataflow-java/worker/build/libs/beam-runners-google-cloud-dataflow-java-fn-api-worker-2.39.0-SNAPSHOT.jar> --kms_key_name=projects/apache-beam-testing/locations/global/keyRings/beam-it/cryptoKeys/test --dataflow_kms_key=projects/apache-beam-testing/locations/global/keyRings/beam-it/cryptoKeys/test
>>>   pytest options: --capture=no --timeout=4500 --color=yes --log-cli-level=INFO --numprocesses=8 --dist=loadfile
>>>   collect markers: -m=spannerio_it
============================= test session starts ==============================
platform linux -- Python 3.7.12, pytest-4.6.11, py-1.11.0, pluggy-0.13.1
rootdir: <https://ci-beam.apache.org/job/beam_PostCommit_Python37/ws/src/sdks/python,> inifile: pytest.ini
plugins: xdist-1.34.0, timeout-1.4.2, forked-1.4.0, requests-mock-1.9.3
timeout: 4500.0s
timeout method: signal
timeout func_only: False
gw0 I / gw1 I / gw2 I / gw3 I / gw4 I / gw5 I / gw6 I / gw7 I
[gw0] Python 3.7.12 (default, Jan 15 2022, 18:42:10)  -- [GCC 9.3.0]
[gw1] Python 3.7.12 (default, Jan 15 2022, 18:42:10)  -- [GCC 9.3.0]
[gw2] Python 3.7.12 (default, Jan 15 2022, 18:42:10)  -- [GCC 9.3.0]
[gw3] Python 3.7.12 (default, Jan 15 2022, 18:42:10)  -- [GCC 9.3.0]
[gw4] Python 3.7.12 (default, Jan 15 2022, 18:42:10)  -- [GCC 9.3.0]
[gw5] Python 3.7.12 (default, Jan 15 2022, 18:42:10)  -- [GCC 9.3.0]
[gw6] Python 3.7.12 (default, Jan 15 2022, 18:42:10)  -- [GCC 9.3.0]
[gw7] Python 3.7.12 (default, Jan 15 2022, 18:42:10)  -- [GCC 9.3.0]
gw0 [15] / gw1 [15] / gw2 [15] / gw3 [15] / gw4 [15] / gw5 [15] / gw6 [15] / gw7 [15]

scheduling tests via LoadFileScheduling

apache_beam/io/gcp/experimental/spannerio_read_it_test.py::SpannerReadIntegrationTest::test_read_via_sql 
apache_beam/io/gcp/experimental/spannerio_write_it_test.py::SpannerWriteIntegrationTest::test_metrics_error_call 
[gw1] SKIPPED apache_beam/io/gcp/experimental/spannerio_write_it_test.py::SpannerWriteIntegrationTest::test_metrics_error_call 
apache_beam/io/gcp/experimental/spannerio_write_it_test.py::SpannerWriteIntegrationTest::test_metrics_ok_call 
[gw1] SKIPPED apache_beam/io/gcp/experimental/spannerio_write_it_test.py::SpannerWriteIntegrationTest::test_metrics_ok_call 
apache_beam/io/gcp/experimental/spannerio_write_it_test.py::SpannerWriteIntegrationTest::test_spanner_error E0420 08:59:50.223110827  923240 fork_posix.cc:70]           Fork support is only compatible with the epoll1 and poll polling strategies
E0420 08:59:51.006689172  923237 fork_posix.cc:70]           Fork support is only compatible with the epoll1 and poll polling strategies

[gw0] PASSED apache_beam/io/gcp/experimental/spannerio_read_it_test.py::SpannerReadIntegrationTest::test_read_via_sql 
apache_beam/io/gcp/experimental/spannerio_read_it_test.py::SpannerReadIntegrationTest::test_read_via_table E0420 09:05:58.383012884  923237 fork_posix.cc:70]           Fork support is only compatible with the epoll1 and poll polling strategies

[gw1] PASSED apache_beam/io/gcp/experimental/spannerio_write_it_test.py::SpannerWriteIntegrationTest::test_spanner_error 
apache_beam/io/gcp/experimental/spannerio_write_it_test.py::SpannerWriteIntegrationTest::test_spanner_update E0420 09:07:23.397928951  923240 fork_posix.cc:70]           Fork support is only compatible with the epoll1 and poll polling strategies

[gw0] PASSED apache_beam/io/gcp/experimental/spannerio_read_it_test.py::SpannerReadIntegrationTest::test_read_via_table 
apache_beam/io/gcp/experimental/spannerio_read_it_test.py::SpannerReadIntegrationTest::test_sql_metrics_error_call 
[gw0] SKIPPED apache_beam/io/gcp/experimental/spannerio_read_it_test.py::SpannerReadIntegrationTest::test_sql_metrics_error_call 
apache_beam/io/gcp/experimental/spannerio_read_it_test.py::SpannerReadIntegrationTest::test_sql_metrics_ok_call 
[gw0] SKIPPED apache_beam/io/gcp/experimental/spannerio_read_it_test.py::SpannerReadIntegrationTest::test_sql_metrics_ok_call 
apache_beam/io/gcp/experimental/spannerio_read_it_test.py::SpannerReadIntegrationTest::test_table_metrics_error_call 
[gw0] SKIPPED apache_beam/io/gcp/experimental/spannerio_read_it_test.py::SpannerReadIntegrationTest::test_table_metrics_error_call 
apache_beam/io/gcp/experimental/spannerio_read_it_test.py::SpannerReadIntegrationTest::test_table_metrics_ok_call 
[gw0] SKIPPED apache_beam/io/gcp/experimental/spannerio_read_it_test.py::SpannerReadIntegrationTest::test_table_metrics_ok_call 
apache_beam/io/gcp/experimental/spannerio_read_it_test.py::SpannerReadIntegrationTest::test_transaction_sql_metrics_error_call 
[gw0] SKIPPED apache_beam/io/gcp/experimental/spannerio_read_it_test.py::SpannerReadIntegrationTest::test_transaction_sql_metrics_error_call 
apache_beam/io/gcp/experimental/spannerio_read_it_test.py::SpannerReadIntegrationTest::test_transaction_sql_metrics_ok_call 
[gw0] SKIPPED apache_beam/io/gcp/experimental/spannerio_read_it_test.py::SpannerReadIntegrationTest::test_transaction_sql_metrics_ok_call 
apache_beam/io/gcp/experimental/spannerio_read_it_test.py::SpannerReadIntegrationTest::test_transaction_table_metrics_error_call 
[gw0] SKIPPED apache_beam/io/gcp/experimental/spannerio_read_it_test.py::SpannerReadIntegrationTest::test_transaction_table_metrics_error_call 
apache_beam/io/gcp/experimental/spannerio_read_it_test.py::SpannerReadIntegrationTest::test_transaction_table_metrics_ok_call 
[gw0] SKIPPED apache_beam/io/gcp/experimental/spannerio_read_it_test.py::SpannerReadIntegrationTest::test_transaction_table_metrics_ok_call 
[gw1] PASSED apache_beam/io/gcp/experimental/spannerio_write_it_test.py::SpannerWriteIntegrationTest::test_spanner_update 
apache_beam/io/gcp/experimental/spannerio_write_it_test.py::SpannerWriteIntegrationTest::test_write_batches E0420 09:14:12.635406055  923240 fork_posix.cc:70]           Fork support is only compatible with the epoll1 and poll polling strategies

[gw1] PASSED apache_beam/io/gcp/experimental/spannerio_write_it_test.py::SpannerWriteIntegrationTest::test_write_batches 

=============================== warnings summary ===============================
apache_beam/io/gcp/experimental/spannerio_read_it_test.py:128
  <https://ci-beam.apache.org/job/beam_PostCommit_Python37/ws/src/sdks/python/apache_beam/io/gcp/experimental/spannerio_read_it_test.py>:128: FutureWarning: ReadFromSpanner is experimental. No backwards-compatibility guarantees.
    sql="select * from Users")

apache_beam/io/gcp/experimental/spannerio_write_it_test.py:190
  <https://ci-beam.apache.org/job/beam_PostCommit_Python37/ws/src/sdks/python/apache_beam/io/gcp/experimental/spannerio_write_it_test.py>:190: FutureWarning: WriteToSpanner is experimental. No backwards-compatibility guarantees.
    database_id=self.TEST_DATABASE))

apache_beam/io/gcp/experimental/spannerio_read_it_test.py:117
  <https://ci-beam.apache.org/job/beam_PostCommit_Python37/ws/src/sdks/python/apache_beam/io/gcp/experimental/spannerio_read_it_test.py>:117: FutureWarning: ReadFromSpanner is experimental. No backwards-compatibility guarantees.
    columns=["UserId", "Key"])

apache_beam/io/gcp/experimental/spannerio_write_it_test.py:171
  <https://ci-beam.apache.org/job/beam_PostCommit_Python37/ws/src/sdks/python/apache_beam/io/gcp/experimental/spannerio_write_it_test.py>:171: FutureWarning: WriteToSpanner is experimental. No backwards-compatibility guarantees.
    database_id=self.TEST_DATABASE))

apache_beam/io/gcp/experimental/spannerio_write_it_test.py:135
  <https://ci-beam.apache.org/job/beam_PostCommit_Python37/ws/src/sdks/python/apache_beam/io/gcp/experimental/spannerio_write_it_test.py>:135: FutureWarning: WriteToSpanner is experimental. No backwards-compatibility guarantees.
    max_batch_size_bytes=250))

-- Docs: https://docs.pytest.org/en/latest/warnings.html
- generated xml file: <https://ci-beam.apache.org/job/beam_PostCommit_Python37/ws/src/sdks/python/pytest_postCommitIT-df-py37.xml> -
============= 5 passed, 10 skipped, 5 warnings in 1326.57 seconds ==============

FAILURE: Build failed with an exception.

* Where:
Script '<https://ci-beam.apache.org/job/beam_PostCommit_Python37/ws/src/sdks/python/test-suites/dataflow/common.gradle'> line: 121

* What went wrong:
Execution failed for task ':sdks:python:test-suites:dataflow:py37:postCommitIT'.
> Process 'command 'sh'' finished with non-zero exit value 1

* Try:
> Run with --stacktrace option to get the stack trace.
> Run with --info or --debug option to get more log output.
> Run with --scan to get full insights.

* Get more help at https://help.gradle.org

Deprecated Gradle features were used in this build, making it incompatible with Gradle 8.0.

You can use '--warning-mode all' to show the individual deprecation warnings and determine if they come from your own scripts or plugins.

See https://docs.gradle.org/7.4/userguide/command_line_interface.html#sec:command_line_warnings

Execution optimizations have been disabled for 1 invalid unit(s) of work during this build to ensure correctness.
Please consult deprecation warnings for more details.

BUILD FAILED in 2h 1m 14s
224 actionable tasks: 154 executed, 64 from cache, 6 up-to-date

Publishing build scan...
https://gradle.com/s/aeox3ucvzcn5e

Build step 'Invoke Gradle script' changed build result to FAILURE
Build step 'Invoke Gradle script' marked build as failure

---------------------------------------------------------------------
To unsubscribe, e-mail: builds-unsubscribe@beam.apache.org
For additional commands, e-mail: builds-help@beam.apache.org


Build failed in Jenkins: beam_PostCommit_Python37 #5128

Posted by Apache Jenkins Server <je...@builds.apache.org>.
See <https://ci-beam.apache.org/job/beam_PostCommit_Python37/5128/display/redirect?page=changes>

Changes:

[noreply] Populate actual dataflow job id to bigquery write trace id (#17130)

[relax] mark static thread as a daemon thread

[noreply] [BEAM-13866] Add miscellaneous exec unit tests (#17363)


------------------------------------------
[...truncated 57.49 MB...]
apache_beam/io/gcp/bigquery.py:2476
  <https://ci-beam.apache.org/job/beam_PostCommit_Python37/ws/src/sdks/python/apache_beam/io/gcp/bigquery.py>:2476: BeamDeprecationWarning: options is deprecated since First stable release. References to <pipeline>.options will not be supported
    | _PassThroughThenCleanup(files_to_remove_pcoll))

apache_beam/io/gcp/bigquery.py:2139
apache_beam/io/gcp/bigquery.py:2139
apache_beam/io/gcp/bigquery.py:2139
apache_beam/io/gcp/bigquery.py:2139
apache_beam/io/gcp/bigquery.py:2139
apache_beam/io/gcp/bigquery.py:2139
apache_beam/io/gcp/bigquery.py:2139
apache_beam/io/gcp/bigquery.py:2139
apache_beam/io/gcp/bigquery.py:2139
apache_beam/io/gcp/bigquery.py:2139
apache_beam/io/gcp/bigquery.py:2139
apache_beam/io/gcp/bigquery.py:2139
  <https://ci-beam.apache.org/job/beam_PostCommit_Python37/ws/src/sdks/python/apache_beam/io/gcp/bigquery.py>:2139: BeamDeprecationWarning: options is deprecated since First stable release. References to <pipeline>.options will not be supported
    self.table_reference.projectId = pcoll.pipeline.options.view_as(

apache_beam/io/gcp/bigquery_file_loads.py:1128
apache_beam/io/gcp/bigquery_file_loads.py:1128
apache_beam/io/gcp/bigquery_file_loads.py:1128
apache_beam/io/gcp/bigquery_file_loads.py:1128
apache_beam/io/gcp/bigquery_file_loads.py:1128
apache_beam/io/gcp/bigquery_file_loads.py:1128
apache_beam/io/gcp/bigquery_file_loads.py:1128
apache_beam/io/gcp/bigquery_file_loads.py:1128
apache_beam/io/gcp/bigquery_file_loads.py:1128
apache_beam/io/gcp/bigquery_file_loads.py:1128
apache_beam/io/gcp/bigquery_file_loads.py:1128
apache_beam/io/gcp/bigquery_file_loads.py:1128
apache_beam/io/gcp/bigquery_file_loads.py:1128
apache_beam/io/gcp/bigquery_file_loads.py:1128
apache_beam/io/gcp/bigquery_file_loads.py:1128
apache_beam/io/gcp/bigquery_file_loads.py:1128
apache_beam/io/gcp/bigquery_file_loads.py:1128
  <https://ci-beam.apache.org/job/beam_PostCommit_Python37/ws/src/sdks/python/apache_beam/io/gcp/bigquery_file_loads.py>:1128: BeamDeprecationWarning: options is deprecated since First stable release. References to <pipeline>.options will not be supported
    temp_location = p.options.view_as(GoogleCloudOptions).temp_location

apache_beam/io/gcp/bigquery_file_loads.py:1130
apache_beam/io/gcp/bigquery_file_loads.py:1130
apache_beam/io/gcp/bigquery_file_loads.py:1130
apache_beam/io/gcp/bigquery_file_loads.py:1130
apache_beam/io/gcp/bigquery_file_loads.py:1130
apache_beam/io/gcp/bigquery_file_loads.py:1130
apache_beam/io/gcp/bigquery_file_loads.py:1130
apache_beam/io/gcp/bigquery_file_loads.py:1130
apache_beam/io/gcp/bigquery_file_loads.py:1130
apache_beam/io/gcp/bigquery_file_loads.py:1130
apache_beam/io/gcp/bigquery_file_loads.py:1130
apache_beam/io/gcp/bigquery_file_loads.py:1130
apache_beam/io/gcp/bigquery_file_loads.py:1130
apache_beam/io/gcp/bigquery_file_loads.py:1130
apache_beam/io/gcp/bigquery_file_loads.py:1130
apache_beam/io/gcp/bigquery_file_loads.py:1130
apache_beam/io/gcp/bigquery_file_loads.py:1130
  <https://ci-beam.apache.org/job/beam_PostCommit_Python37/ws/src/sdks/python/apache_beam/io/gcp/bigquery_file_loads.py>:1130: BeamDeprecationWarning: options is deprecated since First stable release. References to <pipeline>.options will not be supported
    p.options.view_as(GoogleCloudOptions).job_name or 'AUTOMATIC_JOB_NAME')

apache_beam/io/gcp/tests/utils.py:100
  <https://ci-beam.apache.org/job/beam_PostCommit_Python37/ws/src/sdks/python/apache_beam/io/gcp/tests/utils.py>:100: PendingDeprecationWarning: Client.dataset is deprecated and will be removed in a future version. Use a string like 'my_project.my_dataset' or a cloud.google.bigquery.DatasetReference object, instead.
    table_ref = client.dataset(dataset_id).table(table_id)

apache_beam/examples/dataframe/flight_delays.py:47
  <https://ci-beam.apache.org/job/beam_PostCommit_Python37/ws/src/sdks/python/apache_beam/examples/dataframe/flight_delays.py>:47: FutureWarning: Dropping of nuisance columns in DataFrame reductions (with 'numeric_only=None') is deprecated; in a future version this will raise TypeError.  Select only valid columns before calling the reduction.
    return airline_df[at_top_airports].mean()

apache_beam/dataframe/io.py:632
apache_beam/dataframe/io.py:632
apache_beam/dataframe/io.py:632
  <https://ci-beam.apache.org/job/beam_PostCommit_Python37/ws/src/sdks/python/apache_beam/dataframe/io.py>:632: FutureWarning: WriteToFiles is experimental.
    sink=lambda _: _WriteToPandasFileSink(

apache_beam/io/fileio.py:550
apache_beam/io/fileio.py:550
apache_beam/io/fileio.py:550
  <https://ci-beam.apache.org/job/beam_PostCommit_Python37/ws/src/sdks/python/apache_beam/io/fileio.py>:550: BeamDeprecationWarning: options is deprecated since First stable release. References to <pipeline>.options will not be supported
    p.options.view_as(GoogleCloudOptions).temp_location or

apache_beam/io/gcp/bigquery_test.py:1183
  <https://ci-beam.apache.org/job/beam_PostCommit_Python37/ws/src/sdks/python/apache_beam/io/gcp/bigquery_test.py>:1183: BeamDeprecationWarning: options is deprecated since First stable release. References to <pipeline>.options will not be supported
    streaming = self.test_pipeline.options.view_as(StandardOptions).streaming

apache_beam/io/gcp/bigquery_read_it_test.py:167
  <https://ci-beam.apache.org/job/beam_PostCommit_Python37/ws/src/sdks/python/apache_beam/io/gcp/bigquery_read_it_test.py>:167: BeamDeprecationWarning: BigQuerySource is deprecated since 2.25.0. Use ReadFromBigQuery instead.
    beam.io.BigQuerySource(query=self.query, use_standard_sql=True)))

apache_beam/io/gcp/big_query_query_to_table_pipeline.py:84
apache_beam/io/gcp/big_query_query_to_table_pipeline.py:84
  <https://ci-beam.apache.org/job/beam_PostCommit_Python37/ws/src/sdks/python/apache_beam/io/gcp/big_query_query_to_table_pipeline.py>:84: BeamDeprecationWarning: BigQuerySource is deprecated since 2.25.0. Use ReadFromBigQuery instead.
    kms_key=kms_key))

apache_beam/runners/dataflow/ptransform_overrides.py:323
apache_beam/runners/dataflow/ptransform_overrides.py:323
  <https://ci-beam.apache.org/job/beam_PostCommit_Python37/ws/src/sdks/python/apache_beam/runners/dataflow/ptransform_overrides.py>:323: BeamDeprecationWarning: BigQuerySink is deprecated since 2.11.0. Use WriteToBigQuery instead.
    kms_key=self.kms_key))

apache_beam/io/gcp/bigquery_read_it_test.py:556
  <https://ci-beam.apache.org/job/beam_PostCommit_Python37/ws/src/sdks/python/apache_beam/io/gcp/bigquery_read_it_test.py>:556: BeamDeprecationWarning: BigQuerySource is deprecated since 2.25.0. Use ReadFromBigQuery instead.
    beam.io.BigQuerySource(query=self.query, use_standard_sql=True)))

apache_beam/ml/gcp/cloud_dlp_it_test.py:77
  <https://ci-beam.apache.org/job/beam_PostCommit_Python37/ws/src/sdks/python/apache_beam/ml/gcp/cloud_dlp_it_test.py>:77: FutureWarning: MaskDetectedDetails is experimental.
    inspection_config=INSPECT_CONFIG))

apache_beam/io/gcp/bigquery_read_it_test.py:670
  <https://ci-beam.apache.org/job/beam_PostCommit_Python37/ws/src/sdks/python/apache_beam/io/gcp/bigquery_read_it_test.py>:670: FutureWarning: ReadAllFromBigQuery is experimental.
    | beam.io.ReadAllFromBigQuery())

apache_beam/io/gcp/bigquery.py:2617
  <https://ci-beam.apache.org/job/beam_PostCommit_Python37/ws/src/sdks/python/apache_beam/io/gcp/bigquery.py>:2617: BeamDeprecationWarning: options is deprecated since First stable release. References to <pipeline>.options will not be supported
    job_name = pcoll.pipeline.options.view_as(GoogleCloudOptions).job_name

apache_beam/io/gcp/bigquery.py:2618
  <https://ci-beam.apache.org/job/beam_PostCommit_Python37/ws/src/sdks/python/apache_beam/io/gcp/bigquery.py>:2618: BeamDeprecationWarning: options is deprecated since First stable release. References to <pipeline>.options will not be supported
    project = pcoll.pipeline.options.view_as(GoogleCloudOptions).project

apache_beam/io/gcp/bigquery.py:2631
  <https://ci-beam.apache.org/job/beam_PostCommit_Python37/ws/src/sdks/python/apache_beam/io/gcp/bigquery.py>:2631: BeamDeprecationWarning: options is deprecated since First stable release. References to <pipeline>.options will not be supported
    options=pcoll.pipeline.options,

apache_beam/ml/gcp/cloud_dlp_it_test.py:87
  <https://ci-beam.apache.org/job/beam_PostCommit_Python37/ws/src/sdks/python/apache_beam/ml/gcp/cloud_dlp_it_test.py>:87: FutureWarning: InspectForDetails is experimental.
    | beam.ParDo(extract_inspection_results).with_outputs(

-- Docs: https://docs.pytest.org/en/latest/warnings.html
- generated xml file: <https://ci-beam.apache.org/job/beam_PostCommit_Python37/ws/src/sdks/python/pytest_postCommitIT-df-py37.xml> -
======= 1 failed, 60 passed, 8 skipped, 164 warnings in 6495.45 seconds ========

> Task :sdks:python:test-suites:dataflow:py37:postCommitIT FAILED

> Task :sdks:python:test-suites:dataflow:py37:spannerioIT
>>> RUNNING integration tests with pipeline options: --runner=TestDataflowRunner --project=apache-beam-testing --region=us-central1 --staging_location=gs://temp-storage-for-end-to-end-tests/staging-it --temp_location=gs://temp-storage-for-end-to-end-tests/temp-it --output=gs://temp-storage-for-end-to-end-tests/py-it-cloud/output --sdk_location=<https://ci-beam.apache.org/job/beam_PostCommit_Python37/ws/src/sdks/python/build/apache-beam.tar.gz> --requirements_file=postcommit_requirements.txt --num_workers=1 --sleep_secs=20 --dataflow_worker_jar=<https://ci-beam.apache.org/job/beam_PostCommit_Python37/ws/src/runners/google-cloud-dataflow-java/worker/build/libs/beam-runners-google-cloud-dataflow-java-fn-api-worker-2.39.0-SNAPSHOT.jar> --kms_key_name=projects/apache-beam-testing/locations/global/keyRings/beam-it/cryptoKeys/test --dataflow_kms_key=projects/apache-beam-testing/locations/global/keyRings/beam-it/cryptoKeys/test
>>>   pytest options: --capture=no --timeout=4500 --color=yes --log-cli-level=INFO --numprocesses=8 --dist=loadfile
>>>   collect markers: -m=spannerio_it
============================= test session starts ==============================
platform linux -- Python 3.7.12, pytest-4.6.11, py-1.11.0, pluggy-0.13.1
rootdir: <https://ci-beam.apache.org/job/beam_PostCommit_Python37/ws/src/sdks/python,> inifile: pytest.ini
plugins: xdist-1.34.0, timeout-1.4.2, forked-1.4.0, requests-mock-1.9.3
timeout: 4500.0s
timeout method: signal
timeout func_only: False
gw0 I / gw1 I / gw2 I / gw3 I / gw4 I / gw5 I / gw6 I / gw7 I
[gw0] Python 3.7.12 (default, Jan 15 2022, 18:42:10)  -- [GCC 9.3.0]
[gw1] Python 3.7.12 (default, Jan 15 2022, 18:42:10)  -- [GCC 9.3.0]
[gw2] Python 3.7.12 (default, Jan 15 2022, 18:42:10)  -- [GCC 9.3.0]
[gw3] Python 3.7.12 (default, Jan 15 2022, 18:42:10)  -- [GCC 9.3.0]
[gw4] Python 3.7.12 (default, Jan 15 2022, 18:42:10)  -- [GCC 9.3.0]
[gw5] Python 3.7.12 (default, Jan 15 2022, 18:42:10)  -- [GCC 9.3.0]
[gw6] Python 3.7.12 (default, Jan 15 2022, 18:42:10)  -- [GCC 9.3.0]
[gw7] Python 3.7.12 (default, Jan 15 2022, 18:42:10)  -- [GCC 9.3.0]
gw0 [15] / gw1 [15] / gw2 [15] / gw3 [15] / gw4 [15] / gw5 [15] / gw6 [15] / gw7 [15]

scheduling tests via LoadFileScheduling

apache_beam/io/gcp/experimental/spannerio_write_it_test.py::SpannerWriteIntegrationTest::test_metrics_error_call 
apache_beam/io/gcp/experimental/spannerio_read_it_test.py::SpannerReadIntegrationTest::test_read_via_sql 
[gw1] SKIPPED apache_beam/io/gcp/experimental/spannerio_write_it_test.py::SpannerWriteIntegrationTest::test_metrics_error_call 
apache_beam/io/gcp/experimental/spannerio_write_it_test.py::SpannerWriteIntegrationTest::test_metrics_ok_call 
[gw1] SKIPPED apache_beam/io/gcp/experimental/spannerio_write_it_test.py::SpannerWriteIntegrationTest::test_metrics_ok_call 
apache_beam/io/gcp/experimental/spannerio_write_it_test.py::SpannerWriteIntegrationTest::test_spanner_error E0420 03:12:48.985738167  777752 fork_posix.cc:70]           Fork support is only compatible with the epoll1 and poll polling strategies
E0420 03:12:49.814195001  777748 fork_posix.cc:70]           Fork support is only compatible with the epoll1 and poll polling strategies

[gw0] PASSED apache_beam/io/gcp/experimental/spannerio_read_it_test.py::SpannerReadIntegrationTest::test_read_via_sql 
apache_beam/io/gcp/experimental/spannerio_read_it_test.py::SpannerReadIntegrationTest::test_read_via_table E0420 03:19:12.597512999  777748 fork_posix.cc:70]           Fork support is only compatible with the epoll1 and poll polling strategies

[gw1] PASSED apache_beam/io/gcp/experimental/spannerio_write_it_test.py::SpannerWriteIntegrationTest::test_spanner_error 
apache_beam/io/gcp/experimental/spannerio_write_it_test.py::SpannerWriteIntegrationTest::test_spanner_update E0420 03:19:21.013379536  777752 fork_posix.cc:70]           Fork support is only compatible with the epoll1 and poll polling strategies

[gw0] PASSED apache_beam/io/gcp/experimental/spannerio_read_it_test.py::SpannerReadIntegrationTest::test_read_via_table 
apache_beam/io/gcp/experimental/spannerio_read_it_test.py::SpannerReadIntegrationTest::test_sql_metrics_error_call 
[gw0] SKIPPED apache_beam/io/gcp/experimental/spannerio_read_it_test.py::SpannerReadIntegrationTest::test_sql_metrics_error_call 
apache_beam/io/gcp/experimental/spannerio_read_it_test.py::SpannerReadIntegrationTest::test_sql_metrics_ok_call 
[gw0] SKIPPED apache_beam/io/gcp/experimental/spannerio_read_it_test.py::SpannerReadIntegrationTest::test_sql_metrics_ok_call 
apache_beam/io/gcp/experimental/spannerio_read_it_test.py::SpannerReadIntegrationTest::test_table_metrics_error_call 
[gw0] SKIPPED apache_beam/io/gcp/experimental/spannerio_read_it_test.py::SpannerReadIntegrationTest::test_table_metrics_error_call 
apache_beam/io/gcp/experimental/spannerio_read_it_test.py::SpannerReadIntegrationTest::test_table_metrics_ok_call 
[gw0] SKIPPED apache_beam/io/gcp/experimental/spannerio_read_it_test.py::SpannerReadIntegrationTest::test_table_metrics_ok_call 
apache_beam/io/gcp/experimental/spannerio_read_it_test.py::SpannerReadIntegrationTest::test_transaction_sql_metrics_error_call 
[gw0] SKIPPED apache_beam/io/gcp/experimental/spannerio_read_it_test.py::SpannerReadIntegrationTest::test_transaction_sql_metrics_error_call 
apache_beam/io/gcp/experimental/spannerio_read_it_test.py::SpannerReadIntegrationTest::test_transaction_sql_metrics_ok_call 
[gw0] SKIPPED apache_beam/io/gcp/experimental/spannerio_read_it_test.py::SpannerReadIntegrationTest::test_transaction_sql_metrics_ok_call 
apache_beam/io/gcp/experimental/spannerio_read_it_test.py::SpannerReadIntegrationTest::test_transaction_table_metrics_error_call 
[gw0] SKIPPED apache_beam/io/gcp/experimental/spannerio_read_it_test.py::SpannerReadIntegrationTest::test_transaction_table_metrics_error_call 
apache_beam/io/gcp/experimental/spannerio_read_it_test.py::SpannerReadIntegrationTest::test_transaction_table_metrics_ok_call 
[gw0] SKIPPED apache_beam/io/gcp/experimental/spannerio_read_it_test.py::SpannerReadIntegrationTest::test_transaction_table_metrics_ok_call 
[gw1] PASSED apache_beam/io/gcp/experimental/spannerio_write_it_test.py::SpannerWriteIntegrationTest::test_spanner_update 
apache_beam/io/gcp/experimental/spannerio_write_it_test.py::SpannerWriteIntegrationTest::test_write_batches E0420 03:27:09.241643054  777752 fork_posix.cc:70]           Fork support is only compatible with the epoll1 and poll polling strategies

[gw1] PASSED apache_beam/io/gcp/experimental/spannerio_write_it_test.py::SpannerWriteIntegrationTest::test_write_batches 

=============================== warnings summary ===============================
apache_beam/io/gcp/experimental/spannerio_read_it_test.py:128
  <https://ci-beam.apache.org/job/beam_PostCommit_Python37/ws/src/sdks/python/apache_beam/io/gcp/experimental/spannerio_read_it_test.py>:128: FutureWarning: ReadFromSpanner is experimental. No backwards-compatibility guarantees.
    sql="select * from Users")

apache_beam/io/gcp/experimental/spannerio_write_it_test.py:190
  <https://ci-beam.apache.org/job/beam_PostCommit_Python37/ws/src/sdks/python/apache_beam/io/gcp/experimental/spannerio_write_it_test.py>:190: FutureWarning: WriteToSpanner is experimental. No backwards-compatibility guarantees.
    database_id=self.TEST_DATABASE))

apache_beam/io/gcp/experimental/spannerio_read_it_test.py:117
  <https://ci-beam.apache.org/job/beam_PostCommit_Python37/ws/src/sdks/python/apache_beam/io/gcp/experimental/spannerio_read_it_test.py>:117: FutureWarning: ReadFromSpanner is experimental. No backwards-compatibility guarantees.
    columns=["UserId", "Key"])

apache_beam/io/gcp/experimental/spannerio_write_it_test.py:171
  <https://ci-beam.apache.org/job/beam_PostCommit_Python37/ws/src/sdks/python/apache_beam/io/gcp/experimental/spannerio_write_it_test.py>:171: FutureWarning: WriteToSpanner is experimental. No backwards-compatibility guarantees.
    database_id=self.TEST_DATABASE))

apache_beam/io/gcp/experimental/spannerio_write_it_test.py:135
  <https://ci-beam.apache.org/job/beam_PostCommit_Python37/ws/src/sdks/python/apache_beam/io/gcp/experimental/spannerio_write_it_test.py>:135: FutureWarning: WriteToSpanner is experimental. No backwards-compatibility guarantees.
    max_batch_size_bytes=250))

-- Docs: https://docs.pytest.org/en/latest/warnings.html
- generated xml file: <https://ci-beam.apache.org/job/beam_PostCommit_Python37/ws/src/sdks/python/pytest_postCommitIT-df-py37.xml> -
============= 5 passed, 10 skipped, 5 warnings in 1286.00 seconds ==============

FAILURE: Build failed with an exception.

* Where:
Script '<https://ci-beam.apache.org/job/beam_PostCommit_Python37/ws/src/sdks/python/test-suites/dataflow/common.gradle'> line: 121

* What went wrong:
Execution failed for task ':sdks:python:test-suites:dataflow:py37:postCommitIT'.
> Process 'command 'sh'' finished with non-zero exit value 1

* Try:
> Run with --stacktrace option to get the stack trace.
> Run with --info or --debug option to get more log output.
> Run with --scan to get full insights.

* Get more help at https://help.gradle.org

Deprecated Gradle features were used in this build, making it incompatible with Gradle 8.0.

You can use '--warning-mode all' to show the individual deprecation warnings and determine if they come from your own scripts or plugins.

See https://docs.gradle.org/7.4/userguide/command_line_interface.html#sec:command_line_warnings

Execution optimizations have been disabled for 1 invalid unit(s) of work during this build to ensure correctness.
Please consult deprecation warnings for more details.

BUILD FAILED in 2h 13m 37s
224 actionable tasks: 160 executed, 58 from cache, 6 up-to-date

Publishing build scan...
https://gradle.com/s/yuwjcgpfshazs

Build step 'Invoke Gradle script' changed build result to FAILURE
Build step 'Invoke Gradle script' marked build as failure

---------------------------------------------------------------------
To unsubscribe, e-mail: builds-unsubscribe@beam.apache.org
For additional commands, e-mail: builds-help@beam.apache.org


Build failed in Jenkins: beam_PostCommit_Python37 #5127

Posted by Apache Jenkins Server <je...@builds.apache.org>.
See <https://ci-beam.apache.org/job/beam_PostCommit_Python37/5127/display/redirect?page=changes>

Changes:

[andyye333] Change func to PTransform


------------------------------------------
[...truncated 41.02 MB...]
INFO     apache_beam.utils.subprocess_server:subprocess_server.py:125 b'}'
INFO     apache_beam.utils.subprocess_server:subprocess_server.py:125 b'Apr 19, 2022 7:36:24 PM org.apache.flink.runtime.webmonitor.WebMonitorEndpoint lambda$shutDownInternal$5'
INFO     apache_beam.utils.subprocess_server:subprocess_server.py:125 b'INFO: Removing cache directory /tmp/flink-web-ui'
INFO     apache_beam.utils.subprocess_server:subprocess_server.py:125 b'Apr 19, 2022 7:36:24 PM org.apache.flink.runtime.taskexecutor.TaskExecutor$JobLeaderListenerImpl jobManagerLostLeadership'
INFO     apache_beam.utils.subprocess_server:subprocess_server.py:125 b'INFO: JobManager for job 33cc0f201e48449dbf9ac86a0775de21 with leader id 8dbcf3ea745f455ae1b77e57585148ea lost leadership.'
INFO     apache_beam.utils.subprocess_server:subprocess_server.py:125 b'Apr 19, 2022 7:36:24 PM org.apache.flink.runtime.taskexecutor.DefaultJobLeaderService stop'
INFO     apache_beam.utils.subprocess_server:subprocess_server.py:125 b'INFO: Stop job leader service.'
INFO     apache_beam.utils.subprocess_server:subprocess_server.py:125 b'Apr 19, 2022 7:36:24 PM org.apache.flink.runtime.rest.RestServerEndpoint lambda$closeAsync$1'
INFO     apache_beam.utils.subprocess_server:subprocess_server.py:125 b'INFO: Shut down complete.'
INFO     apache_beam.utils.subprocess_server:subprocess_server.py:125 b'Apr 19, 2022 7:36:24 PM org.apache.flink.runtime.state.TaskExecutorLocalStateStoresManager shutdown'
INFO     apache_beam.utils.subprocess_server:subprocess_server.py:125 b'INFO: Shutting down TaskExecutorLocalStateStoresManager.'
INFO     apache_beam.utils.subprocess_server:subprocess_server.py:125 b'Apr 19, 2022 7:36:24 PM org.apache.flink.runtime.resourcemanager.ResourceManager deregisterApplication'
INFO     apache_beam.utils.subprocess_server:subprocess_server.py:125 b'INFO: Shut down cluster because application is in CANCELED, diagnostics DispatcherResourceManagerComponent has been closed..'
INFO     apache_beam.utils.subprocess_server:subprocess_server.py:125 b'Apr 19, 2022 7:36:24 PM org.apache.flink.runtime.entrypoint.component.DispatcherResourceManagerComponent closeAsyncInternal'
INFO     apache_beam.utils.subprocess_server:subprocess_server.py:125 b'INFO: Closing components.'
INFO     apache_beam.utils.subprocess_server:subprocess_server.py:125 b'Apr 19, 2022 7:36:24 PM org.apache.flink.runtime.dispatcher.runner.AbstractDispatcherLeaderProcess closeInternal'
INFO     apache_beam.utils.subprocess_server:subprocess_server.py:125 b'INFO: Stopping SessionDispatcherLeaderProcess.'
INFO     apache_beam.utils.subprocess_server:subprocess_server.py:125 b'Apr 19, 2022 7:36:24 PM org.apache.flink.runtime.dispatcher.Dispatcher onStop'
INFO     apache_beam.utils.subprocess_server:subprocess_server.py:125 b'INFO: Stopping dispatcher akka://flink/user/rpc/dispatcher_1.'
INFO     apache_beam.utils.subprocess_server:subprocess_server.py:125 b'Apr 19, 2022 7:36:24 PM org.apache.flink.runtime.resourcemanager.ResourceManagerServiceImpl closeAsync'
INFO     apache_beam.utils.subprocess_server:subprocess_server.py:125 b'INFO: Stopping resource manager service.'
INFO     apache_beam.utils.subprocess_server:subprocess_server.py:125 b'Apr 19, 2022 7:36:24 PM org.apache.flink.runtime.io.disk.FileChannelManagerImpl lambda$getFileCloser$0'
INFO     apache_beam.utils.subprocess_server:subprocess_server.py:125 b'INFO: FileChannelManager removed spill file directory /tmp/flink-io-c625d987-efa5-4dfb-9c88-641cd6cbde8e'
INFO     apache_beam.utils.subprocess_server:subprocess_server.py:125 b'Apr 19, 2022 7:36:24 PM org.apache.flink.runtime.dispatcher.Dispatcher terminateRunningJobs'
INFO     apache_beam.utils.subprocess_server:subprocess_server.py:125 b'INFO: Stopping all currently running jobs of dispatcher akka://flink/user/rpc/dispatcher_1.'
INFO     apache_beam.utils.subprocess_server:subprocess_server.py:125 b'Apr 19, 2022 7:36:24 PM org.apache.flink.runtime.io.network.NettyShuffleEnvironment close'
INFO     apache_beam.utils.subprocess_server:subprocess_server.py:125 b'INFO: Shutting down the network environment and its components.'
INFO     apache_beam.utils.subprocess_server:subprocess_server.py:125 b'Apr 19, 2022 7:36:24 PM org.apache.flink.runtime.resourcemanager.slotmanager.DeclarativeSlotManager close'
INFO     apache_beam.utils.subprocess_server:subprocess_server.py:125 b'INFO: Closing the slot manager.'
INFO     apache_beam.utils.subprocess_server:subprocess_server.py:125 b'Apr 19, 2022 7:36:24 PM org.apache.flink.runtime.resourcemanager.slotmanager.DeclarativeSlotManager suspend'
INFO     apache_beam.utils.subprocess_server:subprocess_server.py:125 b'INFO: Suspending the slot manager.'
INFO     apache_beam.utils.subprocess_server:subprocess_server.py:125 b'Apr 19, 2022 7:36:24 PM org.apache.flink.runtime.io.disk.FileChannelManagerImpl lambda$getFileCloser$0'
INFO     apache_beam.utils.subprocess_server:subprocess_server.py:125 b'INFO: FileChannelManager removed spill file directory /tmp/flink-netty-shuffle-96dc60a3-c8f1-4451-930e-4d28aec155b4'
INFO     apache_beam.utils.subprocess_server:subprocess_server.py:125 b'Apr 19, 2022 7:36:24 PM org.apache.flink.runtime.dispatcher.Dispatcher lambda$onStop$0'
INFO     apache_beam.utils.subprocess_server:subprocess_server.py:125 b'INFO: Stopped dispatcher akka://flink/user/rpc/dispatcher_1.'
INFO     apache_beam.utils.subprocess_server:subprocess_server.py:125 b'Apr 19, 2022 7:36:24 PM org.apache.flink.runtime.taskexecutor.KvStateService shutdown'
INFO     apache_beam.utils.subprocess_server:subprocess_server.py:125 b'INFO: Shutting down the kvState service and its components.'
INFO     apache_beam.utils.subprocess_server:subprocess_server.py:125 b'Apr 19, 2022 7:36:24 PM org.apache.flink.runtime.taskexecutor.DefaultJobLeaderService stop'
INFO     apache_beam.utils.subprocess_server:subprocess_server.py:125 b'INFO: Stop job leader service.'
INFO     apache_beam.utils.subprocess_server:subprocess_server.py:125 b'Apr 19, 2022 7:36:24 PM org.apache.flink.runtime.filecache.FileCache shutdown'
INFO     apache_beam.utils.subprocess_server:subprocess_server.py:125 b'INFO: removed file cache directory /tmp/flink-dist-cache-1845d42a-5fe6-4512-81c3-b6d46cd637ef'
INFO     apache_beam.utils.subprocess_server:subprocess_server.py:125 b'Apr 19, 2022 7:36:24 PM org.apache.flink.runtime.taskexecutor.TaskExecutor handleOnStopException'
INFO     apache_beam.utils.subprocess_server:subprocess_server.py:125 b'INFO: Stopped TaskExecutor akka://flink/user/rpc/taskmanager_0.'
INFO     apache_beam.utils.subprocess_server:subprocess_server.py:125 b'Apr 19, 2022 7:36:24 PM org.apache.flink.runtime.rpc.akka.AkkaRpcService stopService'
INFO     apache_beam.utils.subprocess_server:subprocess_server.py:125 b'INFO: Stopping Akka RPC service.'
INFO     apache_beam.utils.subprocess_server:subprocess_server.py:125 b'Apr 19, 2022 7:36:24 PM org.apache.flink.runtime.rpc.akka.AkkaRpcService stopService'
INFO     apache_beam.utils.subprocess_server:subprocess_server.py:125 b'INFO: Stopping Akka RPC service.'
INFO     apache_beam.utils.subprocess_server:subprocess_server.py:125 b'Apr 19, 2022 7:36:24 PM org.apache.flink.runtime.rpc.akka.AkkaRpcService lambda$stopService$8'
INFO     apache_beam.utils.subprocess_server:subprocess_server.py:125 b'INFO: Stopped Akka RPC service.'
INFO     apache_beam.runners.portability.portable_runner:portable_runner.py:582 Job state changed to DONE
INFO     apache_beam.utils.subprocess_server:subprocess_server.py:125 b'Apr 19, 2022 7:36:24 PM org.apache.flink.runtime.blob.AbstractBlobCache close'
INFO     apache_beam.utils.subprocess_server:subprocess_server.py:125 b'INFO: Shutting down BLOB cache'
INFO     apache_beam.utils.subprocess_server:subprocess_server.py:125 b'Apr 19, 2022 7:36:24 PM org.apache.flink.runtime.blob.AbstractBlobCache close'
INFO     apache_beam.utils.subprocess_server:subprocess_server.py:125 b'INFO: Shutting down BLOB cache'
INFO     apache_beam.utils.subprocess_server:subprocess_server.py:125 b'Apr 19, 2022 7:36:24 PM org.apache.flink.runtime.blob.BlobServer close'
INFO     apache_beam.utils.subprocess_server:subprocess_server.py:125 b'INFO: Stopped BLOB server at 0.0.0.0:41491'
PASSED                                                                   [100%]
------------------------------ live log teardown -------------------------------
INFO     apache_beam.utils.subprocess_server:subprocess_server.py:125 b'Apr 19, 2022 7:36:24 PM org.apache.flink.runtime.rpc.akka.AkkaRpcService lambda$stopService$8'
INFO     apache_beam.utils.subprocess_server:subprocess_server.py:125 b'INFO: Stopped Akka RPC service.'


- generated xml file: <https://ci-beam.apache.org/job/beam_PostCommit_Python37/ws/src/sdks/python/pytest_postCommitIT-flink-py37.xml> -
========================== 7 passed in 240.45 seconds ==========================
Exception in thread read_grpc_client_inputs:
Traceback (most recent call last):
  File "/usr/lib/python3.7/threading.py", line 926, in _bootstrap_inner
    self.run()
  File "/usr/lib/python3.7/threading.py", line 870, in run
    self._target(*self._args, **self._kwargs)
  File "<https://ci-beam.apache.org/job/beam_PostCommit_Python37/ws/src/sdks/python/apache_beam/runners/worker/data_plane.py",> line 651, in <lambda>
    target=lambda: self._read_inputs(elements_iterator),
  File "<https://ci-beam.apache.org/job/beam_PostCommit_Python37/ws/src/sdks/python/apache_beam/runners/worker/data_plane.py",> line 634, in _read_inputs
    for elements in elements_iterator:
  File "<https://ci-beam.apache.org/job/beam_PostCommit_Python37/ws/src/build/gradleenv/2022703441/lib/python3.7/site-packages/grpc/_channel.py",> line 426, in __next__
    return self._next()
  File "<https://ci-beam.apache.org/job/beam_PostCommit_Python37/ws/src/build/gradleenv/2022703441/lib/python3.7/site-packages/grpc/_channel.py",> line 826, in _next
    raise self
grpc._channel._MultiThreadedRendezvous: <_MultiThreadedRendezvous of RPC that terminated with:
	status = StatusCode.CANCELLED
	details = "Multiplexer hanging up"
	debug_error_string = "{"created":"@1650396784.752226331","description":"Error received from peer ipv6:[::1]:36769","file":"src/core/lib/surface/call.cc","file_line":903,"grpc_message":"Multiplexer hanging up","grpc_status":1}"
>

Exception in thread read_grpc_client_inputs:
Traceback (most recent call last):
  File "/usr/lib/python3.7/threading.py", line 926, in _bootstrap_inner
    self.run()
  File "/usr/lib/python3.7/threading.py", line 870, in run
    self._target(*self._args, **self._kwargs)
  File "<https://ci-beam.apache.org/job/beam_PostCommit_Python37/ws/src/sdks/python/apache_beam/runners/worker/data_plane.py",> line 651, in <lambda>
    target=lambda: self._read_inputs(elements_iterator),
  File "<https://ci-beam.apache.org/job/beam_PostCommit_Python37/ws/src/sdks/python/apache_beam/runners/worker/data_plane.py",> line 634, in _read_inputs
    for elements in elements_iterator:
  File "<https://ci-beam.apache.org/job/beam_PostCommit_Python37/ws/src/build/gradleenv/2022703441/lib/python3.7/site-packages/grpc/_channel.py",> line 426, in __next__
    return self._next()
  File "<https://ci-beam.apache.org/job/beam_PostCommit_Python37/ws/src/build/gradleenv/2022703441/lib/python3.7/site-packages/grpc/_channel.py",> line 826, in _next
    raise self
grpc._channel._MultiThreadedRendezvous: <_MultiThreadedRendezvous of RPC that terminated with:
	status = StatusCode.CANCELLED
	details = "Multiplexer hanging up"
	debug_error_string = "{"created":"@1650396918.537411670","description":"Error received from peer ipv6:[::1]:38873","file":"src/core/lib/surface/call.cc","file_line":903,"grpc_message":"Multiplexer hanging up","grpc_status":1}"
>


> Task :sdks:python:test-suites:dataflow:py37:postCommitIT
E0419 19:37:02.526797367 3166667 fork_posix.cc:70]           Fork support is only compatible with the epoll1 and poll polling strategies
E0419 19:39:50.579944202 3166662 fork_posix.cc:70]           Fork support is only compatible with the epoll1 and poll polling strategies
E0419 19:41:27.596215943 3166705 fork_posix.cc:70]           Fork support is only compatible with the epoll1 and poll polling strategies
E0419 19:41:34.320894959 3166639 fork_posix.cc:70]           Fork support is only compatible with the epoll1 and poll polling strategies
E0419 19:44:17.930717763 3166667 fork_posix.cc:70]           Fork support is only compatible with the epoll1 and poll polling strategies
E0419 19:47:33.659441475 3166662 fork_posix.cc:70]           Fork support is only compatible with the epoll1 and poll polling strategies
E0419 19:48:41.522116274 3166705 fork_posix.cc:70]           Fork support is only compatible with the epoll1 and poll polling strategies
E0419 19:51:19.165071779 3166667 fork_posix.cc:70]           Fork support is only compatible with the epoll1 and poll polling strategies
E0419 19:56:13.891752282 3166630 fork_posix.cc:70]           Fork support is only compatible with the epoll1 and poll polling strategies
E0419 19:56:28.113152219 3166662 fork_posix.cc:70]           Fork support is only compatible with the epoll1 and poll polling strategies
E0419 20:04:22.977853014 3166662 fork_posix.cc:70]           Fork support is only compatible with the epoll1 and poll polling strategies
E0419 20:10:43.381968132 3166662 fork_posix.cc:70]           Fork support is only compatible with the epoll1 and poll polling strategies
E0419 20:13:09.433596271 3166630 fork_posix.cc:70]           Fork support is only compatible with the epoll1 and poll polling strategies
E0419 20:17:27.949288679 3166662 fork_posix.cc:70]           Fork support is only compatible with the epoll1 and poll polling strategies
E0419 20:25:07.645098818 3166662 fork_posix.cc:70]           Fork support is only compatible with the epoll1 and poll polling strategies
E0419 20:29:56.184793174 3166630 fork_posix.cc:70]           Fork support is only compatible with the epoll1 and poll polling strategies
E0419 20:30:05.950282161 3166670 fork_posix.cc:70]           Fork support is only compatible with the epoll1 and poll polling strategies
E0419 20:32:46.000078590 3166662 fork_posix.cc:70]           Fork support is only compatible with the epoll1 and poll polling strategies
E0419 20:39:39.891260349 3166662 fork_posix.cc:70]           Fork support is only compatible with the epoll1 and poll polling strategies
E0419 20:40:53.402935679 3166670 fork_posix.cc:70]           Fork support is only compatible with the epoll1 and poll polling strategies
E0419 20:47:38.926353252 3166662 fork_posix.cc:70]           Fork support is only compatible with the epoll1 and poll polling strategies
E0419 20:54:31.474171469 3166662 fork_posix.cc:70]           Fork support is only compatible with the epoll1 and poll polling strategies

> Task :sdks:python:test-suites:dataflow:py37:postCommitIT FAILED

> Task :sdks:python:test-suites:dataflow:py37:spannerioIT
>>> RUNNING integration tests with pipeline options: --runner=TestDataflowRunner --project=apache-beam-testing --region=us-central1 --staging_location=gs://temp-storage-for-end-to-end-tests/staging-it --temp_location=gs://temp-storage-for-end-to-end-tests/temp-it --output=gs://temp-storage-for-end-to-end-tests/py-it-cloud/output --sdk_location=<https://ci-beam.apache.org/job/beam_PostCommit_Python37/ws/src/sdks/python/build/apache-beam.tar.gz> --requirements_file=postcommit_requirements.txt --num_workers=1 --sleep_secs=20 --dataflow_worker_jar=<https://ci-beam.apache.org/job/beam_PostCommit_Python37/ws/src/runners/google-cloud-dataflow-java/worker/build/libs/beam-runners-google-cloud-dataflow-java-fn-api-worker-2.39.0-SNAPSHOT.jar> --kms_key_name=projects/apache-beam-testing/locations/global/keyRings/beam-it/cryptoKeys/test --dataflow_kms_key=projects/apache-beam-testing/locations/global/keyRings/beam-it/cryptoKeys/test
>>>   pytest options: --capture=no --timeout=4500 --color=yes --log-cli-level=INFO --numprocesses=8 --dist=loadfile
>>>   collect markers: -m=spannerio_it
============================= test session starts ==============================
platform linux -- Python 3.7.12, pytest-4.6.11, py-1.11.0, pluggy-0.13.1
rootdir: <https://ci-beam.apache.org/job/beam_PostCommit_Python37/ws/src/sdks/python,> inifile: pytest.ini
plugins: xdist-1.34.0, timeout-1.4.2, forked-1.4.0, requests-mock-1.9.3
timeout: 4500.0s
timeout method: signal
timeout func_only: False
gw0 I / gw1 I / gw2 I / gw3 I / gw4 I / gw5 I / gw6 I / gw7 I
[gw0] Python 3.7.12 (default, Jan 15 2022, 18:42:10)  -- [GCC 9.3.0]
[gw1] Python 3.7.12 (default, Jan 15 2022, 18:42:10)  -- [GCC 9.3.0]
[gw2] Python 3.7.12 (default, Jan 15 2022, 18:42:10)  -- [GCC 9.3.0]
[gw4] Python 3.7.12 (default, Jan 15 2022, 18:42:10)  -- [GCC 9.3.0]
[gw3] Python 3.7.12 (default, Jan 15 2022, 18:42:10)  -- [GCC 9.3.0]
[gw5] Python 3.7.12 (default, Jan 15 2022, 18:42:10)  -- [GCC 9.3.0]
[gw6] Python 3.7.12 (default, Jan 15 2022, 18:42:10)  -- [GCC 9.3.0]
[gw7] Python 3.7.12 (default, Jan 15 2022, 18:42:10)  -- [GCC 9.3.0]
gw0 [15] / gw1 [15] / gw2 [15] / gw3 [15] / gw4 [15] / gw5 [15] / gw6 [15] / gw7 [15]

scheduling tests via LoadFileScheduling

apache_beam/io/gcp/experimental/spannerio_write_it_test.py::SpannerWriteIntegrationTest::test_metrics_error_call 
apache_beam/io/gcp/experimental/spannerio_read_it_test.py::SpannerReadIntegrationTest::test_read_via_sql 
[gw1] SKIPPED apache_beam/io/gcp/experimental/spannerio_write_it_test.py::SpannerWriteIntegrationTest::test_metrics_error_call 
apache_beam/io/gcp/experimental/spannerio_write_it_test.py::SpannerWriteIntegrationTest::test_metrics_ok_call 
[gw1] SKIPPED apache_beam/io/gcp/experimental/spannerio_write_it_test.py::SpannerWriteIntegrationTest::test_metrics_ok_call 
apache_beam/io/gcp/experimental/spannerio_write_it_test.py::SpannerWriteIntegrationTest::test_spanner_error E0419 21:01:20.709500619 3240689 fork_posix.cc:70]           Fork support is only compatible with the epoll1 and poll polling strategies
E0419 21:01:20.894507576 3240692 fork_posix.cc:70]           Fork support is only compatible with the epoll1 and poll polling strategies

[gw0] PASSED apache_beam/io/gcp/experimental/spannerio_read_it_test.py::SpannerReadIntegrationTest::test_read_via_sql 
apache_beam/io/gcp/experimental/spannerio_read_it_test.py::SpannerReadIntegrationTest::test_read_via_table E0419 21:08:58.994726609 3240689 fork_posix.cc:70]           Fork support is only compatible with the epoll1 and poll polling strategies

[gw1] PASSED apache_beam/io/gcp/experimental/spannerio_write_it_test.py::SpannerWriteIntegrationTest::test_spanner_error 
apache_beam/io/gcp/experimental/spannerio_write_it_test.py::SpannerWriteIntegrationTest::test_spanner_update E0419 21:09:04.480183261 3240692 fork_posix.cc:70]           Fork support is only compatible with the epoll1 and poll polling strategies

[gw0] PASSED apache_beam/io/gcp/experimental/spannerio_read_it_test.py::SpannerReadIntegrationTest::test_read_via_table 
apache_beam/io/gcp/experimental/spannerio_read_it_test.py::SpannerReadIntegrationTest::test_sql_metrics_error_call 
[gw0] SKIPPED apache_beam/io/gcp/experimental/spannerio_read_it_test.py::SpannerReadIntegrationTest::test_sql_metrics_error_call 
apache_beam/io/gcp/experimental/spannerio_read_it_test.py::SpannerReadIntegrationTest::test_sql_metrics_ok_call 
[gw0] SKIPPED apache_beam/io/gcp/experimental/spannerio_read_it_test.py::SpannerReadIntegrationTest::test_sql_metrics_ok_call 
apache_beam/io/gcp/experimental/spannerio_read_it_test.py::SpannerReadIntegrationTest::test_table_metrics_error_call 
[gw0] SKIPPED apache_beam/io/gcp/experimental/spannerio_read_it_test.py::SpannerReadIntegrationTest::test_table_metrics_error_call 
apache_beam/io/gcp/experimental/spannerio_read_it_test.py::SpannerReadIntegrationTest::test_table_metrics_ok_call 
[gw0] SKIPPED apache_beam/io/gcp/experimental/spannerio_read_it_test.py::SpannerReadIntegrationTest::test_table_metrics_ok_call 
apache_beam/io/gcp/experimental/spannerio_read_it_test.py::SpannerReadIntegrationTest::test_transaction_sql_metrics_error_call 
[gw0] SKIPPED apache_beam/io/gcp/experimental/spannerio_read_it_test.py::SpannerReadIntegrationTest::test_transaction_sql_metrics_error_call 
apache_beam/io/gcp/experimental/spannerio_read_it_test.py::SpannerReadIntegrationTest::test_transaction_sql_metrics_ok_call 
[gw0] SKIPPED apache_beam/io/gcp/experimental/spannerio_read_it_test.py::SpannerReadIntegrationTest::test_transaction_sql_metrics_ok_call 
apache_beam/io/gcp/experimental/spannerio_read_it_test.py::SpannerReadIntegrationTest::test_transaction_table_metrics_error_call 
[gw0] SKIPPED apache_beam/io/gcp/experimental/spannerio_read_it_test.py::SpannerReadIntegrationTest::test_transaction_table_metrics_error_call 
apache_beam/io/gcp/experimental/spannerio_read_it_test.py::SpannerReadIntegrationTest::test_transaction_table_metrics_ok_call 
[gw0] SKIPPED apache_beam/io/gcp/experimental/spannerio_read_it_test.py::SpannerReadIntegrationTest::test_transaction_table_metrics_ok_call 
[gw1] PASSED apache_beam/io/gcp/experimental/spannerio_write_it_test.py::SpannerWriteIntegrationTest::test_spanner_update 
apache_beam/io/gcp/experimental/spannerio_write_it_test.py::SpannerWriteIntegrationTest::test_write_batches E0419 21:16:22.422487497 3240692 fork_posix.cc:70]           Fork support is only compatible with the epoll1 and poll polling strategies

[gw1] PASSED apache_beam/io/gcp/experimental/spannerio_write_it_test.py::SpannerWriteIntegrationTest::test_write_batches 

=============================== warnings summary ===============================
apache_beam/io/gcp/experimental/spannerio_read_it_test.py:128
  <https://ci-beam.apache.org/job/beam_PostCommit_Python37/ws/src/sdks/python/apache_beam/io/gcp/experimental/spannerio_read_it_test.py>:128: FutureWarning: ReadFromSpanner is experimental. No backwards-compatibility guarantees.
    sql="select * from Users")

apache_beam/io/gcp/experimental/spannerio_write_it_test.py:190
  <https://ci-beam.apache.org/job/beam_PostCommit_Python37/ws/src/sdks/python/apache_beam/io/gcp/experimental/spannerio_write_it_test.py>:190: FutureWarning: WriteToSpanner is experimental. No backwards-compatibility guarantees.
    database_id=self.TEST_DATABASE))

apache_beam/io/gcp/experimental/spannerio_read_it_test.py:117
  <https://ci-beam.apache.org/job/beam_PostCommit_Python37/ws/src/sdks/python/apache_beam/io/gcp/experimental/spannerio_read_it_test.py>:117: FutureWarning: ReadFromSpanner is experimental. No backwards-compatibility guarantees.
    columns=["UserId", "Key"])

apache_beam/io/gcp/experimental/spannerio_write_it_test.py:171
  <https://ci-beam.apache.org/job/beam_PostCommit_Python37/ws/src/sdks/python/apache_beam/io/gcp/experimental/spannerio_write_it_test.py>:171: FutureWarning: WriteToSpanner is experimental. No backwards-compatibility guarantees.
    database_id=self.TEST_DATABASE))

apache_beam/io/gcp/experimental/spannerio_write_it_test.py:135
  <https://ci-beam.apache.org/job/beam_PostCommit_Python37/ws/src/sdks/python/apache_beam/io/gcp/experimental/spannerio_write_it_test.py>:135: FutureWarning: WriteToSpanner is experimental. No backwards-compatibility guarantees.
    max_batch_size_bytes=250))

-- Docs: https://docs.pytest.org/en/latest/warnings.html
- generated xml file: <https://ci-beam.apache.org/job/beam_PostCommit_Python37/ws/src/sdks/python/pytest_postCommitIT-df-py37.xml> -
============= 5 passed, 10 skipped, 5 warnings in 1399.84 seconds ==============

FAILURE: Build failed with an exception.

* Where:
Script '<https://ci-beam.apache.org/job/beam_PostCommit_Python37/ws/src/sdks/python/test-suites/dataflow/common.gradle'> line: 121

* What went wrong:
Execution failed for task ':sdks:python:test-suites:dataflow:py37:postCommitIT'.
> Process 'command 'sh'' finished with non-zero exit value 1

* Try:
> Run with --stacktrace option to get the stack trace.
> Run with --info or --debug option to get more log output.
> Run with --scan to get full insights.

* Get more help at https://help.gradle.org

Deprecated Gradle features were used in this build, making it incompatible with Gradle 8.0.

You can use '--warning-mode all' to show the individual deprecation warnings and determine if they come from your own scripts or plugins.

See https://docs.gradle.org/7.4/userguide/command_line_interface.html#sec:command_line_warnings

Execution optimizations have been disabled for 1 invalid unit(s) of work during this build to ensure correctness.
Please consult deprecation warnings for more details.

BUILD FAILED in 2h 3m 59s
224 actionable tasks: 154 executed, 64 from cache, 6 up-to-date

Publishing build scan...
https://gradle.com/s/o7jouicgpabo6

Build step 'Invoke Gradle script' changed build result to FAILURE
Build step 'Invoke Gradle script' marked build as failure

---------------------------------------------------------------------
To unsubscribe, e-mail: builds-unsubscribe@beam.apache.org
For additional commands, e-mail: builds-help@beam.apache.org


Build failed in Jenkins: beam_PostCommit_Python37 #5126

Posted by Apache Jenkins Server <je...@builds.apache.org>.
See <https://ci-beam.apache.org/job/beam_PostCommit_Python37/5126/display/redirect>

Changes:


------------------------------------------
[...truncated 57.21 MB...]
apache_beam/io/gcp/bigquery.py:2476
  <https://ci-beam.apache.org/job/beam_PostCommit_Python37/ws/src/sdks/python/apache_beam/io/gcp/bigquery.py>:2476: BeamDeprecationWarning: options is deprecated since First stable release. References to <pipeline>.options will not be supported
    | _PassThroughThenCleanup(files_to_remove_pcoll))

apache_beam/io/gcp/bigquery.py:2139
apache_beam/io/gcp/bigquery.py:2139
apache_beam/io/gcp/bigquery.py:2139
apache_beam/io/gcp/bigquery.py:2139
apache_beam/io/gcp/bigquery.py:2139
apache_beam/io/gcp/bigquery.py:2139
apache_beam/io/gcp/bigquery.py:2139
apache_beam/io/gcp/bigquery.py:2139
apache_beam/io/gcp/bigquery.py:2139
apache_beam/io/gcp/bigquery.py:2139
apache_beam/io/gcp/bigquery.py:2139
apache_beam/io/gcp/bigquery.py:2139
  <https://ci-beam.apache.org/job/beam_PostCommit_Python37/ws/src/sdks/python/apache_beam/io/gcp/bigquery.py>:2139: BeamDeprecationWarning: options is deprecated since First stable release. References to <pipeline>.options will not be supported
    self.table_reference.projectId = pcoll.pipeline.options.view_as(

apache_beam/io/gcp/bigquery_file_loads.py:1128
apache_beam/io/gcp/bigquery_file_loads.py:1128
apache_beam/io/gcp/bigquery_file_loads.py:1128
apache_beam/io/gcp/bigquery_file_loads.py:1128
apache_beam/io/gcp/bigquery_file_loads.py:1128
apache_beam/io/gcp/bigquery_file_loads.py:1128
apache_beam/io/gcp/bigquery_file_loads.py:1128
apache_beam/io/gcp/bigquery_file_loads.py:1128
apache_beam/io/gcp/bigquery_file_loads.py:1128
apache_beam/io/gcp/bigquery_file_loads.py:1128
apache_beam/io/gcp/bigquery_file_loads.py:1128
apache_beam/io/gcp/bigquery_file_loads.py:1128
apache_beam/io/gcp/bigquery_file_loads.py:1128
apache_beam/io/gcp/bigquery_file_loads.py:1128
apache_beam/io/gcp/bigquery_file_loads.py:1128
apache_beam/io/gcp/bigquery_file_loads.py:1128
apache_beam/io/gcp/bigquery_file_loads.py:1128
  <https://ci-beam.apache.org/job/beam_PostCommit_Python37/ws/src/sdks/python/apache_beam/io/gcp/bigquery_file_loads.py>:1128: BeamDeprecationWarning: options is deprecated since First stable release. References to <pipeline>.options will not be supported
    temp_location = p.options.view_as(GoogleCloudOptions).temp_location

apache_beam/io/gcp/bigquery_file_loads.py:1130
apache_beam/io/gcp/bigquery_file_loads.py:1130
apache_beam/io/gcp/bigquery_file_loads.py:1130
apache_beam/io/gcp/bigquery_file_loads.py:1130
apache_beam/io/gcp/bigquery_file_loads.py:1130
apache_beam/io/gcp/bigquery_file_loads.py:1130
apache_beam/io/gcp/bigquery_file_loads.py:1130
apache_beam/io/gcp/bigquery_file_loads.py:1130
apache_beam/io/gcp/bigquery_file_loads.py:1130
apache_beam/io/gcp/bigquery_file_loads.py:1130
apache_beam/io/gcp/bigquery_file_loads.py:1130
apache_beam/io/gcp/bigquery_file_loads.py:1130
apache_beam/io/gcp/bigquery_file_loads.py:1130
apache_beam/io/gcp/bigquery_file_loads.py:1130
apache_beam/io/gcp/bigquery_file_loads.py:1130
apache_beam/io/gcp/bigquery_file_loads.py:1130
apache_beam/io/gcp/bigquery_file_loads.py:1130
  <https://ci-beam.apache.org/job/beam_PostCommit_Python37/ws/src/sdks/python/apache_beam/io/gcp/bigquery_file_loads.py>:1130: BeamDeprecationWarning: options is deprecated since First stable release. References to <pipeline>.options will not be supported
    p.options.view_as(GoogleCloudOptions).job_name or 'AUTOMATIC_JOB_NAME')

apache_beam/io/gcp/tests/utils.py:100
  <https://ci-beam.apache.org/job/beam_PostCommit_Python37/ws/src/sdks/python/apache_beam/io/gcp/tests/utils.py>:100: PendingDeprecationWarning: Client.dataset is deprecated and will be removed in a future version. Use a string like 'my_project.my_dataset' or a cloud.google.bigquery.DatasetReference object, instead.
    table_ref = client.dataset(dataset_id).table(table_id)

apache_beam/examples/dataframe/flight_delays.py:47
  <https://ci-beam.apache.org/job/beam_PostCommit_Python37/ws/src/sdks/python/apache_beam/examples/dataframe/flight_delays.py>:47: FutureWarning: Dropping of nuisance columns in DataFrame reductions (with 'numeric_only=None') is deprecated; in a future version this will raise TypeError.  Select only valid columns before calling the reduction.
    return airline_df[at_top_airports].mean()

apache_beam/dataframe/io.py:632
apache_beam/dataframe/io.py:632
apache_beam/dataframe/io.py:632
  <https://ci-beam.apache.org/job/beam_PostCommit_Python37/ws/src/sdks/python/apache_beam/dataframe/io.py>:632: FutureWarning: WriteToFiles is experimental.
    sink=lambda _: _WriteToPandasFileSink(

apache_beam/io/fileio.py:550
apache_beam/io/fileio.py:550
apache_beam/io/fileio.py:550
  <https://ci-beam.apache.org/job/beam_PostCommit_Python37/ws/src/sdks/python/apache_beam/io/fileio.py>:550: BeamDeprecationWarning: options is deprecated since First stable release. References to <pipeline>.options will not be supported
    p.options.view_as(GoogleCloudOptions).temp_location or

apache_beam/io/gcp/bigquery_test.py:1183
  <https://ci-beam.apache.org/job/beam_PostCommit_Python37/ws/src/sdks/python/apache_beam/io/gcp/bigquery_test.py>:1183: BeamDeprecationWarning: options is deprecated since First stable release. References to <pipeline>.options will not be supported
    streaming = self.test_pipeline.options.view_as(StandardOptions).streaming

apache_beam/io/gcp/bigquery_read_it_test.py:167
  <https://ci-beam.apache.org/job/beam_PostCommit_Python37/ws/src/sdks/python/apache_beam/io/gcp/bigquery_read_it_test.py>:167: BeamDeprecationWarning: BigQuerySource is deprecated since 2.25.0. Use ReadFromBigQuery instead.
    beam.io.BigQuerySource(query=self.query, use_standard_sql=True)))

apache_beam/io/gcp/big_query_query_to_table_pipeline.py:84
apache_beam/io/gcp/big_query_query_to_table_pipeline.py:84
  <https://ci-beam.apache.org/job/beam_PostCommit_Python37/ws/src/sdks/python/apache_beam/io/gcp/big_query_query_to_table_pipeline.py>:84: BeamDeprecationWarning: BigQuerySource is deprecated since 2.25.0. Use ReadFromBigQuery instead.
    kms_key=kms_key))

apache_beam/runners/dataflow/ptransform_overrides.py:323
apache_beam/runners/dataflow/ptransform_overrides.py:323
  <https://ci-beam.apache.org/job/beam_PostCommit_Python37/ws/src/sdks/python/apache_beam/runners/dataflow/ptransform_overrides.py>:323: BeamDeprecationWarning: BigQuerySink is deprecated since 2.11.0. Use WriteToBigQuery instead.
    kms_key=self.kms_key))

apache_beam/io/gcp/bigquery_read_it_test.py:556
  <https://ci-beam.apache.org/job/beam_PostCommit_Python37/ws/src/sdks/python/apache_beam/io/gcp/bigquery_read_it_test.py>:556: BeamDeprecationWarning: BigQuerySource is deprecated since 2.25.0. Use ReadFromBigQuery instead.
    beam.io.BigQuerySource(query=self.query, use_standard_sql=True)))

apache_beam/io/gcp/bigquery_read_it_test.py:670
  <https://ci-beam.apache.org/job/beam_PostCommit_Python37/ws/src/sdks/python/apache_beam/io/gcp/bigquery_read_it_test.py>:670: FutureWarning: ReadAllFromBigQuery is experimental.
    | beam.io.ReadAllFromBigQuery())

apache_beam/io/gcp/bigquery.py:2617
  <https://ci-beam.apache.org/job/beam_PostCommit_Python37/ws/src/sdks/python/apache_beam/io/gcp/bigquery.py>:2617: BeamDeprecationWarning: options is deprecated since First stable release. References to <pipeline>.options will not be supported
    job_name = pcoll.pipeline.options.view_as(GoogleCloudOptions).job_name

apache_beam/io/gcp/bigquery.py:2618
  <https://ci-beam.apache.org/job/beam_PostCommit_Python37/ws/src/sdks/python/apache_beam/io/gcp/bigquery.py>:2618: BeamDeprecationWarning: options is deprecated since First stable release. References to <pipeline>.options will not be supported
    project = pcoll.pipeline.options.view_as(GoogleCloudOptions).project

apache_beam/io/gcp/bigquery.py:2631
  <https://ci-beam.apache.org/job/beam_PostCommit_Python37/ws/src/sdks/python/apache_beam/io/gcp/bigquery.py>:2631: BeamDeprecationWarning: options is deprecated since First stable release. References to <pipeline>.options will not be supported
    options=pcoll.pipeline.options,

apache_beam/ml/gcp/cloud_dlp_it_test.py:77
  <https://ci-beam.apache.org/job/beam_PostCommit_Python37/ws/src/sdks/python/apache_beam/ml/gcp/cloud_dlp_it_test.py>:77: FutureWarning: MaskDetectedDetails is experimental.
    inspection_config=INSPECT_CONFIG))

apache_beam/ml/gcp/cloud_dlp_it_test.py:87
  <https://ci-beam.apache.org/job/beam_PostCommit_Python37/ws/src/sdks/python/apache_beam/ml/gcp/cloud_dlp_it_test.py>:87: FutureWarning: InspectForDetails is experimental.
    | beam.ParDo(extract_inspection_results).with_outputs(

-- Docs: https://docs.pytest.org/en/latest/warnings.html
- generated xml file: <https://ci-beam.apache.org/job/beam_PostCommit_Python37/ws/src/sdks/python/pytest_postCommitIT-df-py37.xml> -
======= 1 failed, 60 passed, 8 skipped, 164 warnings in 6808.85 seconds ========

> Task :sdks:python:test-suites:dataflow:py37:postCommitIT FAILED

> Task :sdks:python:test-suites:dataflow:py37:spannerioIT
>>> RUNNING integration tests with pipeline options: --runner=TestDataflowRunner --project=apache-beam-testing --region=us-central1 --staging_location=gs://temp-storage-for-end-to-end-tests/staging-it --temp_location=gs://temp-storage-for-end-to-end-tests/temp-it --output=gs://temp-storage-for-end-to-end-tests/py-it-cloud/output --sdk_location=<https://ci-beam.apache.org/job/beam_PostCommit_Python37/ws/src/sdks/python/build/apache-beam.tar.gz> --requirements_file=postcommit_requirements.txt --num_workers=1 --sleep_secs=20 --dataflow_worker_jar=<https://ci-beam.apache.org/job/beam_PostCommit_Python37/ws/src/runners/google-cloud-dataflow-java/worker/build/libs/beam-runners-google-cloud-dataflow-java-fn-api-worker-2.39.0-SNAPSHOT.jar> --kms_key_name=projects/apache-beam-testing/locations/global/keyRings/beam-it/cryptoKeys/test --dataflow_kms_key=projects/apache-beam-testing/locations/global/keyRings/beam-it/cryptoKeys/test
>>>   pytest options: --capture=no --timeout=4500 --color=yes --log-cli-level=INFO --numprocesses=8 --dist=loadfile
>>>   collect markers: -m=spannerio_it
============================= test session starts ==============================
platform linux -- Python 3.7.12, pytest-4.6.11, py-1.11.0, pluggy-0.13.1
rootdir: <https://ci-beam.apache.org/job/beam_PostCommit_Python37/ws/src/sdks/python,> inifile: pytest.ini
plugins: xdist-1.34.0, timeout-1.4.2, forked-1.4.0, requests-mock-1.9.3
timeout: 4500.0s
timeout method: signal
timeout func_only: False
gw0 I / gw1 I / gw2 I / gw3 I / gw4 I / gw5 I / gw6 I / gw7 I
[gw1] Python 3.7.12 (default, Jan 15 2022, 18:42:10)  -- [GCC 9.3.0]
[gw6] Python 3.7.12 (default, Jan 15 2022, 18:42:10)  -- [GCC 9.3.0]
[gw0] Python 3.7.12 (default, Jan 15 2022, 18:42:10)  -- [GCC 9.3.0]
[gw2] Python 3.7.12 (default, Jan 15 2022, 18:42:10)  -- [GCC 9.3.0]
[gw3] Python 3.7.12 (default, Jan 15 2022, 18:42:10)  -- [GCC 9.3.0]
[gw4] Python 3.7.12 (default, Jan 15 2022, 18:42:10)  -- [GCC 9.3.0]
[gw5] Python 3.7.12 (default, Jan 15 2022, 18:42:10)  -- [GCC 9.3.0]
[gw7] Python 3.7.12 (default, Jan 15 2022, 18:42:10)  -- [GCC 9.3.0]
gw0 [15] / gw1 [15] / gw2 [15] / gw3 [15] / gw4 [15] / gw5 [15] / gw6 [15] / gw7 [15]

scheduling tests via LoadFileScheduling

apache_beam/io/gcp/experimental/spannerio_write_it_test.py::SpannerWriteIntegrationTest::test_metrics_error_call 
apache_beam/io/gcp/experimental/spannerio_read_it_test.py::SpannerReadIntegrationTest::test_read_via_sql 
[gw6] SKIPPED apache_beam/io/gcp/experimental/spannerio_write_it_test.py::SpannerWriteIntegrationTest::test_metrics_error_call 
apache_beam/io/gcp/experimental/spannerio_write_it_test.py::SpannerWriteIntegrationTest::test_metrics_ok_call 
[gw6] SKIPPED apache_beam/io/gcp/experimental/spannerio_write_it_test.py::SpannerWriteIntegrationTest::test_metrics_ok_call 
apache_beam/io/gcp/experimental/spannerio_write_it_test.py::SpannerWriteIntegrationTest::test_spanner_error E0419 15:16:07.950763727 4189900 fork_posix.cc:70]           Fork support is only compatible with the epoll1 and poll polling strategies
E0419 15:16:08.837807193 4189870 fork_posix.cc:70]           Fork support is only compatible with the epoll1 and poll polling strategies

[gw1] PASSED apache_beam/io/gcp/experimental/spannerio_read_it_test.py::SpannerReadIntegrationTest::test_read_via_sql 
apache_beam/io/gcp/experimental/spannerio_read_it_test.py::SpannerReadIntegrationTest::test_read_via_table E0419 15:23:35.907104651 4189870 fork_posix.cc:70]           Fork support is only compatible with the epoll1 and poll polling strategies

[gw6] PASSED apache_beam/io/gcp/experimental/spannerio_write_it_test.py::SpannerWriteIntegrationTest::test_spanner_error 
apache_beam/io/gcp/experimental/spannerio_write_it_test.py::SpannerWriteIntegrationTest::test_spanner_update E0419 15:24:04.027144208 4189900 fork_posix.cc:70]           Fork support is only compatible with the epoll1 and poll polling strategies

[gw1] PASSED apache_beam/io/gcp/experimental/spannerio_read_it_test.py::SpannerReadIntegrationTest::test_read_via_table 
apache_beam/io/gcp/experimental/spannerio_read_it_test.py::SpannerReadIntegrationTest::test_sql_metrics_error_call 
[gw1] SKIPPED apache_beam/io/gcp/experimental/spannerio_read_it_test.py::SpannerReadIntegrationTest::test_sql_metrics_error_call 
apache_beam/io/gcp/experimental/spannerio_read_it_test.py::SpannerReadIntegrationTest::test_sql_metrics_ok_call 
[gw1] SKIPPED apache_beam/io/gcp/experimental/spannerio_read_it_test.py::SpannerReadIntegrationTest::test_sql_metrics_ok_call 
apache_beam/io/gcp/experimental/spannerio_read_it_test.py::SpannerReadIntegrationTest::test_table_metrics_error_call 
[gw1] SKIPPED apache_beam/io/gcp/experimental/spannerio_read_it_test.py::SpannerReadIntegrationTest::test_table_metrics_error_call 
apache_beam/io/gcp/experimental/spannerio_read_it_test.py::SpannerReadIntegrationTest::test_table_metrics_ok_call 
[gw1] SKIPPED apache_beam/io/gcp/experimental/spannerio_read_it_test.py::SpannerReadIntegrationTest::test_table_metrics_ok_call 
apache_beam/io/gcp/experimental/spannerio_read_it_test.py::SpannerReadIntegrationTest::test_transaction_sql_metrics_error_call 
[gw1] SKIPPED apache_beam/io/gcp/experimental/spannerio_read_it_test.py::SpannerReadIntegrationTest::test_transaction_sql_metrics_error_call 
apache_beam/io/gcp/experimental/spannerio_read_it_test.py::SpannerReadIntegrationTest::test_transaction_sql_metrics_ok_call 
[gw1] SKIPPED apache_beam/io/gcp/experimental/spannerio_read_it_test.py::SpannerReadIntegrationTest::test_transaction_sql_metrics_ok_call 
apache_beam/io/gcp/experimental/spannerio_read_it_test.py::SpannerReadIntegrationTest::test_transaction_table_metrics_error_call 
[gw1] SKIPPED apache_beam/io/gcp/experimental/spannerio_read_it_test.py::SpannerReadIntegrationTest::test_transaction_table_metrics_error_call 
apache_beam/io/gcp/experimental/spannerio_read_it_test.py::SpannerReadIntegrationTest::test_transaction_table_metrics_ok_call 
[gw1] SKIPPED apache_beam/io/gcp/experimental/spannerio_read_it_test.py::SpannerReadIntegrationTest::test_transaction_table_metrics_ok_call 
[gw6] PASSED apache_beam/io/gcp/experimental/spannerio_write_it_test.py::SpannerWriteIntegrationTest::test_spanner_update 
apache_beam/io/gcp/experimental/spannerio_write_it_test.py::SpannerWriteIntegrationTest::test_write_batches E0419 15:30:51.605200595 4189900 fork_posix.cc:70]           Fork support is only compatible with the epoll1 and poll polling strategies

[gw6] PASSED apache_beam/io/gcp/experimental/spannerio_write_it_test.py::SpannerWriteIntegrationTest::test_write_batches 

=============================== warnings summary ===============================
apache_beam/io/gcp/experimental/spannerio_read_it_test.py:128
  <https://ci-beam.apache.org/job/beam_PostCommit_Python37/ws/src/sdks/python/apache_beam/io/gcp/experimental/spannerio_read_it_test.py>:128: FutureWarning: ReadFromSpanner is experimental. No backwards-compatibility guarantees.
    sql="select * from Users")

apache_beam/io/gcp/experimental/spannerio_write_it_test.py:190
  <https://ci-beam.apache.org/job/beam_PostCommit_Python37/ws/src/sdks/python/apache_beam/io/gcp/experimental/spannerio_write_it_test.py>:190: FutureWarning: WriteToSpanner is experimental. No backwards-compatibility guarantees.
    database_id=self.TEST_DATABASE))

apache_beam/io/gcp/experimental/spannerio_read_it_test.py:117
  <https://ci-beam.apache.org/job/beam_PostCommit_Python37/ws/src/sdks/python/apache_beam/io/gcp/experimental/spannerio_read_it_test.py>:117: FutureWarning: ReadFromSpanner is experimental. No backwards-compatibility guarantees.
    columns=["UserId", "Key"])

apache_beam/io/gcp/experimental/spannerio_write_it_test.py:171
  <https://ci-beam.apache.org/job/beam_PostCommit_Python37/ws/src/sdks/python/apache_beam/io/gcp/experimental/spannerio_write_it_test.py>:171: FutureWarning: WriteToSpanner is experimental. No backwards-compatibility guarantees.
    database_id=self.TEST_DATABASE))

apache_beam/io/gcp/experimental/spannerio_write_it_test.py:135
  <https://ci-beam.apache.org/job/beam_PostCommit_Python37/ws/src/sdks/python/apache_beam/io/gcp/experimental/spannerio_write_it_test.py>:135: FutureWarning: WriteToSpanner is experimental. No backwards-compatibility guarantees.
    max_batch_size_bytes=250))

-- Docs: https://docs.pytest.org/en/latest/warnings.html
- generated xml file: <https://ci-beam.apache.org/job/beam_PostCommit_Python37/ws/src/sdks/python/pytest_postCommitIT-df-py37.xml> -
============= 5 passed, 10 skipped, 5 warnings in 1308.95 seconds ==============

FAILURE: Build failed with an exception.

* Where:
Script '<https://ci-beam.apache.org/job/beam_PostCommit_Python37/ws/src/sdks/python/test-suites/dataflow/common.gradle'> line: 121

* What went wrong:
Execution failed for task ':sdks:python:test-suites:dataflow:py37:postCommitIT'.
> Process 'command 'sh'' finished with non-zero exit value 1

* Try:
> Run with --stacktrace option to get the stack trace.
> Run with --info or --debug option to get more log output.
> Run with --scan to get full insights.

* Get more help at https://help.gradle.org

Deprecated Gradle features were used in this build, making it incompatible with Gradle 8.0.

You can use '--warning-mode all' to show the individual deprecation warnings and determine if they come from your own scripts or plugins.

See https://docs.gradle.org/7.4/userguide/command_line_interface.html#sec:command_line_warnings

Execution optimizations have been disabled for 1 invalid unit(s) of work during this build to ensure correctness.
Please consult deprecation warnings for more details.

BUILD FAILED in 2h 17m 15s
224 actionable tasks: 154 executed, 64 from cache, 6 up-to-date

Publishing build scan...
https://gradle.com/s/6qf6itjbc7yyw

Build step 'Invoke Gradle script' changed build result to FAILURE
Build step 'Invoke Gradle script' marked build as failure

---------------------------------------------------------------------
To unsubscribe, e-mail: builds-unsubscribe@beam.apache.org
For additional commands, e-mail: builds-help@beam.apache.org


Build failed in Jenkins: beam_PostCommit_Python37 #5125

Posted by Apache Jenkins Server <je...@builds.apache.org>.
See <https://ci-beam.apache.org/job/beam_PostCommit_Python37/5125/display/redirect?page=changes>

Changes:

[noreply] Merge pull request #17382: [BEAM-12356] Close DatasetService leak as


------------------------------------------
[...truncated 33.17 MB...]
INFO:apache_beam.utils.subprocess_server:b'22/04/19 07:33:56 INFO org.apache.beam.runners.fnexecution.control.FnApiControlClientPoolService: getProcessBundleDescriptor request with id 1-15'
INFO:apache_beam.utils.subprocess_server:b'22/04/19 07:33:57 INFO org.apache.beam.runners.spark.SparkPipelineRunner: Job BeamApp-jenkins-0419073353-b2b7cf5_18f3cd20-be3e-441e-8ade-23922f9d2d07: Pipeline translated successfully. Computing outputs'
INFO:apache_beam.utils.subprocess_server:b'22/04/19 07:33:57 WARN software.amazon.awssdk.regions.internal.util.EC2MetadataUtils: Unable to retrieve the requested metadata.'
INFO:apache_beam.utils.subprocess_server:b'22/04/19 07:33:57 WARN software.amazon.awssdk.regions.internal.util.EC2MetadataUtils: Unable to retrieve the requested metadata.'
INFO:apache_beam.utils.subprocess_server:b'22/04/19 07:33:57 WARN software.amazon.awssdk.regions.internal.util.EC2MetadataUtils: Unable to retrieve the requested metadata.'
INFO:apache_beam.utils.subprocess_server:b'22/04/19 07:33:57 WARN software.amazon.awssdk.regions.internal.util.EC2MetadataUtils: Unable to retrieve the requested metadata.'
INFO:apache_beam.utils.subprocess_server:b'22/04/19 07:33:57 INFO org.apache.beam.runners.fnexecution.control.FnApiControlClientPoolService: getProcessBundleDescriptor request with id 1-16'
INFO:apache_beam.io.filebasedsink:Starting finalize_write threads with num_shards: 4 (skipped: 0), batches: 4, num_threads: 4
INFO:apache_beam.io.filebasedsink:Renamed 4 shards in 0.11 seconds.
INFO:apache_beam.utils.subprocess_server:b'22/04/19 07:33:57 INFO org.apache.beam.runners.spark.SparkPipelineRunner: Job BeamApp-jenkins-0419073353-b2b7cf5_18f3cd20-be3e-441e-8ade-23922f9d2d07 finished.'
INFO:apache_beam.runners.portability.portable_runner:Job state changed to DONE
ERROR:apache_beam.runners.worker.data_plane:Failed to read inputs in the data plane.
Traceback (most recent call last):
  File "<https://ci-beam.apache.org/job/beam_PostCommit_Python37/ws/src/sdks/python/apache_beam/runners/worker/data_plane.py",> line 634, in _read_inputs
    for elements in elements_iterator:
  File "<https://ci-beam.apache.org/job/beam_PostCommit_Python37/ws/src/build/gradleenv/2022703441/lib/python3.7/site-packages/grpc/_channel.py",> line 426, in __next__
    return self._next()
  File "<https://ci-beam.apache.org/job/beam_PostCommit_Python37/ws/src/build/gradleenv/2022703441/lib/python3.7/site-packages/grpc/_channel.py",> line 826, in _next
    raise self
grpc._channel._MultiThreadedRendezvous: <_MultiThreadedRendezvous of RPC that terminated with:
	status = StatusCode.UNAVAILABLE
	details = "Socket closed"
	debug_error_string = "{"created":"@1650353637.659158413","description":"Error received from peer ipv6:[::1]:33321","file":"src/core/lib/surface/call.cc","file_line":903,"grpc_message":"Socket closed","grpc_status":14}"
>
Exception in thread read_state:
Traceback (most recent call last):
  File "/usr/lib/python3.7/threading.py", line 926, in _bootstrap_inner
    self.run()
  File "/usr/lib/python3.7/threading.py", line 870, in run
    self._target(*self._args, **self._kwargs)
  File "<https://ci-beam.apache.org/job/beam_PostCommit_Python37/ws/src/sdks/python/apache_beam/runners/worker/sdk_worker.py",> line 990, in pull_responses
    for response in responses:
  File "<https://ci-beam.apache.org/job/beam_PostCommit_Python37/ws/src/build/gradleenv/2022703441/lib/python3.7/site-packages/grpc/_channel.py",> line 426, in __next__
    return self._next()
  File "<https://ci-beam.apache.org/job/beam_PostCommit_Python37/ws/src/build/gradleenv/2022703441/lib/python3.7/site-packages/grpc/_channel.py",> line 826, in _next
    raise self
grpc._channel._MultiThreadedRendezvous: <_MultiThreadedRendezvous of RPC that terminated with:
	status = StatusCode.UNAVAILABLE
	details = "Socket closed"
	debug_error_string = "{"created":"@1650353637.659183638","description":"Error received from peer ipv6:[::1]:43037","file":"src/core/lib/surface/call.cc","file_line":903,"grpc_message":"Socket closed","grpc_status":14}"
>

Exception in thread read_grpc_client_inputs:
Traceback (most recent call last):
  File "/usr/lib/python3.7/threading.py", line 926, in _bootstrap_inner
    self.run()
  File "/usr/lib/python3.7/threading.py", line 870, in run
    self._target(*self._args, **self._kwargs)
  File "<https://ci-beam.apache.org/job/beam_PostCommit_Python37/ws/src/sdks/python/apache_beam/runners/worker/data_plane.py",> line 651, in <lambda>
    target=lambda: self._read_inputs(elements_iterator),
  File "<https://ci-beam.apache.org/job/beam_PostCommit_Python37/ws/src/sdks/python/apache_beam/runners/worker/data_plane.py",> line 634, in _read_inputs
    for elements in elements_iterator:
  File "<https://ci-beam.apache.org/job/beam_PostCommit_Python37/ws/src/build/gradleenv/2022703441/lib/python3.7/site-packages/grpc/_channel.py",> line 426, in __next__
    return self._next()
  File "<https://ci-beam.apache.org/job/beam_PostCommit_Python37/ws/src/build/gradleenv/2022703441/lib/python3.7/site-packages/grpc/_channel.py",> line 826, in _next
    raise self
grpc._channel._MultiThreadedRendezvous: <_MultiThreadedRendezvous of RPC that terminated with:
	status = StatusCode.UNAVAILABLE
	details = "Socket closed"
	debug_error_string = "{"created":"@1650353637.659158413","description":"Error received from peer ipv6:[::1]:33321","file":"src/core/lib/surface/call.cc","file_line":903,"grpc_message":"Socket closed","grpc_status":14}"
>

Exception in thread run_worker_1-1:
Traceback (most recent call last):
  File "/usr/lib/python3.7/threading.py", line 926, in _bootstrap_inner
    self.run()
  File "/usr/lib/python3.7/threading.py", line 870, in run
    self._target(*self._args, **self._kwargs)
  File "<https://ci-beam.apache.org/job/beam_PostCommit_Python37/ws/src/sdks/python/apache_beam/runners/worker/sdk_worker.py",> line 234, in run
    for work_request in self._control_stub.Control(get_responses()):
  File "<https://ci-beam.apache.org/job/beam_PostCommit_Python37/ws/src/build/gradleenv/2022703441/lib/python3.7/site-packages/grpc/_channel.py",> line 426, in __next__
    return self._next()
  File "<https://ci-beam.apache.org/job/beam_PostCommit_Python37/ws/src/build/gradleenv/2022703441/lib/python3.7/site-packages/grpc/_channel.py",> line 826, in _next
    raise self
grpc._channel._MultiThreadedRendezvous: <_MultiThreadedRendezvous of RPC that terminated with:
	status = StatusCode.UNAVAILABLE
	details = "Socket closed"
	debug_error_string = "{"created":"@1650353637.659228369","description":"Error received from peer ipv6:[::1]:33763","file":"src/core/lib/surface/call.cc","file_line":903,"grpc_message":"Socket closed","grpc_status":14}"
>


> Task :sdks:python:test-suites:portable:py37:postCommitPy37
> Task :sdks:python:test-suites:portable:py37:xlangSpannerIOIT

> Task :sdks:python:test-suites:dataflow:py37:postCommitIT
E0419 07:34:41.941584071 4029512 fork_posix.cc:70]           Fork support is only compatible with the epoll1 and poll polling strategies
E0419 07:36:52.849854158 4029472 fork_posix.cc:70]           Fork support is only compatible with the epoll1 and poll polling strategies

> Task :sdks:python:test-suites:portable:py37:xlangSpannerIOIT
Exception in thread read_grpc_client_inputs:
Traceback (most recent call last):
  File "/usr/lib/python3.7/threading.py", line 926, in _bootstrap_inner
    self.run()
  File "/usr/lib/python3.7/threading.py", line 870, in run
    self._target(*self._args, **self._kwargs)
  File "<https://ci-beam.apache.org/job/beam_PostCommit_Python37/ws/src/sdks/python/apache_beam/runners/worker/data_plane.py",> line 651, in <lambda>
    target=lambda: self._read_inputs(elements_iterator),
  File "<https://ci-beam.apache.org/job/beam_PostCommit_Python37/ws/src/sdks/python/apache_beam/runners/worker/data_plane.py",> line 634, in _read_inputs
    for elements in elements_iterator:
  File "<https://ci-beam.apache.org/job/beam_PostCommit_Python37/ws/src/build/gradleenv/2022703441/lib/python3.7/site-packages/grpc/_channel.py",> line 426, in __next__
    return self._next()
  File "<https://ci-beam.apache.org/job/beam_PostCommit_Python37/ws/src/build/gradleenv/2022703441/lib/python3.7/site-packages/grpc/_channel.py",> line 826, in _next
    raise self
grpc._channel._MultiThreadedRendezvous: <_MultiThreadedRendezvous of RPC that terminated with:
	status = StatusCode.CANCELLED
	details = "Multiplexer hanging up"
	debug_error_string = "{"created":"@1650353674.297752010","description":"Error received from peer ipv6:[::1]:45699","file":"src/core/lib/surface/call.cc","file_line":903,"grpc_message":"Multiplexer hanging up","grpc_status":1}"
>


> Task :sdks:python:test-suites:dataflow:py37:postCommitIT
E0419 07:39:40.138143597 4029463 fork_posix.cc:70]           Fork support is only compatible with the epoll1 and poll polling strategies
E0419 07:41:50.094919310 4029512 fork_posix.cc:70]           Fork support is only compatible with the epoll1 and poll polling strategies
E0419 07:46:26.602120735 4029463 fork_posix.cc:70]           Fork support is only compatible with the epoll1 and poll polling strategies
E0419 07:48:19.640501950 4029512 fork_posix.cc:70]           Fork support is only compatible with the epoll1 and poll polling strategies
E0419 07:53:28.204469177 4029463 fork_posix.cc:70]           Fork support is only compatible with the epoll1 and poll polling strategies
E0419 07:55:23.302396880 4029512 fork_posix.cc:70]           Fork support is only compatible with the epoll1 and poll polling strategies
E0419 07:59:45.461625920 4029463 fork_posix.cc:70]           Fork support is only compatible with the epoll1 and poll polling strategies
E0419 08:07:31.730968649 4029463 fork_posix.cc:70]           Fork support is only compatible with the epoll1 and poll polling strategies
E0419 08:12:07.130369902 4029512 fork_posix.cc:70]           Fork support is only compatible with the epoll1 and poll polling strategies
E0419 08:14:32.809330943 4029463 fork_posix.cc:70]           Fork support is only compatible with the epoll1 and poll polling strategies
E0419 08:22:14.480373933 4029463 fork_posix.cc:70]           Fork support is only compatible with the epoll1 and poll polling strategies
E0419 08:28:36.300223578 4029463 fork_posix.cc:70]           Fork support is only compatible with the epoll1 and poll polling strategies
E0419 08:29:07.876644147 4029512 fork_posix.cc:70]           Fork support is only compatible with the epoll1 and poll polling strategies
E0419 08:30:40.011047740 4029466 fork_posix.cc:70]           Fork support is only compatible with the epoll1 and poll polling strategies
E0419 08:35:32.530695364 4029463 fork_posix.cc:70]           Fork support is only compatible with the epoll1 and poll polling strategies
E0419 08:40:58.476379590 4029466 fork_posix.cc:70]           Fork support is only compatible with the epoll1 and poll polling strategies
E0419 08:41:34.549190407 4029463 fork_posix.cc:70]           Fork support is only compatible with the epoll1 and poll polling strategies

> Task :sdks:python:test-suites:dataflow:py37:postCommitIT FAILED

> Task :sdks:python:test-suites:dataflow:py37:spannerioIT
>>> RUNNING integration tests with pipeline options: --runner=TestDataflowRunner --project=apache-beam-testing --region=us-central1 --staging_location=gs://temp-storage-for-end-to-end-tests/staging-it --temp_location=gs://temp-storage-for-end-to-end-tests/temp-it --output=gs://temp-storage-for-end-to-end-tests/py-it-cloud/output --sdk_location=<https://ci-beam.apache.org/job/beam_PostCommit_Python37/ws/src/sdks/python/build/apache-beam.tar.gz> --requirements_file=postcommit_requirements.txt --num_workers=1 --sleep_secs=20 --dataflow_worker_jar=<https://ci-beam.apache.org/job/beam_PostCommit_Python37/ws/src/runners/google-cloud-dataflow-java/worker/build/libs/beam-runners-google-cloud-dataflow-java-fn-api-worker-2.39.0-SNAPSHOT.jar> --kms_key_name=projects/apache-beam-testing/locations/global/keyRings/beam-it/cryptoKeys/test --dataflow_kms_key=projects/apache-beam-testing/locations/global/keyRings/beam-it/cryptoKeys/test
>>>   pytest options: --capture=no --timeout=4500 --color=yes --log-cli-level=INFO --numprocesses=8 --dist=loadfile
>>>   collect markers: -m=spannerio_it
============================= test session starts ==============================
platform linux -- Python 3.7.12, pytest-4.6.11, py-1.11.0, pluggy-0.13.1
rootdir: <https://ci-beam.apache.org/job/beam_PostCommit_Python37/ws/src/sdks/python,> inifile: pytest.ini
plugins: xdist-1.34.0, timeout-1.4.2, forked-1.4.0, requests-mock-1.9.3
timeout: 4500.0s
timeout method: signal
timeout func_only: False
gw0 I / gw1 I / gw2 I / gw3 I / gw4 I / gw5 I / gw6 I / gw7 I
[gw0] Python 3.7.12 (default, Jan 15 2022, 18:42:10)  -- [GCC 9.3.0]
[gw1] Python 3.7.12 (default, Jan 15 2022, 18:42:10)  -- [GCC 9.3.0]
[gw2] Python 3.7.12 (default, Jan 15 2022, 18:42:10)  -- [GCC 9.3.0]
[gw3] Python 3.7.12 (default, Jan 15 2022, 18:42:10)  -- [GCC 9.3.0]
[gw4] Python 3.7.12 (default, Jan 15 2022, 18:42:10)  -- [GCC 9.3.0]
[gw5] Python 3.7.12 (default, Jan 15 2022, 18:42:10)  -- [GCC 9.3.0]
[gw7] Python 3.7.12 (default, Jan 15 2022, 18:42:10)  -- [GCC 9.3.0]
[gw6] Python 3.7.12 (default, Jan 15 2022, 18:42:10)  -- [GCC 9.3.0]
gw0 [15] / gw1 [15] / gw2 [15] / gw3 [15] / gw4 [15] / gw5 [15] / gw6 [15] / gw7 [15]

scheduling tests via LoadFileScheduling

apache_beam/io/gcp/experimental/spannerio_read_it_test.py::SpannerReadIntegrationTest::test_read_via_sql 
apache_beam/io/gcp/experimental/spannerio_write_it_test.py::SpannerWriteIntegrationTest::test_metrics_error_call 
[gw1] SKIPPED apache_beam/io/gcp/experimental/spannerio_write_it_test.py::SpannerWriteIntegrationTest::test_metrics_error_call 
apache_beam/io/gcp/experimental/spannerio_write_it_test.py::SpannerWriteIntegrationTest::test_metrics_ok_call 
[gw1] SKIPPED apache_beam/io/gcp/experimental/spannerio_write_it_test.py::SpannerWriteIntegrationTest::test_metrics_ok_call 
apache_beam/io/gcp/experimental/spannerio_write_it_test.py::SpannerWriteIntegrationTest::test_spanner_error E0419 08:50:48.624868216 4101762 fork_posix.cc:70]           Fork support is only compatible with the epoll1 and poll polling strategies
E0419 08:50:49.338523391 4101759 fork_posix.cc:70]           Fork support is only compatible with the epoll1 and poll polling strategies

[gw0] PASSED apache_beam/io/gcp/experimental/spannerio_read_it_test.py::SpannerReadIntegrationTest::test_read_via_sql 
apache_beam/io/gcp/experimental/spannerio_read_it_test.py::SpannerReadIntegrationTest::test_read_via_table E0419 08:58:00.450739499 4101759 fork_posix.cc:70]           Fork support is only compatible with the epoll1 and poll polling strategies

[gw1] PASSED apache_beam/io/gcp/experimental/spannerio_write_it_test.py::SpannerWriteIntegrationTest::test_spanner_error 
apache_beam/io/gcp/experimental/spannerio_write_it_test.py::SpannerWriteIntegrationTest::test_spanner_update E0419 08:58:45.225332375 4101762 fork_posix.cc:70]           Fork support is only compatible with the epoll1 and poll polling strategies

[gw0] PASSED apache_beam/io/gcp/experimental/spannerio_read_it_test.py::SpannerReadIntegrationTest::test_read_via_table 
apache_beam/io/gcp/experimental/spannerio_read_it_test.py::SpannerReadIntegrationTest::test_sql_metrics_error_call 
[gw0] SKIPPED apache_beam/io/gcp/experimental/spannerio_read_it_test.py::SpannerReadIntegrationTest::test_sql_metrics_error_call 
apache_beam/io/gcp/experimental/spannerio_read_it_test.py::SpannerReadIntegrationTest::test_sql_metrics_ok_call 
[gw0] SKIPPED apache_beam/io/gcp/experimental/spannerio_read_it_test.py::SpannerReadIntegrationTest::test_sql_metrics_ok_call 
apache_beam/io/gcp/experimental/spannerio_read_it_test.py::SpannerReadIntegrationTest::test_table_metrics_error_call 
[gw0] SKIPPED apache_beam/io/gcp/experimental/spannerio_read_it_test.py::SpannerReadIntegrationTest::test_table_metrics_error_call 
apache_beam/io/gcp/experimental/spannerio_read_it_test.py::SpannerReadIntegrationTest::test_table_metrics_ok_call 
[gw0] SKIPPED apache_beam/io/gcp/experimental/spannerio_read_it_test.py::SpannerReadIntegrationTest::test_table_metrics_ok_call 
apache_beam/io/gcp/experimental/spannerio_read_it_test.py::SpannerReadIntegrationTest::test_transaction_sql_metrics_error_call 
[gw0] SKIPPED apache_beam/io/gcp/experimental/spannerio_read_it_test.py::SpannerReadIntegrationTest::test_transaction_sql_metrics_error_call 
apache_beam/io/gcp/experimental/spannerio_read_it_test.py::SpannerReadIntegrationTest::test_transaction_sql_metrics_ok_call 
[gw0] SKIPPED apache_beam/io/gcp/experimental/spannerio_read_it_test.py::SpannerReadIntegrationTest::test_transaction_sql_metrics_ok_call 
apache_beam/io/gcp/experimental/spannerio_read_it_test.py::SpannerReadIntegrationTest::test_transaction_table_metrics_error_call 
[gw0] SKIPPED apache_beam/io/gcp/experimental/spannerio_read_it_test.py::SpannerReadIntegrationTest::test_transaction_table_metrics_error_call 
apache_beam/io/gcp/experimental/spannerio_read_it_test.py::SpannerReadIntegrationTest::test_transaction_table_metrics_ok_call 
[gw0] SKIPPED apache_beam/io/gcp/experimental/spannerio_read_it_test.py::SpannerReadIntegrationTest::test_transaction_table_metrics_ok_call 
[gw1] PASSED apache_beam/io/gcp/experimental/spannerio_write_it_test.py::SpannerWriteIntegrationTest::test_spanner_update 
apache_beam/io/gcp/experimental/spannerio_write_it_test.py::SpannerWriteIntegrationTest::test_write_batches E0419 09:06:01.521001243 4101762 fork_posix.cc:70]           Fork support is only compatible with the epoll1 and poll polling strategies

[gw1] PASSED apache_beam/io/gcp/experimental/spannerio_write_it_test.py::SpannerWriteIntegrationTest::test_write_batches 

=============================== warnings summary ===============================
apache_beam/io/gcp/experimental/spannerio_read_it_test.py:128
  <https://ci-beam.apache.org/job/beam_PostCommit_Python37/ws/src/sdks/python/apache_beam/io/gcp/experimental/spannerio_read_it_test.py>:128: FutureWarning: ReadFromSpanner is experimental. No backwards-compatibility guarantees.
    sql="select * from Users")

apache_beam/io/gcp/experimental/spannerio_write_it_test.py:190
  <https://ci-beam.apache.org/job/beam_PostCommit_Python37/ws/src/sdks/python/apache_beam/io/gcp/experimental/spannerio_write_it_test.py>:190: FutureWarning: WriteToSpanner is experimental. No backwards-compatibility guarantees.
    database_id=self.TEST_DATABASE))

apache_beam/io/gcp/experimental/spannerio_read_it_test.py:117
  <https://ci-beam.apache.org/job/beam_PostCommit_Python37/ws/src/sdks/python/apache_beam/io/gcp/experimental/spannerio_read_it_test.py>:117: FutureWarning: ReadFromSpanner is experimental. No backwards-compatibility guarantees.
    columns=["UserId", "Key"])

apache_beam/io/gcp/experimental/spannerio_write_it_test.py:171
  <https://ci-beam.apache.org/job/beam_PostCommit_Python37/ws/src/sdks/python/apache_beam/io/gcp/experimental/spannerio_write_it_test.py>:171: FutureWarning: WriteToSpanner is experimental. No backwards-compatibility guarantees.
    database_id=self.TEST_DATABASE))

apache_beam/io/gcp/experimental/spannerio_write_it_test.py:135
  <https://ci-beam.apache.org/job/beam_PostCommit_Python37/ws/src/sdks/python/apache_beam/io/gcp/experimental/spannerio_write_it_test.py>:135: FutureWarning: WriteToSpanner is experimental. No backwards-compatibility guarantees.
    max_batch_size_bytes=250))

-- Docs: https://docs.pytest.org/en/latest/warnings.html
- generated xml file: <https://ci-beam.apache.org/job/beam_PostCommit_Python37/ws/src/sdks/python/pytest_postCommitIT-df-py37.xml> -
============= 5 passed, 10 skipped, 5 warnings in 1397.90 seconds ==============

FAILURE: Build failed with an exception.

* Where:
Script '<https://ci-beam.apache.org/job/beam_PostCommit_Python37/ws/src/sdks/python/test-suites/dataflow/common.gradle'> line: 121

* What went wrong:
Execution failed for task ':sdks:python:test-suites:dataflow:py37:postCommitIT'.
> Process 'command 'sh'' finished with non-zero exit value 1

* Try:
> Run with --stacktrace option to get the stack trace.
> Run with --info or --debug option to get more log output.
> Run with --scan to get full insights.

* Get more help at https://help.gradle.org

Deprecated Gradle features were used in this build, making it incompatible with Gradle 8.0.

You can use '--warning-mode all' to show the individual deprecation warnings and determine if they come from your own scripts or plugins.

See https://docs.gradle.org/7.4/userguide/command_line_interface.html#sec:command_line_warnings

Execution optimizations have been disabled for 1 invalid unit(s) of work during this build to ensure correctness.
Please consult deprecation warnings for more details.

BUILD FAILED in 1h 53m 27s
224 actionable tasks: 158 executed, 60 from cache, 6 up-to-date

Publishing build scan...
https://gradle.com/s/44ku47oj3bdmg

Build step 'Invoke Gradle script' changed build result to FAILURE
Build step 'Invoke Gradle script' marked build as failure

---------------------------------------------------------------------
To unsubscribe, e-mail: builds-unsubscribe@beam.apache.org
For additional commands, e-mail: builds-help@beam.apache.org


Build failed in Jenkins: beam_PostCommit_Python37 #5124

Posted by Apache Jenkins Server <je...@builds.apache.org>.
See <https://ci-beam.apache.org/job/beam_PostCommit_Python37/5124/display/redirect?page=changes>

Changes:

[Heejong Lee] [BEAM-14251] add output_coder_override to ExpansionRequest

[Heejong Lee] remove null

[Heejong Lee] better error msg

[Heejong Lee] update from comments

[noreply] [BEAM-14316] Introducing KafkaIO.Read implementation compatibility

[noreply] [BEAM-14290] Address staticcheck warnings in the reflectx package

[noreply] [BEAM-14302] Simply bools in fn.go, genx_test.go (#17356)


------------------------------------------
[...truncated 57.24 MB...]
apache_beam/io/gcp/bigquery.py:2476
  <https://ci-beam.apache.org/job/beam_PostCommit_Python37/ws/src/sdks/python/apache_beam/io/gcp/bigquery.py>:2476: BeamDeprecationWarning: options is deprecated since First stable release. References to <pipeline>.options will not be supported
    | _PassThroughThenCleanup(files_to_remove_pcoll))

apache_beam/io/gcp/bigquery.py:2139
apache_beam/io/gcp/bigquery.py:2139
apache_beam/io/gcp/bigquery.py:2139
apache_beam/io/gcp/bigquery.py:2139
apache_beam/io/gcp/bigquery.py:2139
apache_beam/io/gcp/bigquery.py:2139
apache_beam/io/gcp/bigquery.py:2139
apache_beam/io/gcp/bigquery.py:2139
apache_beam/io/gcp/bigquery.py:2139
apache_beam/io/gcp/bigquery.py:2139
apache_beam/io/gcp/bigquery.py:2139
apache_beam/io/gcp/bigquery.py:2139
  <https://ci-beam.apache.org/job/beam_PostCommit_Python37/ws/src/sdks/python/apache_beam/io/gcp/bigquery.py>:2139: BeamDeprecationWarning: options is deprecated since First stable release. References to <pipeline>.options will not be supported
    self.table_reference.projectId = pcoll.pipeline.options.view_as(

apache_beam/io/gcp/bigquery_file_loads.py:1128
apache_beam/io/gcp/bigquery_file_loads.py:1128
apache_beam/io/gcp/bigquery_file_loads.py:1128
apache_beam/io/gcp/bigquery_file_loads.py:1128
apache_beam/io/gcp/bigquery_file_loads.py:1128
apache_beam/io/gcp/bigquery_file_loads.py:1128
apache_beam/io/gcp/bigquery_file_loads.py:1128
apache_beam/io/gcp/bigquery_file_loads.py:1128
apache_beam/io/gcp/bigquery_file_loads.py:1128
apache_beam/io/gcp/bigquery_file_loads.py:1128
apache_beam/io/gcp/bigquery_file_loads.py:1128
apache_beam/io/gcp/bigquery_file_loads.py:1128
apache_beam/io/gcp/bigquery_file_loads.py:1128
apache_beam/io/gcp/bigquery_file_loads.py:1128
apache_beam/io/gcp/bigquery_file_loads.py:1128
apache_beam/io/gcp/bigquery_file_loads.py:1128
apache_beam/io/gcp/bigquery_file_loads.py:1128
  <https://ci-beam.apache.org/job/beam_PostCommit_Python37/ws/src/sdks/python/apache_beam/io/gcp/bigquery_file_loads.py>:1128: BeamDeprecationWarning: options is deprecated since First stable release. References to <pipeline>.options will not be supported
    temp_location = p.options.view_as(GoogleCloudOptions).temp_location

apache_beam/io/gcp/bigquery_file_loads.py:1130
apache_beam/io/gcp/bigquery_file_loads.py:1130
apache_beam/io/gcp/bigquery_file_loads.py:1130
apache_beam/io/gcp/bigquery_file_loads.py:1130
apache_beam/io/gcp/bigquery_file_loads.py:1130
apache_beam/io/gcp/bigquery_file_loads.py:1130
apache_beam/io/gcp/bigquery_file_loads.py:1130
apache_beam/io/gcp/bigquery_file_loads.py:1130
apache_beam/io/gcp/bigquery_file_loads.py:1130
apache_beam/io/gcp/bigquery_file_loads.py:1130
apache_beam/io/gcp/bigquery_file_loads.py:1130
apache_beam/io/gcp/bigquery_file_loads.py:1130
apache_beam/io/gcp/bigquery_file_loads.py:1130
apache_beam/io/gcp/bigquery_file_loads.py:1130
apache_beam/io/gcp/bigquery_file_loads.py:1130
apache_beam/io/gcp/bigquery_file_loads.py:1130
apache_beam/io/gcp/bigquery_file_loads.py:1130
  <https://ci-beam.apache.org/job/beam_PostCommit_Python37/ws/src/sdks/python/apache_beam/io/gcp/bigquery_file_loads.py>:1130: BeamDeprecationWarning: options is deprecated since First stable release. References to <pipeline>.options will not be supported
    p.options.view_as(GoogleCloudOptions).job_name or 'AUTOMATIC_JOB_NAME')

apache_beam/io/gcp/tests/utils.py:100
  <https://ci-beam.apache.org/job/beam_PostCommit_Python37/ws/src/sdks/python/apache_beam/io/gcp/tests/utils.py>:100: PendingDeprecationWarning: Client.dataset is deprecated and will be removed in a future version. Use a string like 'my_project.my_dataset' or a cloud.google.bigquery.DatasetReference object, instead.
    table_ref = client.dataset(dataset_id).table(table_id)

apache_beam/examples/dataframe/flight_delays.py:47
  <https://ci-beam.apache.org/job/beam_PostCommit_Python37/ws/src/sdks/python/apache_beam/examples/dataframe/flight_delays.py>:47: FutureWarning: Dropping of nuisance columns in DataFrame reductions (with 'numeric_only=None') is deprecated; in a future version this will raise TypeError.  Select only valid columns before calling the reduction.
    return airline_df[at_top_airports].mean()

apache_beam/dataframe/io.py:632
apache_beam/dataframe/io.py:632
apache_beam/dataframe/io.py:632
  <https://ci-beam.apache.org/job/beam_PostCommit_Python37/ws/src/sdks/python/apache_beam/dataframe/io.py>:632: FutureWarning: WriteToFiles is experimental.
    sink=lambda _: _WriteToPandasFileSink(

apache_beam/io/fileio.py:550
apache_beam/io/fileio.py:550
apache_beam/io/fileio.py:550
  <https://ci-beam.apache.org/job/beam_PostCommit_Python37/ws/src/sdks/python/apache_beam/io/fileio.py>:550: BeamDeprecationWarning: options is deprecated since First stable release. References to <pipeline>.options will not be supported
    p.options.view_as(GoogleCloudOptions).temp_location or

apache_beam/io/gcp/bigquery_test.py:1183
  <https://ci-beam.apache.org/job/beam_PostCommit_Python37/ws/src/sdks/python/apache_beam/io/gcp/bigquery_test.py>:1183: BeamDeprecationWarning: options is deprecated since First stable release. References to <pipeline>.options will not be supported
    streaming = self.test_pipeline.options.view_as(StandardOptions).streaming

apache_beam/io/gcp/bigquery_read_it_test.py:167
  <https://ci-beam.apache.org/job/beam_PostCommit_Python37/ws/src/sdks/python/apache_beam/io/gcp/bigquery_read_it_test.py>:167: BeamDeprecationWarning: BigQuerySource is deprecated since 2.25.0. Use ReadFromBigQuery instead.
    beam.io.BigQuerySource(query=self.query, use_standard_sql=True)))

apache_beam/io/gcp/bigquery_read_it_test.py:556
  <https://ci-beam.apache.org/job/beam_PostCommit_Python37/ws/src/sdks/python/apache_beam/io/gcp/bigquery_read_it_test.py>:556: BeamDeprecationWarning: BigQuerySource is deprecated since 2.25.0. Use ReadFromBigQuery instead.
    beam.io.BigQuerySource(query=self.query, use_standard_sql=True)))

apache_beam/io/gcp/big_query_query_to_table_pipeline.py:84
apache_beam/io/gcp/big_query_query_to_table_pipeline.py:84
  <https://ci-beam.apache.org/job/beam_PostCommit_Python37/ws/src/sdks/python/apache_beam/io/gcp/big_query_query_to_table_pipeline.py>:84: BeamDeprecationWarning: BigQuerySource is deprecated since 2.25.0. Use ReadFromBigQuery instead.
    kms_key=kms_key))

apache_beam/runners/dataflow/ptransform_overrides.py:323
apache_beam/runners/dataflow/ptransform_overrides.py:323
  <https://ci-beam.apache.org/job/beam_PostCommit_Python37/ws/src/sdks/python/apache_beam/runners/dataflow/ptransform_overrides.py>:323: BeamDeprecationWarning: BigQuerySink is deprecated since 2.11.0. Use WriteToBigQuery instead.
    kms_key=self.kms_key))

apache_beam/io/gcp/bigquery_read_it_test.py:670
  <https://ci-beam.apache.org/job/beam_PostCommit_Python37/ws/src/sdks/python/apache_beam/io/gcp/bigquery_read_it_test.py>:670: FutureWarning: ReadAllFromBigQuery is experimental.
    | beam.io.ReadAllFromBigQuery())

apache_beam/io/gcp/bigquery.py:2617
  <https://ci-beam.apache.org/job/beam_PostCommit_Python37/ws/src/sdks/python/apache_beam/io/gcp/bigquery.py>:2617: BeamDeprecationWarning: options is deprecated since First stable release. References to <pipeline>.options will not be supported
    job_name = pcoll.pipeline.options.view_as(GoogleCloudOptions).job_name

apache_beam/io/gcp/bigquery.py:2618
  <https://ci-beam.apache.org/job/beam_PostCommit_Python37/ws/src/sdks/python/apache_beam/io/gcp/bigquery.py>:2618: BeamDeprecationWarning: options is deprecated since First stable release. References to <pipeline>.options will not be supported
    project = pcoll.pipeline.options.view_as(GoogleCloudOptions).project

apache_beam/io/gcp/bigquery.py:2631
  <https://ci-beam.apache.org/job/beam_PostCommit_Python37/ws/src/sdks/python/apache_beam/io/gcp/bigquery.py>:2631: BeamDeprecationWarning: options is deprecated since First stable release. References to <pipeline>.options will not be supported
    options=pcoll.pipeline.options,

apache_beam/ml/gcp/cloud_dlp_it_test.py:77
  <https://ci-beam.apache.org/job/beam_PostCommit_Python37/ws/src/sdks/python/apache_beam/ml/gcp/cloud_dlp_it_test.py>:77: FutureWarning: MaskDetectedDetails is experimental.
    inspection_config=INSPECT_CONFIG))

apache_beam/ml/gcp/cloud_dlp_it_test.py:87
  <https://ci-beam.apache.org/job/beam_PostCommit_Python37/ws/src/sdks/python/apache_beam/ml/gcp/cloud_dlp_it_test.py>:87: FutureWarning: InspectForDetails is experimental.
    | beam.ParDo(extract_inspection_results).with_outputs(

-- Docs: https://docs.pytest.org/en/latest/warnings.html
- generated xml file: <https://ci-beam.apache.org/job/beam_PostCommit_Python37/ws/src/sdks/python/pytest_postCommitIT-df-py37.xml> -
======= 1 failed, 60 passed, 8 skipped, 166 warnings in 5359.08 seconds ========

> Task :sdks:python:test-suites:dataflow:py37:postCommitIT FAILED

> Task :sdks:python:test-suites:dataflow:py37:spannerioIT
>>> RUNNING integration tests with pipeline options: --runner=TestDataflowRunner --project=apache-beam-testing --region=us-central1 --staging_location=gs://temp-storage-for-end-to-end-tests/staging-it --temp_location=gs://temp-storage-for-end-to-end-tests/temp-it --output=gs://temp-storage-for-end-to-end-tests/py-it-cloud/output --sdk_location=<https://ci-beam.apache.org/job/beam_PostCommit_Python37/ws/src/sdks/python/build/apache-beam.tar.gz> --requirements_file=postcommit_requirements.txt --num_workers=1 --sleep_secs=20 --dataflow_worker_jar=<https://ci-beam.apache.org/job/beam_PostCommit_Python37/ws/src/runners/google-cloud-dataflow-java/worker/build/libs/beam-runners-google-cloud-dataflow-java-fn-api-worker-2.39.0-SNAPSHOT.jar> --kms_key_name=projects/apache-beam-testing/locations/global/keyRings/beam-it/cryptoKeys/test --dataflow_kms_key=projects/apache-beam-testing/locations/global/keyRings/beam-it/cryptoKeys/test
>>>   pytest options: --capture=no --timeout=4500 --color=yes --log-cli-level=INFO --numprocesses=8 --dist=loadfile
>>>   collect markers: -m=spannerio_it
============================= test session starts ==============================
platform linux -- Python 3.7.12, pytest-4.6.11, py-1.11.0, pluggy-0.13.1
rootdir: <https://ci-beam.apache.org/job/beam_PostCommit_Python37/ws/src/sdks/python,> inifile: pytest.ini
plugins: xdist-1.34.0, timeout-1.4.2, forked-1.4.0, requests-mock-1.9.3
timeout: 4500.0s
timeout method: signal
timeout func_only: False
gw0 I / gw1 I / gw2 I / gw3 I / gw4 I / gw5 I / gw6 I / gw7 I
[gw0] Python 3.7.12 (default, Jan 15 2022, 18:42:10)  -- [GCC 9.3.0]
[gw1] Python 3.7.12 (default, Jan 15 2022, 18:42:10)  -- [GCC 9.3.0]
[gw2] Python 3.7.12 (default, Jan 15 2022, 18:42:10)  -- [GCC 9.3.0]
[gw3] Python 3.7.12 (default, Jan 15 2022, 18:42:10)  -- [GCC 9.3.0]
[gw4] Python 3.7.12 (default, Jan 15 2022, 18:42:10)  -- [GCC 9.3.0]
[gw5] Python 3.7.12 (default, Jan 15 2022, 18:42:10)  -- [GCC 9.3.0]
[gw6] Python 3.7.12 (default, Jan 15 2022, 18:42:10)  -- [GCC 9.3.0]
[gw7] Python 3.7.12 (default, Jan 15 2022, 18:42:10)  -- [GCC 9.3.0]
gw0 [15] / gw1 [15] / gw2 [15] / gw3 [15] / gw4 [15] / gw5 [15] / gw6 [15] / gw7 [15]

scheduling tests via LoadFileScheduling

apache_beam/io/gcp/experimental/spannerio_write_it_test.py::SpannerWriteIntegrationTest::test_metrics_error_call 
apache_beam/io/gcp/experimental/spannerio_read_it_test.py::SpannerReadIntegrationTest::test_read_via_sql 
[gw1] SKIPPED apache_beam/io/gcp/experimental/spannerio_write_it_test.py::SpannerWriteIntegrationTest::test_metrics_error_call 
apache_beam/io/gcp/experimental/spannerio_write_it_test.py::SpannerWriteIntegrationTest::test_metrics_ok_call 
[gw1] SKIPPED apache_beam/io/gcp/experimental/spannerio_write_it_test.py::SpannerWriteIntegrationTest::test_metrics_ok_call 
apache_beam/io/gcp/experimental/spannerio_write_it_test.py::SpannerWriteIntegrationTest::test_spanner_error E0419 02:55:16.285906750 3708093 fork_posix.cc:70]           Fork support is only compatible with the epoll1 and poll polling strategies
E0419 02:55:17.442522214 3708090 fork_posix.cc:70]           Fork support is only compatible with the epoll1 and poll polling strategies

[gw0] PASSED apache_beam/io/gcp/experimental/spannerio_read_it_test.py::SpannerReadIntegrationTest::test_read_via_sql 
apache_beam/io/gcp/experimental/spannerio_read_it_test.py::SpannerReadIntegrationTest::test_read_via_table E0419 03:01:43.403794775 3708090 fork_posix.cc:70]           Fork support is only compatible with the epoll1 and poll polling strategies

[gw1] PASSED apache_beam/io/gcp/experimental/spannerio_write_it_test.py::SpannerWriteIntegrationTest::test_spanner_error 
apache_beam/io/gcp/experimental/spannerio_write_it_test.py::SpannerWriteIntegrationTest::test_spanner_update E0419 03:01:48.861717005 3708093 fork_posix.cc:70]           Fork support is only compatible with the epoll1 and poll polling strategies

[gw1] PASSED apache_beam/io/gcp/experimental/spannerio_write_it_test.py::SpannerWriteIntegrationTest::test_spanner_update 
apache_beam/io/gcp/experimental/spannerio_write_it_test.py::SpannerWriteIntegrationTest::test_write_batches E0419 03:08:37.041048345 3708093 fork_posix.cc:70]           Fork support is only compatible with the epoll1 and poll polling strategies

[gw0] PASSED apache_beam/io/gcp/experimental/spannerio_read_it_test.py::SpannerReadIntegrationTest::test_read_via_table 
apache_beam/io/gcp/experimental/spannerio_read_it_test.py::SpannerReadIntegrationTest::test_sql_metrics_error_call 
[gw0] SKIPPED apache_beam/io/gcp/experimental/spannerio_read_it_test.py::SpannerReadIntegrationTest::test_sql_metrics_error_call 
apache_beam/io/gcp/experimental/spannerio_read_it_test.py::SpannerReadIntegrationTest::test_sql_metrics_ok_call 
[gw0] SKIPPED apache_beam/io/gcp/experimental/spannerio_read_it_test.py::SpannerReadIntegrationTest::test_sql_metrics_ok_call 
apache_beam/io/gcp/experimental/spannerio_read_it_test.py::SpannerReadIntegrationTest::test_table_metrics_error_call 
[gw0] SKIPPED apache_beam/io/gcp/experimental/spannerio_read_it_test.py::SpannerReadIntegrationTest::test_table_metrics_error_call 
apache_beam/io/gcp/experimental/spannerio_read_it_test.py::SpannerReadIntegrationTest::test_table_metrics_ok_call 
[gw0] SKIPPED apache_beam/io/gcp/experimental/spannerio_read_it_test.py::SpannerReadIntegrationTest::test_table_metrics_ok_call 
apache_beam/io/gcp/experimental/spannerio_read_it_test.py::SpannerReadIntegrationTest::test_transaction_sql_metrics_error_call 
[gw0] SKIPPED apache_beam/io/gcp/experimental/spannerio_read_it_test.py::SpannerReadIntegrationTest::test_transaction_sql_metrics_error_call 
apache_beam/io/gcp/experimental/spannerio_read_it_test.py::SpannerReadIntegrationTest::test_transaction_sql_metrics_ok_call 
[gw0] SKIPPED apache_beam/io/gcp/experimental/spannerio_read_it_test.py::SpannerReadIntegrationTest::test_transaction_sql_metrics_ok_call 
apache_beam/io/gcp/experimental/spannerio_read_it_test.py::SpannerReadIntegrationTest::test_transaction_table_metrics_error_call 
[gw0] SKIPPED apache_beam/io/gcp/experimental/spannerio_read_it_test.py::SpannerReadIntegrationTest::test_transaction_table_metrics_error_call 
apache_beam/io/gcp/experimental/spannerio_read_it_test.py::SpannerReadIntegrationTest::test_transaction_table_metrics_ok_call 
[gw0] SKIPPED apache_beam/io/gcp/experimental/spannerio_read_it_test.py::SpannerReadIntegrationTest::test_transaction_table_metrics_ok_call 
[gw1] PASSED apache_beam/io/gcp/experimental/spannerio_write_it_test.py::SpannerWriteIntegrationTest::test_write_batches 

=============================== warnings summary ===============================
apache_beam/io/gcp/experimental/spannerio_read_it_test.py:128
  <https://ci-beam.apache.org/job/beam_PostCommit_Python37/ws/src/sdks/python/apache_beam/io/gcp/experimental/spannerio_read_it_test.py>:128: FutureWarning: ReadFromSpanner is experimental. No backwards-compatibility guarantees.
    sql="select * from Users")

apache_beam/io/gcp/experimental/spannerio_write_it_test.py:190
  <https://ci-beam.apache.org/job/beam_PostCommit_Python37/ws/src/sdks/python/apache_beam/io/gcp/experimental/spannerio_write_it_test.py>:190: FutureWarning: WriteToSpanner is experimental. No backwards-compatibility guarantees.
    database_id=self.TEST_DATABASE))

apache_beam/io/gcp/experimental/spannerio_write_it_test.py:171
  <https://ci-beam.apache.org/job/beam_PostCommit_Python37/ws/src/sdks/python/apache_beam/io/gcp/experimental/spannerio_write_it_test.py>:171: FutureWarning: WriteToSpanner is experimental. No backwards-compatibility guarantees.
    database_id=self.TEST_DATABASE))

apache_beam/io/gcp/experimental/spannerio_read_it_test.py:117
  <https://ci-beam.apache.org/job/beam_PostCommit_Python37/ws/src/sdks/python/apache_beam/io/gcp/experimental/spannerio_read_it_test.py>:117: FutureWarning: ReadFromSpanner is experimental. No backwards-compatibility guarantees.
    columns=["UserId", "Key"])

apache_beam/io/gcp/experimental/spannerio_write_it_test.py:135
  <https://ci-beam.apache.org/job/beam_PostCommit_Python37/ws/src/sdks/python/apache_beam/io/gcp/experimental/spannerio_write_it_test.py>:135: FutureWarning: WriteToSpanner is experimental. No backwards-compatibility guarantees.
    max_batch_size_bytes=250))

-- Docs: https://docs.pytest.org/en/latest/warnings.html
- generated xml file: <https://ci-beam.apache.org/job/beam_PostCommit_Python37/ws/src/sdks/python/pytest_postCommitIT-df-py37.xml> -
============= 5 passed, 10 skipped, 5 warnings in 1270.85 seconds ==============

FAILURE: Build failed with an exception.

* Where:
Script '<https://ci-beam.apache.org/job/beam_PostCommit_Python37/ws/src/sdks/python/test-suites/dataflow/common.gradle'> line: 121

* What went wrong:
Execution failed for task ':sdks:python:test-suites:dataflow:py37:postCommitIT'.
> Process 'command 'sh'' finished with non-zero exit value 1

* Try:
> Run with --stacktrace option to get the stack trace.
> Run with --info or --debug option to get more log output.
> Run with --scan to get full insights.

* Get more help at https://help.gradle.org

Deprecated Gradle features were used in this build, making it incompatible with Gradle 8.0.

You can use '--warning-mode all' to show the individual deprecation warnings and determine if they come from your own scripts or plugins.

See https://docs.gradle.org/7.4/userguide/command_line_interface.html#sec:command_line_warnings

Execution optimizations have been disabled for 1 invalid unit(s) of work during this build to ensure correctness.
Please consult deprecation warnings for more details.

BUILD FAILED in 1h 55m 45s
224 actionable tasks: 178 executed, 40 from cache, 6 up-to-date

Publishing build scan...
https://gradle.com/s/s5vidjoz7cu6g

Build step 'Invoke Gradle script' changed build result to FAILURE
Build step 'Invoke Gradle script' marked build as failure

---------------------------------------------------------------------
To unsubscribe, e-mail: builds-unsubscribe@beam.apache.org
For additional commands, e-mail: builds-help@beam.apache.org


Build failed in Jenkins: beam_PostCommit_Python37 #5123

Posted by Apache Jenkins Server <je...@builds.apache.org>.
See <https://ci-beam.apache.org/job/beam_PostCommit_Python37/5123/display/redirect?page=changes>

Changes:

[rarokni] [BEAM-14307] Fix Slow Side input pattern bug in sample


------------------------------------------
[...truncated 57.13 MB...]
apache_beam/io/gcp/bigquery.py:2476
  <https://ci-beam.apache.org/job/beam_PostCommit_Python37/ws/src/sdks/python/apache_beam/io/gcp/bigquery.py>:2476: BeamDeprecationWarning: options is deprecated since First stable release. References to <pipeline>.options will not be supported
    | _PassThroughThenCleanup(files_to_remove_pcoll))

apache_beam/io/gcp/bigquery.py:2139
apache_beam/io/gcp/bigquery.py:2139
apache_beam/io/gcp/bigquery.py:2139
apache_beam/io/gcp/bigquery.py:2139
apache_beam/io/gcp/bigquery.py:2139
apache_beam/io/gcp/bigquery.py:2139
apache_beam/io/gcp/bigquery.py:2139
apache_beam/io/gcp/bigquery.py:2139
apache_beam/io/gcp/bigquery.py:2139
apache_beam/io/gcp/bigquery.py:2139
apache_beam/io/gcp/bigquery.py:2139
apache_beam/io/gcp/bigquery.py:2139
  <https://ci-beam.apache.org/job/beam_PostCommit_Python37/ws/src/sdks/python/apache_beam/io/gcp/bigquery.py>:2139: BeamDeprecationWarning: options is deprecated since First stable release. References to <pipeline>.options will not be supported
    self.table_reference.projectId = pcoll.pipeline.options.view_as(

apache_beam/io/gcp/bigquery_file_loads.py:1128
apache_beam/io/gcp/bigquery_file_loads.py:1128
apache_beam/io/gcp/bigquery_file_loads.py:1128
apache_beam/io/gcp/bigquery_file_loads.py:1128
apache_beam/io/gcp/bigquery_file_loads.py:1128
apache_beam/io/gcp/bigquery_file_loads.py:1128
apache_beam/io/gcp/bigquery_file_loads.py:1128
apache_beam/io/gcp/bigquery_file_loads.py:1128
apache_beam/io/gcp/bigquery_file_loads.py:1128
apache_beam/io/gcp/bigquery_file_loads.py:1128
apache_beam/io/gcp/bigquery_file_loads.py:1128
apache_beam/io/gcp/bigquery_file_loads.py:1128
apache_beam/io/gcp/bigquery_file_loads.py:1128
apache_beam/io/gcp/bigquery_file_loads.py:1128
apache_beam/io/gcp/bigquery_file_loads.py:1128
apache_beam/io/gcp/bigquery_file_loads.py:1128
apache_beam/io/gcp/bigquery_file_loads.py:1128
  <https://ci-beam.apache.org/job/beam_PostCommit_Python37/ws/src/sdks/python/apache_beam/io/gcp/bigquery_file_loads.py>:1128: BeamDeprecationWarning: options is deprecated since First stable release. References to <pipeline>.options will not be supported
    temp_location = p.options.view_as(GoogleCloudOptions).temp_location

apache_beam/io/gcp/bigquery_file_loads.py:1130
apache_beam/io/gcp/bigquery_file_loads.py:1130
apache_beam/io/gcp/bigquery_file_loads.py:1130
apache_beam/io/gcp/bigquery_file_loads.py:1130
apache_beam/io/gcp/bigquery_file_loads.py:1130
apache_beam/io/gcp/bigquery_file_loads.py:1130
apache_beam/io/gcp/bigquery_file_loads.py:1130
apache_beam/io/gcp/bigquery_file_loads.py:1130
apache_beam/io/gcp/bigquery_file_loads.py:1130
apache_beam/io/gcp/bigquery_file_loads.py:1130
apache_beam/io/gcp/bigquery_file_loads.py:1130
apache_beam/io/gcp/bigquery_file_loads.py:1130
apache_beam/io/gcp/bigquery_file_loads.py:1130
apache_beam/io/gcp/bigquery_file_loads.py:1130
apache_beam/io/gcp/bigquery_file_loads.py:1130
apache_beam/io/gcp/bigquery_file_loads.py:1130
apache_beam/io/gcp/bigquery_file_loads.py:1130
  <https://ci-beam.apache.org/job/beam_PostCommit_Python37/ws/src/sdks/python/apache_beam/io/gcp/bigquery_file_loads.py>:1130: BeamDeprecationWarning: options is deprecated since First stable release. References to <pipeline>.options will not be supported
    p.options.view_as(GoogleCloudOptions).job_name or 'AUTOMATIC_JOB_NAME')

apache_beam/io/gcp/tests/utils.py:100
  <https://ci-beam.apache.org/job/beam_PostCommit_Python37/ws/src/sdks/python/apache_beam/io/gcp/tests/utils.py>:100: PendingDeprecationWarning: Client.dataset is deprecated and will be removed in a future version. Use a string like 'my_project.my_dataset' or a cloud.google.bigquery.DatasetReference object, instead.
    table_ref = client.dataset(dataset_id).table(table_id)

apache_beam/examples/dataframe/flight_delays.py:47
  <https://ci-beam.apache.org/job/beam_PostCommit_Python37/ws/src/sdks/python/apache_beam/examples/dataframe/flight_delays.py>:47: FutureWarning: Dropping of nuisance columns in DataFrame reductions (with 'numeric_only=None') is deprecated; in a future version this will raise TypeError.  Select only valid columns before calling the reduction.
    return airline_df[at_top_airports].mean()

apache_beam/dataframe/io.py:632
apache_beam/dataframe/io.py:632
apache_beam/dataframe/io.py:632
  <https://ci-beam.apache.org/job/beam_PostCommit_Python37/ws/src/sdks/python/apache_beam/dataframe/io.py>:632: FutureWarning: WriteToFiles is experimental.
    sink=lambda _: _WriteToPandasFileSink(

apache_beam/io/fileio.py:550
apache_beam/io/fileio.py:550
apache_beam/io/fileio.py:550
  <https://ci-beam.apache.org/job/beam_PostCommit_Python37/ws/src/sdks/python/apache_beam/io/fileio.py>:550: BeamDeprecationWarning: options is deprecated since First stable release. References to <pipeline>.options will not be supported
    p.options.view_as(GoogleCloudOptions).temp_location or

apache_beam/io/gcp/bigquery_test.py:1183
  <https://ci-beam.apache.org/job/beam_PostCommit_Python37/ws/src/sdks/python/apache_beam/io/gcp/bigquery_test.py>:1183: BeamDeprecationWarning: options is deprecated since First stable release. References to <pipeline>.options will not be supported
    streaming = self.test_pipeline.options.view_as(StandardOptions).streaming

apache_beam/io/gcp/bigquery_read_it_test.py:167
  <https://ci-beam.apache.org/job/beam_PostCommit_Python37/ws/src/sdks/python/apache_beam/io/gcp/bigquery_read_it_test.py>:167: BeamDeprecationWarning: BigQuerySource is deprecated since 2.25.0. Use ReadFromBigQuery instead.
    beam.io.BigQuerySource(query=self.query, use_standard_sql=True)))

apache_beam/io/gcp/big_query_query_to_table_pipeline.py:84
apache_beam/io/gcp/big_query_query_to_table_pipeline.py:84
  <https://ci-beam.apache.org/job/beam_PostCommit_Python37/ws/src/sdks/python/apache_beam/io/gcp/big_query_query_to_table_pipeline.py>:84: BeamDeprecationWarning: BigQuerySource is deprecated since 2.25.0. Use ReadFromBigQuery instead.
    kms_key=kms_key))

apache_beam/runners/dataflow/ptransform_overrides.py:323
apache_beam/runners/dataflow/ptransform_overrides.py:323
  <https://ci-beam.apache.org/job/beam_PostCommit_Python37/ws/src/sdks/python/apache_beam/runners/dataflow/ptransform_overrides.py>:323: BeamDeprecationWarning: BigQuerySink is deprecated since 2.11.0. Use WriteToBigQuery instead.
    kms_key=self.kms_key))

apache_beam/io/gcp/bigquery_read_it_test.py:556
  <https://ci-beam.apache.org/job/beam_PostCommit_Python37/ws/src/sdks/python/apache_beam/io/gcp/bigquery_read_it_test.py>:556: BeamDeprecationWarning: BigQuerySource is deprecated since 2.25.0. Use ReadFromBigQuery instead.
    beam.io.BigQuerySource(query=self.query, use_standard_sql=True)))

apache_beam/io/gcp/bigquery_read_it_test.py:670
  <https://ci-beam.apache.org/job/beam_PostCommit_Python37/ws/src/sdks/python/apache_beam/io/gcp/bigquery_read_it_test.py>:670: FutureWarning: ReadAllFromBigQuery is experimental.
    | beam.io.ReadAllFromBigQuery())

apache_beam/io/gcp/bigquery.py:2617
  <https://ci-beam.apache.org/job/beam_PostCommit_Python37/ws/src/sdks/python/apache_beam/io/gcp/bigquery.py>:2617: BeamDeprecationWarning: options is deprecated since First stable release. References to <pipeline>.options will not be supported
    job_name = pcoll.pipeline.options.view_as(GoogleCloudOptions).job_name

apache_beam/io/gcp/bigquery.py:2618
  <https://ci-beam.apache.org/job/beam_PostCommit_Python37/ws/src/sdks/python/apache_beam/io/gcp/bigquery.py>:2618: BeamDeprecationWarning: options is deprecated since First stable release. References to <pipeline>.options will not be supported
    project = pcoll.pipeline.options.view_as(GoogleCloudOptions).project

apache_beam/io/gcp/bigquery.py:2631
  <https://ci-beam.apache.org/job/beam_PostCommit_Python37/ws/src/sdks/python/apache_beam/io/gcp/bigquery.py>:2631: BeamDeprecationWarning: options is deprecated since First stable release. References to <pipeline>.options will not be supported
    options=pcoll.pipeline.options,

apache_beam/ml/gcp/cloud_dlp_it_test.py:77
  <https://ci-beam.apache.org/job/beam_PostCommit_Python37/ws/src/sdks/python/apache_beam/ml/gcp/cloud_dlp_it_test.py>:77: FutureWarning: MaskDetectedDetails is experimental.
    inspection_config=INSPECT_CONFIG))

apache_beam/ml/gcp/cloud_dlp_it_test.py:87
  <https://ci-beam.apache.org/job/beam_PostCommit_Python37/ws/src/sdks/python/apache_beam/ml/gcp/cloud_dlp_it_test.py>:87: FutureWarning: InspectForDetails is experimental.
    | beam.ParDo(extract_inspection_results).with_outputs(

-- Docs: https://docs.pytest.org/en/latest/warnings.html
- generated xml file: <https://ci-beam.apache.org/job/beam_PostCommit_Python37/ws/src/sdks/python/pytest_postCommitIT-df-py37.xml> -
======= 1 failed, 60 passed, 8 skipped, 172 warnings in 5444.65 seconds ========

> Task :sdks:python:test-suites:dataflow:py37:postCommitIT FAILED

> Task :sdks:python:test-suites:dataflow:py37:spannerioIT
>>> RUNNING integration tests with pipeline options: --runner=TestDataflowRunner --project=apache-beam-testing --region=us-central1 --staging_location=gs://temp-storage-for-end-to-end-tests/staging-it --temp_location=gs://temp-storage-for-end-to-end-tests/temp-it --output=gs://temp-storage-for-end-to-end-tests/py-it-cloud/output --sdk_location=<https://ci-beam.apache.org/job/beam_PostCommit_Python37/ws/src/sdks/python/build/apache-beam.tar.gz> --requirements_file=postcommit_requirements.txt --num_workers=1 --sleep_secs=20 --dataflow_worker_jar=<https://ci-beam.apache.org/job/beam_PostCommit_Python37/ws/src/runners/google-cloud-dataflow-java/worker/build/libs/beam-runners-google-cloud-dataflow-java-fn-api-worker-2.39.0-SNAPSHOT.jar> --kms_key_name=projects/apache-beam-testing/locations/global/keyRings/beam-it/cryptoKeys/test --dataflow_kms_key=projects/apache-beam-testing/locations/global/keyRings/beam-it/cryptoKeys/test
>>>   pytest options: --capture=no --timeout=4500 --color=yes --log-cli-level=INFO --numprocesses=8 --dist=loadfile
>>>   collect markers: -m=spannerio_it
============================= test session starts ==============================
platform linux -- Python 3.7.12, pytest-4.6.11, py-1.11.0, pluggy-0.13.1
rootdir: <https://ci-beam.apache.org/job/beam_PostCommit_Python37/ws/src/sdks/python,> inifile: pytest.ini
plugins: xdist-1.34.0, timeout-1.4.2, forked-1.4.0, requests-mock-1.9.3
timeout: 4500.0s
timeout method: signal
timeout func_only: False
gw0 I / gw1 I / gw2 I / gw3 I / gw4 I / gw5 I / gw6 I / gw7 I
[gw0] Python 3.7.12 (default, Jan 15 2022, 18:42:10)  -- [GCC 9.3.0]
[gw1] Python 3.7.12 (default, Jan 15 2022, 18:42:10)  -- [GCC 9.3.0]
[gw2] Python 3.7.12 (default, Jan 15 2022, 18:42:10)  -- [GCC 9.3.0]
[gw4] Python 3.7.12 (default, Jan 15 2022, 18:42:10)  -- [GCC 9.3.0]
[gw3] Python 3.7.12 (default, Jan 15 2022, 18:42:10)  -- [GCC 9.3.0]
[gw5] Python 3.7.12 (default, Jan 15 2022, 18:42:10)  -- [GCC 9.3.0]
[gw6] Python 3.7.12 (default, Jan 15 2022, 18:42:10)  -- [GCC 9.3.0]
[gw7] Python 3.7.12 (default, Jan 15 2022, 18:42:10)  -- [GCC 9.3.0]
gw0 [15] / gw1 [15] / gw2 [15] / gw3 [15] / gw4 [15] / gw5 [15] / gw6 [15] / gw7 [15]

scheduling tests via LoadFileScheduling

apache_beam/io/gcp/experimental/spannerio_read_it_test.py::SpannerReadIntegrationTest::test_read_via_sql 
apache_beam/io/gcp/experimental/spannerio_write_it_test.py::SpannerWriteIntegrationTest::test_metrics_error_call 
[gw1] SKIPPED apache_beam/io/gcp/experimental/spannerio_write_it_test.py::SpannerWriteIntegrationTest::test_metrics_error_call 
apache_beam/io/gcp/experimental/spannerio_write_it_test.py::SpannerWriteIntegrationTest::test_metrics_ok_call 
[gw1] SKIPPED apache_beam/io/gcp/experimental/spannerio_write_it_test.py::SpannerWriteIntegrationTest::test_metrics_ok_call 
apache_beam/io/gcp/experimental/spannerio_write_it_test.py::SpannerWriteIntegrationTest::test_spanner_error E0418 20:53:39.278264467 1584213 fork_posix.cc:70]           Fork support is only compatible with the epoll1 and poll polling strategies
E0418 20:53:39.627878707 1584210 fork_posix.cc:70]           Fork support is only compatible with the epoll1 and poll polling strategies

[gw0] PASSED apache_beam/io/gcp/experimental/spannerio_read_it_test.py::SpannerReadIntegrationTest::test_read_via_sql 
apache_beam/io/gcp/experimental/spannerio_read_it_test.py::SpannerReadIntegrationTest::test_read_via_table E0418 21:00:27.154886576 1584210 fork_posix.cc:70]           Fork support is only compatible with the epoll1 and poll polling strategies

[gw1] PASSED apache_beam/io/gcp/experimental/spannerio_write_it_test.py::SpannerWriteIntegrationTest::test_spanner_error 
apache_beam/io/gcp/experimental/spannerio_write_it_test.py::SpannerWriteIntegrationTest::test_spanner_update E0418 21:00:32.413377314 1584213 fork_posix.cc:70]           Fork support is only compatible with the epoll1 and poll polling strategies

[gw0] PASSED apache_beam/io/gcp/experimental/spannerio_read_it_test.py::SpannerReadIntegrationTest::test_read_via_table 
apache_beam/io/gcp/experimental/spannerio_read_it_test.py::SpannerReadIntegrationTest::test_sql_metrics_error_call 
[gw0] SKIPPED apache_beam/io/gcp/experimental/spannerio_read_it_test.py::SpannerReadIntegrationTest::test_sql_metrics_error_call 
apache_beam/io/gcp/experimental/spannerio_read_it_test.py::SpannerReadIntegrationTest::test_sql_metrics_ok_call 
[gw0] SKIPPED apache_beam/io/gcp/experimental/spannerio_read_it_test.py::SpannerReadIntegrationTest::test_sql_metrics_ok_call 
apache_beam/io/gcp/experimental/spannerio_read_it_test.py::SpannerReadIntegrationTest::test_table_metrics_error_call 
[gw0] SKIPPED apache_beam/io/gcp/experimental/spannerio_read_it_test.py::SpannerReadIntegrationTest::test_table_metrics_error_call 
apache_beam/io/gcp/experimental/spannerio_read_it_test.py::SpannerReadIntegrationTest::test_table_metrics_ok_call 
[gw0] SKIPPED apache_beam/io/gcp/experimental/spannerio_read_it_test.py::SpannerReadIntegrationTest::test_table_metrics_ok_call 
apache_beam/io/gcp/experimental/spannerio_read_it_test.py::SpannerReadIntegrationTest::test_transaction_sql_metrics_error_call 
[gw0] SKIPPED apache_beam/io/gcp/experimental/spannerio_read_it_test.py::SpannerReadIntegrationTest::test_transaction_sql_metrics_error_call 
apache_beam/io/gcp/experimental/spannerio_read_it_test.py::SpannerReadIntegrationTest::test_transaction_sql_metrics_ok_call 
[gw0] SKIPPED apache_beam/io/gcp/experimental/spannerio_read_it_test.py::SpannerReadIntegrationTest::test_transaction_sql_metrics_ok_call 
apache_beam/io/gcp/experimental/spannerio_read_it_test.py::SpannerReadIntegrationTest::test_transaction_table_metrics_error_call 
[gw0] SKIPPED apache_beam/io/gcp/experimental/spannerio_read_it_test.py::SpannerReadIntegrationTest::test_transaction_table_metrics_error_call 
apache_beam/io/gcp/experimental/spannerio_read_it_test.py::SpannerReadIntegrationTest::test_transaction_table_metrics_ok_call 
[gw0] SKIPPED apache_beam/io/gcp/experimental/spannerio_read_it_test.py::SpannerReadIntegrationTest::test_transaction_table_metrics_ok_call 
[gw1] PASSED apache_beam/io/gcp/experimental/spannerio_write_it_test.py::SpannerWriteIntegrationTest::test_spanner_update 
apache_beam/io/gcp/experimental/spannerio_write_it_test.py::SpannerWriteIntegrationTest::test_write_batches E0418 21:08:17.154646223 1584213 fork_posix.cc:70]           Fork support is only compatible with the epoll1 and poll polling strategies

[gw1] PASSED apache_beam/io/gcp/experimental/spannerio_write_it_test.py::SpannerWriteIntegrationTest::test_write_batches 

=============================== warnings summary ===============================
apache_beam/io/gcp/experimental/spannerio_read_it_test.py:128
  <https://ci-beam.apache.org/job/beam_PostCommit_Python37/ws/src/sdks/python/apache_beam/io/gcp/experimental/spannerio_read_it_test.py>:128: FutureWarning: ReadFromSpanner is experimental. No backwards-compatibility guarantees.
    sql="select * from Users")

apache_beam/io/gcp/experimental/spannerio_write_it_test.py:190
  <https://ci-beam.apache.org/job/beam_PostCommit_Python37/ws/src/sdks/python/apache_beam/io/gcp/experimental/spannerio_write_it_test.py>:190: FutureWarning: WriteToSpanner is experimental. No backwards-compatibility guarantees.
    database_id=self.TEST_DATABASE))

apache_beam/io/gcp/experimental/spannerio_read_it_test.py:117
  <https://ci-beam.apache.org/job/beam_PostCommit_Python37/ws/src/sdks/python/apache_beam/io/gcp/experimental/spannerio_read_it_test.py>:117: FutureWarning: ReadFromSpanner is experimental. No backwards-compatibility guarantees.
    columns=["UserId", "Key"])

apache_beam/io/gcp/experimental/spannerio_write_it_test.py:171
  <https://ci-beam.apache.org/job/beam_PostCommit_Python37/ws/src/sdks/python/apache_beam/io/gcp/experimental/spannerio_write_it_test.py>:171: FutureWarning: WriteToSpanner is experimental. No backwards-compatibility guarantees.
    database_id=self.TEST_DATABASE))

apache_beam/io/gcp/experimental/spannerio_write_it_test.py:135
  <https://ci-beam.apache.org/job/beam_PostCommit_Python37/ws/src/sdks/python/apache_beam/io/gcp/experimental/spannerio_write_it_test.py>:135: FutureWarning: WriteToSpanner is experimental. No backwards-compatibility guarantees.
    max_batch_size_bytes=250))

-- Docs: https://docs.pytest.org/en/latest/warnings.html
- generated xml file: <https://ci-beam.apache.org/job/beam_PostCommit_Python37/ws/src/sdks/python/pytest_postCommitIT-df-py37.xml> -
============= 5 passed, 10 skipped, 5 warnings in 1292.95 seconds ==============

FAILURE: Build failed with an exception.

* Where:
Script '<https://ci-beam.apache.org/job/beam_PostCommit_Python37/ws/src/sdks/python/test-suites/dataflow/common.gradle'> line: 121

* What went wrong:
Execution failed for task ':sdks:python:test-suites:dataflow:py37:postCommitIT'.
> Process 'command 'sh'' finished with non-zero exit value 1

* Try:
> Run with --stacktrace option to get the stack trace.
> Run with --info or --debug option to get more log output.
> Run with --scan to get full insights.

* Get more help at https://help.gradle.org

Deprecated Gradle features were used in this build, making it incompatible with Gradle 8.0.

You can use '--warning-mode all' to show the individual deprecation warnings and determine if they come from your own scripts or plugins.

See https://docs.gradle.org/7.4/userguide/command_line_interface.html#sec:command_line_warnings

Execution optimizations have been disabled for 1 invalid unit(s) of work during this build to ensure correctness.
Please consult deprecation warnings for more details.

BUILD FAILED in 1h 54m 30s
224 actionable tasks: 154 executed, 64 from cache, 6 up-to-date

Publishing build scan...
https://gradle.com/s/2za4gtspg6372

Build step 'Invoke Gradle script' changed build result to FAILURE
Build step 'Invoke Gradle script' marked build as failure

---------------------------------------------------------------------
To unsubscribe, e-mail: builds-unsubscribe@beam.apache.org
For additional commands, e-mail: builds-help@beam.apache.org


Build failed in Jenkins: beam_PostCommit_Python37 #5122

Posted by Apache Jenkins Server <je...@builds.apache.org>.
See <https://ci-beam.apache.org/job/beam_PostCommit_Python37/5122/display/redirect>

Changes:


------------------------------------------
[...truncated 43.31 MB...]
INFO     apache_beam.utils.subprocess_server:subprocess_server.py:125 b'      "labels": {'
INFO     apache_beam.utils.subprocess_server:subprocess_server.py:125 b'        "PTRANSFORM": "fn/read/pcollection_4:0"'
INFO     apache_beam.utils.subprocess_server:subprocess_server.py:125 b'      }'
INFO     apache_beam.utils.subprocess_server:subprocess_server.py:125 b'    }, {'
INFO     apache_beam.utils.subprocess_server:subprocess_server.py:125 b'      "urn": "beam:metric:element_count:v1",'
INFO     apache_beam.utils.subprocess_server:subprocess_server.py:125 b'      "type": "beam:metrics:sum_int64:v1",'
INFO     apache_beam.utils.subprocess_server:subprocess_server.py:125 b'      "payload": "AQ==",'
INFO     apache_beam.utils.subprocess_server:subprocess_server.py:125 b'      "labels": {'
INFO     apache_beam.utils.subprocess_server:subprocess_server.py:125 b'        "PCOLLECTION": "pcollection_5"'
INFO     apache_beam.utils.subprocess_server:subprocess_server.py:125 b'      }'
INFO     apache_beam.utils.subprocess_server:subprocess_server.py:125 b'    }, {'
INFO     apache_beam.utils.subprocess_server:subprocess_server.py:125 b'      "urn": "beam:metric:sampled_byte_size:v1",'
INFO     apache_beam.utils.subprocess_server:subprocess_server.py:125 b'      "type": "beam:metrics:distribution_int64:v1",'
INFO     apache_beam.utils.subprocess_server:subprocess_server.py:125 b'      "payload": "AcgUyBTIFA==",'
INFO     apache_beam.utils.subprocess_server:subprocess_server.py:125 b'      "labels": {'
INFO     apache_beam.utils.subprocess_server:subprocess_server.py:125 b'        "PCOLLECTION": "external_7Write to Spanner/SpannerIO.Write/Write mutations to Cloud Spanner/Schema View/Combine.GloballyAsSingletonView/CombineValues/Values/Values/Map/ParMultiDo(Anonymous).output"'
INFO     apache_beam.utils.subprocess_server:subprocess_server.py:125 b'      }'
INFO     apache_beam.utils.subprocess_server:subprocess_server.py:125 b'    }, {'
INFO     apache_beam.utils.subprocess_server:subprocess_server.py:125 b'      "urn": "beam:metric:sampled_byte_size:v1",'
INFO     apache_beam.utils.subprocess_server:subprocess_server.py:125 b'      "type": "beam:metrics:distribution_int64:v1",'
INFO     apache_beam.utils.subprocess_server:subprocess_server.py:125 b'      "payload": "Ac4UzhTOFA==",'
INFO     apache_beam.utils.subprocess_server:subprocess_server.py:125 b'      "labels": {'
INFO     apache_beam.utils.subprocess_server:subprocess_server.py:125 b'        "PCOLLECTION": "pcollection_4"'
INFO     apache_beam.utils.subprocess_server:subprocess_server.py:125 b'      }'
INFO     apache_beam.utils.subprocess_server:subprocess_server.py:125 b'    }, {'
INFO     apache_beam.utils.subprocess_server:subprocess_server.py:125 b'      "urn": "beam:metric:sampled_byte_size:v1",'
INFO     apache_beam.utils.subprocess_server:subprocess_server.py:125 b'      "type": "beam:metrics:distribution_int64:v1",'
INFO     apache_beam.utils.subprocess_server:subprocess_server.py:125 b'      "payload": "AcYUxhTGFA==",'
INFO     apache_beam.utils.subprocess_server:subprocess_server.py:125 b'      "labels": {'
INFO     apache_beam.utils.subprocess_server:subprocess_server.py:125 b'        "PCOLLECTION": "external_7Write to Spanner/SpannerIO.Write/Write mutations to Cloud Spanner/Schema View/Combine.GloballyAsSingletonView/CombineValues/Combine.perKey(Singleton)/Combine.GroupedValues/ParDo(Anonymous)/ParMultiDo(Anonymous).output"'
INFO     apache_beam.utils.subprocess_server:subprocess_server.py:125 b'      }'
INFO     apache_beam.utils.subprocess_server:subprocess_server.py:125 b'    }, {'
INFO     apache_beam.utils.subprocess_server:subprocess_server.py:125 b'      "urn": "beam:metric:sampled_byte_size:v1",'
INFO     apache_beam.utils.subprocess_server:subprocess_server.py:125 b'      "type": "beam:metrics:distribution_int64:v1",'
INFO     apache_beam.utils.subprocess_server:subprocess_server.py:125 b'      "payload": "AccUxxTHFA==",'
INFO     apache_beam.utils.subprocess_server:subprocess_server.py:125 b'      "labels": {'
INFO     apache_beam.utils.subprocess_server:subprocess_server.py:125 b'        "PCOLLECTION": "pcollection_5"'
INFO     apache_beam.utils.subprocess_server:subprocess_server.py:125 b'      }'
INFO     apache_beam.utils.subprocess_server:subprocess_server.py:125 b'    }]'
INFO     apache_beam.utils.subprocess_server:subprocess_server.py:125 b'  }'
INFO     apache_beam.utils.subprocess_server:subprocess_server.py:125 b'}'
INFO     apache_beam.utils.subprocess_server:subprocess_server.py:125 b'Apr 18, 2022 1:36:15 PM org.apache.flink.runtime.resourcemanager.ResourceManager deregisterApplication'
INFO     apache_beam.utils.subprocess_server:subprocess_server.py:125 b'INFO: Shut down cluster because application is in CANCELED, diagnostics DispatcherResourceManagerComponent has been closed..'
INFO     apache_beam.utils.subprocess_server:subprocess_server.py:125 b'Apr 18, 2022 1:36:15 PM org.apache.flink.runtime.entrypoint.component.DispatcherResourceManagerComponent closeAsyncInternal'
INFO     apache_beam.utils.subprocess_server:subprocess_server.py:125 b'INFO: Closing components.'
INFO     apache_beam.utils.subprocess_server:subprocess_server.py:125 b'Apr 18, 2022 1:36:15 PM org.apache.flink.runtime.taskexecutor.DefaultJobLeaderService stop'
INFO     apache_beam.utils.subprocess_server:subprocess_server.py:125 b'INFO: Stop job leader service.'
INFO     apache_beam.utils.subprocess_server:subprocess_server.py:125 b'Apr 18, 2022 1:36:15 PM org.apache.flink.runtime.dispatcher.runner.AbstractDispatcherLeaderProcess closeInternal'
INFO     apache_beam.utils.subprocess_server:subprocess_server.py:125 b'INFO: Stopping SessionDispatcherLeaderProcess.'
INFO     apache_beam.utils.subprocess_server:subprocess_server.py:125 b'Apr 18, 2022 1:36:15 PM org.apache.flink.runtime.state.TaskExecutorLocalStateStoresManager shutdown'
INFO     apache_beam.utils.subprocess_server:subprocess_server.py:125 b'INFO: Shutting down TaskExecutorLocalStateStoresManager.'
INFO     apache_beam.utils.subprocess_server:subprocess_server.py:125 b'Apr 18, 2022 1:36:15 PM org.apache.flink.runtime.dispatcher.Dispatcher onStop'
INFO     apache_beam.utils.subprocess_server:subprocess_server.py:125 b'INFO: Stopping dispatcher akka://flink/user/rpc/dispatcher_1.'
INFO     apache_beam.utils.subprocess_server:subprocess_server.py:125 b'Apr 18, 2022 1:36:15 PM org.apache.flink.runtime.resourcemanager.ResourceManagerServiceImpl closeAsync'
INFO     apache_beam.utils.subprocess_server:subprocess_server.py:125 b'INFO: Stopping resource manager service.'
INFO     apache_beam.utils.subprocess_server:subprocess_server.py:125 b'Apr 18, 2022 1:36:15 PM org.apache.flink.runtime.resourcemanager.slotmanager.DeclarativeSlotManager close'
INFO     apache_beam.utils.subprocess_server:subprocess_server.py:125 b'INFO: Closing the slot manager.'
INFO     apache_beam.utils.subprocess_server:subprocess_server.py:125 b'Apr 18, 2022 1:36:15 PM org.apache.flink.runtime.dispatcher.Dispatcher terminateRunningJobs'
INFO     apache_beam.utils.subprocess_server:subprocess_server.py:125 b'INFO: Stopping all currently running jobs of dispatcher akka://flink/user/rpc/dispatcher_1.'
INFO     apache_beam.utils.subprocess_server:subprocess_server.py:125 b'Apr 18, 2022 1:36:15 PM org.apache.flink.runtime.resourcemanager.slotmanager.DeclarativeSlotManager suspend'
INFO     apache_beam.utils.subprocess_server:subprocess_server.py:125 b'INFO: Suspending the slot manager.'
INFO     apache_beam.utils.subprocess_server:subprocess_server.py:125 b'Apr 18, 2022 1:36:15 PM org.apache.flink.runtime.io.disk.FileChannelManagerImpl lambda$getFileCloser$0'
INFO     apache_beam.utils.subprocess_server:subprocess_server.py:125 b'INFO: FileChannelManager removed spill file directory /tmp/flink-io-99101c3c-2f20-4df6-82ef-b05985ee8536'
INFO     apache_beam.utils.subprocess_server:subprocess_server.py:125 b'Apr 18, 2022 1:36:15 PM org.apache.flink.runtime.dispatcher.Dispatcher lambda$onStop$0'
INFO     apache_beam.utils.subprocess_server:subprocess_server.py:125 b'INFO: Stopped dispatcher akka://flink/user/rpc/dispatcher_1.'
INFO     apache_beam.utils.subprocess_server:subprocess_server.py:125 b'Apr 18, 2022 1:36:15 PM org.apache.flink.runtime.io.network.NettyShuffleEnvironment close'
INFO     apache_beam.utils.subprocess_server:subprocess_server.py:125 b'INFO: Shutting down the network environment and its components.'
INFO     apache_beam.utils.subprocess_server:subprocess_server.py:125 b'Apr 18, 2022 1:36:15 PM org.apache.flink.runtime.io.disk.FileChannelManagerImpl lambda$getFileCloser$0'
INFO     apache_beam.utils.subprocess_server:subprocess_server.py:125 b'INFO: FileChannelManager removed spill file directory /tmp/flink-netty-shuffle-5d971c11-0b4a-40c2-ab7b-26ae9e2c61dd'
INFO     apache_beam.utils.subprocess_server:subprocess_server.py:125 b'Apr 18, 2022 1:36:15 PM org.apache.flink.runtime.taskexecutor.KvStateService shutdown'
INFO     apache_beam.utils.subprocess_server:subprocess_server.py:125 b'INFO: Shutting down the kvState service and its components.'
INFO     apache_beam.utils.subprocess_server:subprocess_server.py:125 b'Apr 18, 2022 1:36:15 PM org.apache.flink.runtime.taskexecutor.DefaultJobLeaderService stop'
INFO     apache_beam.utils.subprocess_server:subprocess_server.py:125 b'INFO: Stop job leader service.'
INFO     apache_beam.utils.subprocess_server:subprocess_server.py:125 b'Apr 18, 2022 1:36:15 PM org.apache.flink.runtime.filecache.FileCache shutdown'
INFO     apache_beam.utils.subprocess_server:subprocess_server.py:125 b'INFO: removed file cache directory /tmp/flink-dist-cache-0e184658-780b-418c-b355-b132273eccd7'
INFO     apache_beam.utils.subprocess_server:subprocess_server.py:125 b'Apr 18, 2022 1:36:15 PM org.apache.flink.runtime.taskexecutor.TaskExecutor handleOnStopException'
INFO     apache_beam.utils.subprocess_server:subprocess_server.py:125 b'INFO: Stopped TaskExecutor akka://flink/user/rpc/taskmanager_0.'
INFO     apache_beam.utils.subprocess_server:subprocess_server.py:125 b'Apr 18, 2022 1:36:15 PM org.apache.flink.runtime.rpc.akka.AkkaRpcService stopService'
INFO     apache_beam.utils.subprocess_server:subprocess_server.py:125 b'INFO: Stopping Akka RPC service.'
INFO     apache_beam.utils.subprocess_server:subprocess_server.py:125 b'Apr 18, 2022 1:36:15 PM org.apache.flink.runtime.rpc.akka.AkkaRpcService stopService'
INFO     apache_beam.utils.subprocess_server:subprocess_server.py:125 b'INFO: Stopping Akka RPC service.'
INFO     apache_beam.utils.subprocess_server:subprocess_server.py:125 b'Apr 18, 2022 1:36:15 PM org.apache.flink.runtime.rpc.akka.AkkaRpcService lambda$stopService$8'
INFO     apache_beam.utils.subprocess_server:subprocess_server.py:125 b'INFO: Stopped Akka RPC service.'
INFO     apache_beam.runners.portability.portable_runner:portable_runner.py:582 Job state changed to DONE
INFO     apache_beam.utils.subprocess_server:subprocess_server.py:125 b'Apr 18, 2022 1:36:15 PM org.apache.flink.runtime.blob.AbstractBlobCache close'
INFO     apache_beam.utils.subprocess_server:subprocess_server.py:125 b'INFO: Shutting down BLOB cache'
INFO     apache_beam.utils.subprocess_server:subprocess_server.py:125 b'Apr 18, 2022 1:36:15 PM org.apache.flink.runtime.blob.AbstractBlobCache close'
INFO     apache_beam.utils.subprocess_server:subprocess_server.py:125 b'INFO: Shutting down BLOB cache'
INFO     apache_beam.utils.subprocess_server:subprocess_server.py:125 b'Apr 18, 2022 1:36:15 PM org.apache.flink.runtime.blob.BlobServer close'
INFO     apache_beam.utils.subprocess_server:subprocess_server.py:125 b'INFO: Stopped BLOB server at 0.0.0.0:35715'
PASSED------------------------------ live log logreport ------------------------------ [100%]
INFO     apache_beam.utils.subprocess_server:subprocess_server.py:125 b'INFO: Stopped Akka RPC service.'


- generated xml file: <https://ci-beam.apache.org/job/beam_PostCommit_Python37/ws/src/sdks/python/pytest_postCommitIT-flink-py37.xml> -
========================== 7 passed in 240.98 seconds ==========================
Exception in thread read_grpc_client_inputs:
Traceback (most recent call last):
  File "/usr/lib/python3.7/threading.py", line 926, in _bootstrap_inner
    self.run()
  File "/usr/lib/python3.7/threading.py", line 870, in run
    self._target(*self._args, **self._kwargs)
  File "<https://ci-beam.apache.org/job/beam_PostCommit_Python37/ws/src/sdks/python/apache_beam/runners/worker/data_plane.py",> line 651, in <lambda>
    target=lambda: self._read_inputs(elements_iterator),
  File "<https://ci-beam.apache.org/job/beam_PostCommit_Python37/ws/src/sdks/python/apache_beam/runners/worker/data_plane.py",> line 634, in _read_inputs
    for elements in elements_iterator:
  File "<https://ci-beam.apache.org/job/beam_PostCommit_Python37/ws/src/build/gradleenv/2022703441/lib/python3.7/site-packages/grpc/_channel.py",> line 426, in __next__
    return self._next()
  File "<https://ci-beam.apache.org/job/beam_PostCommit_Python37/ws/src/build/gradleenv/2022703441/lib/python3.7/site-packages/grpc/_channel.py",> line 826, in _next
    raise self
grpc._channel._MultiThreadedRendezvous: <_MultiThreadedRendezvous of RPC that terminated with:
	status = StatusCode.CANCELLED
	details = "Multiplexer hanging up"
	debug_error_string = "{"created":"@1650288806.675304466","description":"Error received from peer ipv6:[::1]:36159","file":"src/core/lib/surface/call.cc","file_line":903,"grpc_message":"Multiplexer hanging up","grpc_status":1}"
>


> Task :sdks:python:test-suites:dataflow:py37:postCommitIT
E0418 13:36:30.012320738 2791582 fork_posix.cc:70]           Fork support is only compatible with the epoll1 and poll polling strategies
E0418 13:38:15.534520235 2791585 fork_posix.cc:70]           Fork support is only compatible with the epoll1 and poll polling strategies
E0418 13:38:45.446805111 2791575 fork_posix.cc:70]           Fork support is only compatible with the epoll1 and poll polling strategies
E0418 13:45:08.624168350 2791585 fork_posix.cc:70]           Fork support is only compatible with the epoll1 and poll polling strategies
E0418 13:53:28.963058674 2791585 fork_posix.cc:70]           Fork support is only compatible with the epoll1 and poll polling strategies
E0418 13:58:26.130043840 2791610 fork_posix.cc:70]           Fork support is only compatible with the epoll1 and poll polling strategies
E0418 14:01:38.600415727 2791585 fork_posix.cc:70]           Fork support is only compatible with the epoll1 and poll polling strategies
E0418 14:11:58.862209143 2791585 fork_posix.cc:70]           Fork support is only compatible with the epoll1 and poll polling strategies
E0418 14:15:17.316483455 2791610 fork_posix.cc:70]           Fork support is only compatible with the epoll1 and poll polling strategies
E0418 14:32:09.500154466 2791610 fork_posix.cc:70]           Fork support is only compatible with the epoll1 and poll polling strategies

> Task :sdks:python:test-suites:dataflow:py37:postCommitIT FAILED

> Task :sdks:python:test-suites:dataflow:py37:spannerioIT
>>> RUNNING integration tests with pipeline options: --runner=TestDataflowRunner --project=apache-beam-testing --region=us-central1 --staging_location=gs://temp-storage-for-end-to-end-tests/staging-it --temp_location=gs://temp-storage-for-end-to-end-tests/temp-it --output=gs://temp-storage-for-end-to-end-tests/py-it-cloud/output --sdk_location=<https://ci-beam.apache.org/job/beam_PostCommit_Python37/ws/src/sdks/python/build/apache-beam.tar.gz> --requirements_file=postcommit_requirements.txt --num_workers=1 --sleep_secs=20 --dataflow_worker_jar=<https://ci-beam.apache.org/job/beam_PostCommit_Python37/ws/src/runners/google-cloud-dataflow-java/worker/build/libs/beam-runners-google-cloud-dataflow-java-fn-api-worker-2.39.0-SNAPSHOT.jar> --kms_key_name=projects/apache-beam-testing/locations/global/keyRings/beam-it/cryptoKeys/test --dataflow_kms_key=projects/apache-beam-testing/locations/global/keyRings/beam-it/cryptoKeys/test
>>>   pytest options: --capture=no --timeout=4500 --color=yes --log-cli-level=INFO --numprocesses=8 --dist=loadfile
>>>   collect markers: -m=spannerio_it
============================= test session starts ==============================
platform linux -- Python 3.7.12, pytest-4.6.11, py-1.11.0, pluggy-0.13.1
rootdir: <https://ci-beam.apache.org/job/beam_PostCommit_Python37/ws/src/sdks/python,> inifile: pytest.ini
plugins: xdist-1.34.0, timeout-1.4.2, forked-1.4.0, requests-mock-1.9.3
timeout: 4500.0s
timeout method: signal
timeout func_only: False
gw0 I / gw1 I / gw2 I / gw3 I / gw4 I / gw5 I / gw6 I / gw7 I
[gw1] Python 3.7.12 (default, Jan 15 2022, 18:42:10)  -- [GCC 9.3.0]
[gw2] Python 3.7.12 (default, Jan 15 2022, 18:42:10)  -- [GCC 9.3.0]
[gw3] Python 3.7.12 (default, Jan 15 2022, 18:42:10)  -- [GCC 9.3.0]
[gw5] Python 3.7.12 (default, Jan 15 2022, 18:42:10)  -- [GCC 9.3.0]
[gw0] Python 3.7.12 (default, Jan 15 2022, 18:42:10)  -- [GCC 9.3.0]
[gw7] Python 3.7.12 (default, Jan 15 2022, 18:42:10)  -- [GCC 9.3.0]
[gw6] Python 3.7.12 (default, Jan 15 2022, 18:42:10)  -- [GCC 9.3.0]
[gw4] Python 3.7.12 (default, Jan 15 2022, 18:42:10)  -- [GCC 9.3.0]
gw0 [15] / gw1 [15] / gw2 [15] / gw3 [15] / gw4 [15] / gw5 [15] / gw6 [15] / gw7 [15]

scheduling tests via LoadFileScheduling

apache_beam/io/gcp/experimental/spannerio_read_it_test.py::SpannerReadIntegrationTest::test_read_via_sql 
apache_beam/io/gcp/experimental/spannerio_write_it_test.py::SpannerWriteIntegrationTest::test_metrics_error_call 
[gw2] SKIPPED apache_beam/io/gcp/experimental/spannerio_write_it_test.py::SpannerWriteIntegrationTest::test_metrics_error_call 
apache_beam/io/gcp/experimental/spannerio_write_it_test.py::SpannerWriteIntegrationTest::test_metrics_ok_call 
[gw2] SKIPPED apache_beam/io/gcp/experimental/spannerio_write_it_test.py::SpannerWriteIntegrationTest::test_metrics_ok_call 
apache_beam/io/gcp/experimental/spannerio_write_it_test.py::SpannerWriteIntegrationTest::test_spanner_error E0418 15:12:18.670345803 2943226 fork_posix.cc:70]           Fork support is only compatible with the epoll1 and poll polling strategies
E0418 15:12:20.029378636 2943177 fork_posix.cc:70]           Fork support is only compatible with the epoll1 and poll polling strategies

[gw2] PASSED apache_beam/io/gcp/experimental/spannerio_write_it_test.py::SpannerWriteIntegrationTest::test_spanner_error 
apache_beam/io/gcp/experimental/spannerio_write_it_test.py::SpannerWriteIntegrationTest::test_spanner_update E0418 15:19:11.179981644 2943226 fork_posix.cc:70]           Fork support is only compatible with the epoll1 and poll polling strategies

[gw1] PASSED apache_beam/io/gcp/experimental/spannerio_read_it_test.py::SpannerReadIntegrationTest::test_read_via_sql 
apache_beam/io/gcp/experimental/spannerio_read_it_test.py::SpannerReadIntegrationTest::test_read_via_table E0418 15:19:52.459503187 2943177 fork_posix.cc:70]           Fork support is only compatible with the epoll1 and poll polling strategies

[gw2] PASSED apache_beam/io/gcp/experimental/spannerio_write_it_test.py::SpannerWriteIntegrationTest::test_spanner_update 
apache_beam/io/gcp/experimental/spannerio_write_it_test.py::SpannerWriteIntegrationTest::test_write_batches E0418 15:25:38.028251253 2943226 fork_posix.cc:70]           Fork support is only compatible with the epoll1 and poll polling strategies

[gw1] PASSED apache_beam/io/gcp/experimental/spannerio_read_it_test.py::SpannerReadIntegrationTest::test_read_via_table 
apache_beam/io/gcp/experimental/spannerio_read_it_test.py::SpannerReadIntegrationTest::test_sql_metrics_error_call 
[gw1] SKIPPED apache_beam/io/gcp/experimental/spannerio_read_it_test.py::SpannerReadIntegrationTest::test_sql_metrics_error_call 
apache_beam/io/gcp/experimental/spannerio_read_it_test.py::SpannerReadIntegrationTest::test_sql_metrics_ok_call 
[gw1] SKIPPED apache_beam/io/gcp/experimental/spannerio_read_it_test.py::SpannerReadIntegrationTest::test_sql_metrics_ok_call 
apache_beam/io/gcp/experimental/spannerio_read_it_test.py::SpannerReadIntegrationTest::test_table_metrics_error_call 
[gw1] SKIPPED apache_beam/io/gcp/experimental/spannerio_read_it_test.py::SpannerReadIntegrationTest::test_table_metrics_error_call 
apache_beam/io/gcp/experimental/spannerio_read_it_test.py::SpannerReadIntegrationTest::test_table_metrics_ok_call 
[gw1] SKIPPED apache_beam/io/gcp/experimental/spannerio_read_it_test.py::SpannerReadIntegrationTest::test_table_metrics_ok_call 
apache_beam/io/gcp/experimental/spannerio_read_it_test.py::SpannerReadIntegrationTest::test_transaction_sql_metrics_error_call 
[gw1] SKIPPED apache_beam/io/gcp/experimental/spannerio_read_it_test.py::SpannerReadIntegrationTest::test_transaction_sql_metrics_error_call 
apache_beam/io/gcp/experimental/spannerio_read_it_test.py::SpannerReadIntegrationTest::test_transaction_sql_metrics_ok_call 
[gw1] SKIPPED apache_beam/io/gcp/experimental/spannerio_read_it_test.py::SpannerReadIntegrationTest::test_transaction_sql_metrics_ok_call 
apache_beam/io/gcp/experimental/spannerio_read_it_test.py::SpannerReadIntegrationTest::test_transaction_table_metrics_error_call 
[gw1] SKIPPED apache_beam/io/gcp/experimental/spannerio_read_it_test.py::SpannerReadIntegrationTest::test_transaction_table_metrics_error_call 
apache_beam/io/gcp/experimental/spannerio_read_it_test.py::SpannerReadIntegrationTest::test_transaction_table_metrics_ok_call 
[gw1] SKIPPED apache_beam/io/gcp/experimental/spannerio_read_it_test.py::SpannerReadIntegrationTest::test_transaction_table_metrics_ok_call 
[gw2] PASSED apache_beam/io/gcp/experimental/spannerio_write_it_test.py::SpannerWriteIntegrationTest::test_write_batches 

=============================== warnings summary ===============================
apache_beam/io/gcp/experimental/spannerio_write_it_test.py:190
  <https://ci-beam.apache.org/job/beam_PostCommit_Python37/ws/src/sdks/python/apache_beam/io/gcp/experimental/spannerio_write_it_test.py>:190: FutureWarning: WriteToSpanner is experimental. No backwards-compatibility guarantees.
    database_id=self.TEST_DATABASE))

apache_beam/io/gcp/experimental/spannerio_read_it_test.py:128
  <https://ci-beam.apache.org/job/beam_PostCommit_Python37/ws/src/sdks/python/apache_beam/io/gcp/experimental/spannerio_read_it_test.py>:128: FutureWarning: ReadFromSpanner is experimental. No backwards-compatibility guarantees.
    sql="select * from Users")

apache_beam/io/gcp/experimental/spannerio_write_it_test.py:171
  <https://ci-beam.apache.org/job/beam_PostCommit_Python37/ws/src/sdks/python/apache_beam/io/gcp/experimental/spannerio_write_it_test.py>:171: FutureWarning: WriteToSpanner is experimental. No backwards-compatibility guarantees.
    database_id=self.TEST_DATABASE))

apache_beam/io/gcp/experimental/spannerio_read_it_test.py:117
  <https://ci-beam.apache.org/job/beam_PostCommit_Python37/ws/src/sdks/python/apache_beam/io/gcp/experimental/spannerio_read_it_test.py>:117: FutureWarning: ReadFromSpanner is experimental. No backwards-compatibility guarantees.
    columns=["UserId", "Key"])

apache_beam/io/gcp/experimental/spannerio_write_it_test.py:135
  <https://ci-beam.apache.org/job/beam_PostCommit_Python37/ws/src/sdks/python/apache_beam/io/gcp/experimental/spannerio_write_it_test.py>:135: FutureWarning: WriteToSpanner is experimental. No backwards-compatibility guarantees.
    max_batch_size_bytes=250))

-- Docs: https://docs.pytest.org/en/latest/warnings.html
- generated xml file: <https://ci-beam.apache.org/job/beam_PostCommit_Python37/ws/src/sdks/python/pytest_postCommitIT-df-py37.xml> -
============= 5 passed, 10 skipped, 5 warnings in 1194.85 seconds ==============

FAILURE: Build failed with an exception.

* Where:
Script '<https://ci-beam.apache.org/job/beam_PostCommit_Python37/ws/src/sdks/python/test-suites/dataflow/common.gradle'> line: 121

* What went wrong:
Execution failed for task ':sdks:python:test-suites:dataflow:py37:postCommitIT'.
> Process 'command 'sh'' finished with non-zero exit value 1

* Try:
> Run with --stacktrace option to get the stack trace.
> Run with --info or --debug option to get more log output.
> Run with --scan to get full insights.

* Get more help at https://help.gradle.org

Deprecated Gradle features were used in this build, making it incompatible with Gradle 8.0.

You can use '--warning-mode all' to show the individual deprecation warnings and determine if they come from your own scripts or plugins.

See https://docs.gradle.org/7.4/userguide/command_line_interface.html#sec:command_line_warnings

Execution optimizations have been disabled for 1 invalid unit(s) of work during this build to ensure correctness.
Please consult deprecation warnings for more details.

BUILD FAILED in 2h 11m 33s
224 actionable tasks: 154 executed, 64 from cache, 6 up-to-date

Publishing build scan...
https://gradle.com/s/hgpo7nhzwrzbk

Build step 'Invoke Gradle script' changed build result to FAILURE
Build step 'Invoke Gradle script' marked build as failure

---------------------------------------------------------------------
To unsubscribe, e-mail: builds-unsubscribe@beam.apache.org
For additional commands, e-mail: builds-help@beam.apache.org