You are viewing a plain text version of this content. The canonical link for it is here.
Posted to dev@lucene.apache.org by Policeman Jenkins Server <je...@sd-datasolutions.de> on 2012/12/08 05:32:08 UTC
[JENKINS] Lucene-Solr-trunk-Windows (32bit/jdk1.6.0_37) - Build #
2094 - Still Failing!
Build: http://jenkins.sd-datasolutions.de/job/Lucene-Solr-trunk-Windows/2094/
Java: 32bit/jdk1.6.0_37 -server -XX:+UseConcMarkSweepGC
All tests passed
Build Log:
[...truncated 12959 lines...]
BUILD FAILED
C:\Users\JenkinsSlave\workspace\Lucene-Solr-trunk-Windows\build.xml:88: The following files contain @author tags, tabs or nocommits:
* solr/solrj/src/java/org/apache/solr/common/cloud/CompositeIdRouter.java
Total time: 54 minutes 20 seconds
Build step 'Invoke Ant' marked build as failure
Archiving artifacts
Recording test results
Description set: Java: 32bit/jdk1.6.0_37 -server -XX:+UseConcMarkSweepGC
Email was triggered for: Failure
Sending email for trigger: Failure
[JENKINS] Lucene-Solr-trunk-Windows (64bit/jdk1.7.0_09) - Build #
2096 - Still Failing!
Posted by Policeman Jenkins Server <je...@sd-datasolutions.de>.
Build: http://jenkins.sd-datasolutions.de/job/Lucene-Solr-trunk-Windows/2096/
Java: 64bit/jdk1.7.0_09 -XX:+UseG1GC
All tests passed
Build Log:
[...truncated 13636 lines...]
BUILD FAILED
C:\Users\JenkinsSlave\workspace\Lucene-Solr-trunk-Windows\build.xml:88: The following files contain @author tags, tabs or nocommits:
* solr/solrj/src/java/org/apache/solr/common/cloud/CompositeIdRouter.java
Total time: 53 minutes 12 seconds
Build step 'Invoke Ant' marked build as failure
Archiving artifacts
Recording test results
Description set: Java: 64bit/jdk1.7.0_09 -XX:+UseG1GC
Email was triggered for: Failure
Sending email for trigger: Failure
[JENKINS] Lucene-Solr-trunk-Windows (64bit/jdk1.6.0_37) - Build #
2095 - Still Failing!
Posted by Policeman Jenkins Server <je...@sd-datasolutions.de>.
Build: http://jenkins.sd-datasolutions.de/job/Lucene-Solr-trunk-Windows/2095/
Java: 64bit/jdk1.6.0_37 -XX:+UseSerialGC
All tests passed
Build Log:
[...truncated 12962 lines...]
BUILD FAILED
C:\Users\JenkinsSlave\workspace\Lucene-Solr-trunk-Windows\build.xml:88: The following files contain @author tags, tabs or nocommits:
* solr/solrj/src/java/org/apache/solr/common/cloud/CompositeIdRouter.java
Total time: 49 minutes 3 seconds
Build step 'Invoke Ant' marked build as failure
Archiving artifacts
Recording test results
Description set: Java: 64bit/jdk1.6.0_37 -XX:+UseSerialGC
Email was triggered for: Failure
Sending email for trigger: Failure