You are viewing a plain text version of this content. The canonical link for it is here.
Posted to ci@bigtop.apache.org by Apache Jenkins Server <je...@builds.apache.org> on 2015/01/24 14:46:06 UTC
Jenkins build is still unstable: Bigtop-trunk-iTest » iTest: system and integration testing in the cloud #1983
See <https://builds.apache.org/job/Bigtop-trunk-iTest/org.apache.bigtop.itest$itest-common/1983/>
Jenkins build is back to normal : Bigtop-trunk-iTest » iTest: system and integration testing in the cloud #2008
Posted by Apache Jenkins Server <je...@builds.apache.org>.
See <https://builds.apache.org/job/Bigtop-trunk-iTest/org.apache.bigtop.itest$itest-common/2008/>
Build failed in Jenkins: Bigtop-trunk-iTest » iTest: system and integration testing in the cloud #2007
Posted by Apache Jenkins Server <je...@builds.apache.org>.
See <https://builds.apache.org/job/Bigtop-trunk-iTest/org.apache.bigtop.itest$itest-common/2007/>
------------------------------------------
maven3-agent.jar already up to date
maven3-interceptor.jar already up to date
maven3-interceptor-commons.jar already up to date
<===[JENKINS REMOTING CAPACITY]===> channel started
Executing Maven: -B -f <https://builds.apache.org/job/Bigtop-trunk-iTest/org.apache.bigtop.itest$itest-common/ws/pom.xml> -Dmaven.repo.local=/home/jenkins/jenkins-slave/maven-repositories/0 clean deploy
[INFO] Scanning for projects...
[INFO]
[INFO] ------------------------------------------------------------------------
[INFO] Building iTest: system and integration testing in the cloud 0.9.0-SNAPSHOT
[INFO] ------------------------------------------------------------------------
[INFO]
[INFO] --- maven-clean-plugin:2.4.1:clean (default-clean) @ itest-common ---
[INFO] Deleting <https://builds.apache.org/job/Bigtop-trunk-iTest/org.apache.bigtop.itest$itest-common/ws/target>
[INFO]
[INFO] --- groovy-eclipse-compiler:2.8.0-01:add-groovy-build-paths (default-add-groovy-build-paths) @ itest-common ---
[INFO] Adding /src/main/groovy to the list of source folders
[INFO] Adding /src/test/groovy to the list of test source folders
[INFO]
[INFO] --- maven-remote-resources-plugin:1.1:process (default) @ itest-common ---
[INFO] Setting property: classpath.resource.loader.class => 'org.codehaus.plexus.velocity.ContextClassLoaderResourceLoader'.
[INFO] Setting property: velocimacro.messages.on => 'false'.
[INFO] Setting property: resource.loader => 'classpath'.
[INFO] Setting property: resource.manager.logwhenfound => 'false'.
[INFO]
[INFO] --- maven-resources-plugin:2.4:resources (default-resources) @ itest-common ---
[INFO] Using 'UTF-8' encoding to copy filtered resources.
[INFO] skip non existing resourceDirectory <https://builds.apache.org/job/Bigtop-trunk-iTest/org.apache.bigtop.itest$itest-common/ws/src/main/resources>
[INFO] Copying 3 resources
[INFO]
[INFO] --- maven-compiler-plugin:3.1:compile (default-compile) @ itest-common ---
[INFO] Changes detected - recompiling the module!
[INFO] Using Groovy-Eclipse compiler to compile both Java and Groovy files
[INFO]
[INFO] --- maven-resources-plugin:2.4:testResources (default-testResources) @ itest-common ---
[INFO] Using 'UTF-8' encoding to copy filtered resources.
[INFO] skip non existing resourceDirectory <https://builds.apache.org/job/Bigtop-trunk-iTest/org.apache.bigtop.itest$itest-common/ws/src/test/resources>
[INFO] Copying 3 resources
[INFO]
[INFO] --- maven-compiler-plugin:3.1:testCompile (default-testCompile) @ itest-common ---
[INFO] Changes detected - recompiling the module!
[INFO] Using Groovy-Eclipse compiler to compile both Java and Groovy files
[INFO]
[INFO] --- maven-surefire-plugin:2.7:test (default-test) @ itest-common ---
[INFO] Surefire report directory: <https://builds.apache.org/job/Bigtop-trunk-iTest/org.apache.bigtop.itest$itest-common/ws/target/surefire-reports>
-------------------------------------------------------
T E S T S
-------------------------------------------------------
Running org.apache.bigtop.itest.JUnitUtilsTest
Disclaimer: This test expected to show a failure in an embeded testcase
[junit] Running org.apache.bigtop.itest.DummyTestPassTests run: 1, Failures: 0, Errors: 0, Time elapsed: 0.279 secRunning org.apache.bigtop.itest.DummyTestFail
[junit] Tests run: 1, Failures: 1, Errors: 0, Time elapsed: 0.14 secTEST org.apache.bigtop.itest.DummyTestFail FAILED
[junit] Tests FAILED
Disclaimer: This test expected to show an error in an embeded testcase
[junit] Running org.apache.bigtop.itest.DummyTestError
[junit] Tests run: 1, Failures: 0, Errors: 1, Time elapsed: 0.288 sec
[junit] Test org.apache.bigtop.itest.DummyTestError FAILED
[junit] Running org.apache.bigtop.itest.DummyTestPass
[junit] Tests run: 1, Failures: 0, Errors: 0, Time elapsed: 0.274 sec
[junit] Running org.apache.bigtop.itest.DummyTestPass
[junit] Tests run: 1, Failures: 0, Errors: 0, Time elapsed: 0.274 sec
Tests run: 4, Failures: 0, Errors: 0, Skipped: 0, Time elapsed: 4.946 sec
Running org.apache.bigtop.itest.junit.OrderedParameterizedTest
Tests run: 3, Failures: 0, Errors: 0, Skipped: 0, Time elapsed: 0.05 sec
Running org.apache.bigtop.itest.junit.OrderedTest
Tests run: 3, Failures: 0, Errors: 0, Skipped: 0, Time elapsed: 0.007 sec
Running org.apache.bigtop.itest.posix.UGITest
Tests run: 2, Failures: 0, Errors: 0, Skipped: 0, Time elapsed: 0.074 sec
Running org.apache.bigtop.itest.posix.ServiceTest
Status []
Tests run: 2, Failures: 0, Errors: 0, Skipped: 1, Time elapsed: 0.132 sec
Running org.apache.bigtop.itest.posix.AlternativeTest
Tests run: 1, Failures: 0, Errors: 0, Skipped: 0, Time elapsed: 1.248 sec
Running org.apache.bigtop.itest.TestContractGroovy
Tests run: 2, Failures: 0, Errors: 0, Skipped: 0, Time elapsed: 0.01 sec
Running org.apache.bigtop.itest.pmanager.PackageManagerTest
/etc/cron.monthly/.placeholder
/etc/cron.hourly/.placeholder
/etc/default/cron
/etc/cron.weekly/.placeholder
/etc/cron.d/.placeholder
/etc/cron.daily/.placeholder
/etc/pam.d/cron
/etc/init/cron.conf
/etc/crontab
/.
/etc
/etc/cron.monthly
/etc/cron.monthly/.placeholder
/etc/cron.hourly
/etc/cron.hourly/.placeholder
/etc/default
/etc/default/cron
/etc/cron.weekly
/etc/cron.weekly/.placeholder
/etc/cron.d
/etc/cron.d/.placeholder
/etc/cron.daily
/etc/cron.daily/.placeholder
/etc/pam.d
/etc/pam.d/cron
/etc/init
/etc/init/cron.conf
/etc/init.d
/etc/crontab
/usr
/usr/share
/usr/share/bug
/usr/share/bug/cron
/usr/share/bug/cron/script
/usr/share/bug/cron/control
/usr/share/man
/usr/share/man/man1
/usr/share/man/man1/crontab.1.gz
/usr/share/man/man5
/usr/share/man/man5/crontab.5.gz
/usr/share/man/man8
/usr/share/man/man8/cron.8.gz
/usr/share/doc
/usr/share/doc/cron
/usr/share/doc/cron/README
/usr/share/doc/cron/README.anacron
/usr/share/doc/cron/README.Debian
/usr/share/doc/cron/FEATURES
/usr/share/doc/cron/copyright
/usr/share/doc/cron/examples
/usr/share/doc/cron/examples/crontab2english.pl
/usr/share/doc/cron/examples/cron-stats.pl
/usr/share/doc/cron/examples/cron-tasks-review.sh
/usr/share/doc/cron/NEWS.Debian.gz
/usr/share/doc/cron/changelog.Debian.gz
/usr/share/doc/cron/THANKS
/usr/share/doc/cron/TODO.Debian
/usr/sbin
/usr/sbin/cron
/usr/bin
/usr/bin/crontab
/var
/var/spool
/var/spool/cron
/var/spool/cron/crontabs
/etc/init.d/cron
Tests run: 11, Failures: 0, Errors: 0, Skipped: 3, Time elapsed: 1.708 sec
Running org.apache.bigtop.itest.TestContractJava
Tests run: 2, Failures: 0, Errors: 0, Skipped: 0, Time elapsed: 0.002 sec
Running org.apache.bigtop.itest.TestListUtilsTest
Tests run: 1, Failures: 0, Errors: 0, Skipped: 0, Time elapsed: 0.016 sec
Running org.apache.bigtop.itest.shell.ShellTest
Tests run: 2, Failures: 0, Errors: 0, Skipped: 1, Time elapsed: 0.025 sec
Running org.apache.bigtop.itest.JarContentTest
log4j:WARN No appenders could be found for logger (org.apache.bigtop.itest.JarContent).
log4j:WARN Please initialize the log4j system properly.
Tests run: 6, Failures: 0, Errors: 0, Skipped: 0, Time elapsed: 0.842 sec
Running org.apache.bigtop.itest.TestContractJavaProc
Tests run: 2, Failures: 0, Errors: 0, Skipped: 0, Time elapsed: 0.002 sec
Results :
Tests run: 41, Failures: 0, Errors: 0, Skipped: 5
[JENKINS] Recording test results
log4j:WARN No appenders could be found for logger (org.apache.commons.beanutils.converters.BooleanConverter).
log4j:WARN Please initialize the log4j system properly.
[INFO]
[INFO] --- maven-jar-plugin:2.2:jar (default-jar) @ itest-common ---
[INFO] Building jar: <https://builds.apache.org/job/Bigtop-trunk-iTest/org.apache.bigtop.itest$itest-common/ws/target/itest-common-0.9.0-SNAPSHOT.jar>
[INFO]
[INFO] --- maven-jar-plugin:2.2:test-jar (default) @ itest-common ---
[INFO] Building jar: <https://builds.apache.org/job/Bigtop-trunk-iTest/org.apache.bigtop.itest$itest-common/ws/target/itest-common-0.9.0-SNAPSHOT-tests.jar>
[INFO]
[INFO] --- maven-failsafe-plugin:2.17:verify (default) @ itest-common ---
[INFO] Failsafe report directory: <https://builds.apache.org/job/Bigtop-trunk-iTest/org.apache.bigtop.itest$itest-common/ws/target/failsafe-reports>
[WARNING] File encoding has not been set, using platform encoding ISO-8859-1, i.e. build is platform dependent!
[JENKINS] Recording test results
[INFO] ------------------------------------------------------------------------
[INFO] BUILD FAILURE
[INFO] ------------------------------------------------------------------------
[INFO] Total time: 24.870s
[INFO] Finished at: Thu Jan 29 05:07:13 UTC 2015
[INFO] Final Memory: 14M/244M
[INFO] ------------------------------------------------------------------------
Waiting for Jenkins to finish collecting data
[ERROR] Failed to execute goal org.apache.maven.plugins:maven-failsafe-plugin:2.17:verify (default) on project itest-common: <https://builds.apache.org/job/Bigtop-trunk-iTest/org.apache.bigtop.itest$itest-common/ws/target/failsafe-reports/failsafe-summary.xml> (No such file or directory) -> [Help 1]
[ERROR]
[ERROR] To see the full stack trace of the errors, re-run Maven with the -e switch.
[ERROR] Re-run Maven using the -X switch to enable full debug logging.
[ERROR]
[ERROR] For more information about the errors and possible solutions, please read the following articles:
[ERROR] [Help 1] http://cwiki.apache.org/confluence/display/MAVEN/MojoExecutionException
Build failed in Jenkins: Bigtop-trunk-iTest » iTest: system and integration testing in the cloud #2006
Posted by Apache Jenkins Server <je...@builds.apache.org>.
See <https://builds.apache.org/job/Bigtop-trunk-iTest/org.apache.bigtop.itest$itest-common/2006/>
------------------------------------------
maven3-agent.jar already up to date
maven3-interceptor.jar already up to date
maven3-interceptor-commons.jar already up to date
<===[JENKINS REMOTING CAPACITY]===> channel started
Executing Maven: -B -f <https://builds.apache.org/job/Bigtop-trunk-iTest/org.apache.bigtop.itest$itest-common/ws/pom.xml> -Dmaven.repo.local=/home/jenkins/jenkins-slave/maven-repositories/0 clean deploy
[INFO] Scanning for projects...
[INFO]
[INFO] ------------------------------------------------------------------------
[INFO] Building iTest: system and integration testing in the cloud 0.9.0-SNAPSHOT
[INFO] ------------------------------------------------------------------------
[INFO]
[INFO] --- maven-clean-plugin:2.4.1:clean (default-clean) @ itest-common ---
[INFO] Deleting <https://builds.apache.org/job/Bigtop-trunk-iTest/org.apache.bigtop.itest$itest-common/ws/target>
[INFO]
[INFO] --- groovy-eclipse-compiler:2.8.0-01:add-groovy-build-paths (default-add-groovy-build-paths) @ itest-common ---
[INFO] Adding /src/main/groovy to the list of source folders
[INFO] Adding /src/test/groovy to the list of test source folders
[INFO]
[INFO] --- maven-remote-resources-plugin:1.1:process (default) @ itest-common ---
[INFO] Setting property: classpath.resource.loader.class => 'org.codehaus.plexus.velocity.ContextClassLoaderResourceLoader'.
[INFO] Setting property: velocimacro.messages.on => 'false'.
[INFO] Setting property: resource.loader => 'classpath'.
[INFO] Setting property: resource.manager.logwhenfound => 'false'.
[INFO]
[INFO] --- maven-resources-plugin:2.4:resources (default-resources) @ itest-common ---
[INFO] Using 'UTF-8' encoding to copy filtered resources.
[INFO] skip non existing resourceDirectory <https://builds.apache.org/job/Bigtop-trunk-iTest/org.apache.bigtop.itest$itest-common/ws/src/main/resources>
[INFO] Copying 3 resources
[INFO]
[INFO] --- maven-compiler-plugin:3.1:compile (default-compile) @ itest-common ---
[INFO] Changes detected - recompiling the module!
[INFO] Using Groovy-Eclipse compiler to compile both Java and Groovy files
[INFO]
[INFO] --- maven-resources-plugin:2.4:testResources (default-testResources) @ itest-common ---
[INFO] Using 'UTF-8' encoding to copy filtered resources.
[INFO] skip non existing resourceDirectory <https://builds.apache.org/job/Bigtop-trunk-iTest/org.apache.bigtop.itest$itest-common/ws/src/test/resources>
[INFO] Copying 3 resources
[INFO]
[INFO] --- maven-compiler-plugin:3.1:testCompile (default-testCompile) @ itest-common ---
[INFO] Changes detected - recompiling the module!
[INFO] Using Groovy-Eclipse compiler to compile both Java and Groovy files
[INFO]
[INFO] --- maven-surefire-plugin:2.7:test (default-test) @ itest-common ---
[INFO] Surefire report directory: <https://builds.apache.org/job/Bigtop-trunk-iTest/org.apache.bigtop.itest$itest-common/ws/target/surefire-reports>
-------------------------------------------------------
T E S T S
-------------------------------------------------------
Running org.apache.bigtop.itest.JUnitUtilsTest
Disclaimer: This test expected to show a failure in an embeded testcase
[junit] Running org.apache.bigtop.itest.DummyTestPassTests run: 1, Failures: 0, Errors: 0, Time elapsed: 0.274 secRunning org.apache.bigtop.itest.DummyTestFail
[junit] Tests run: 1, Failures: 1, Errors: 0, Time elapsed: 0.149 secTEST org.apache.bigtop.itest.DummyTestFail FAILED
[junit] Tests FAILED
Disclaimer: This test expected to show an error in an embeded testcase
[junit] Running org.apache.bigtop.itest.DummyTestError
[junit] Tests run: 1, Failures: 0, Errors: 1, Time elapsed: 0.288 sec
[junit] Test org.apache.bigtop.itest.DummyTestError FAILED
[junit] Running org.apache.bigtop.itest.DummyTestPass
[junit] Tests run: 1, Failures: 0, Errors: 0, Time elapsed: 0.274 sec
[junit] Running org.apache.bigtop.itest.DummyTestPass
[junit] Tests run: 1, Failures: 0, Errors: 0, Time elapsed: 0.275 sec
Tests run: 4, Failures: 0, Errors: 0, Skipped: 0, Time elapsed: 4.975 sec
Running org.apache.bigtop.itest.junit.OrderedParameterizedTest
Tests run: 3, Failures: 0, Errors: 0, Skipped: 0, Time elapsed: 0.053 sec
Running org.apache.bigtop.itest.junit.OrderedTest
Tests run: 3, Failures: 0, Errors: 0, Skipped: 0, Time elapsed: 0.008 sec
Running org.apache.bigtop.itest.posix.UGITest
Tests run: 2, Failures: 0, Errors: 0, Skipped: 0, Time elapsed: 0.077 sec
Running org.apache.bigtop.itest.posix.ServiceTest
Status []
Tests run: 2, Failures: 0, Errors: 0, Skipped: 1, Time elapsed: 0.112 sec
Running org.apache.bigtop.itest.posix.AlternativeTest
Tests run: 1, Failures: 0, Errors: 0, Skipped: 0, Time elapsed: 1.246 sec
Running org.apache.bigtop.itest.TestContractGroovy
Tests run: 2, Failures: 0, Errors: 0, Skipped: 0, Time elapsed: 0.011 sec
Running org.apache.bigtop.itest.pmanager.PackageManagerTest
/etc/cron.monthly/.placeholder
/etc/cron.hourly/.placeholder
/etc/default/cron
/etc/cron.weekly/.placeholder
/etc/cron.d/.placeholder
/etc/cron.daily/.placeholder
/etc/pam.d/cron
/etc/init/cron.conf
/etc/crontab
/.
/etc
/etc/cron.monthly
/etc/cron.monthly/.placeholder
/etc/cron.hourly
/etc/cron.hourly/.placeholder
/etc/default
/etc/default/cron
/etc/cron.weekly
/etc/cron.weekly/.placeholder
/etc/cron.d
/etc/cron.d/.placeholder
/etc/cron.daily
/etc/cron.daily/.placeholder
/etc/pam.d
/etc/pam.d/cron
/etc/init
/etc/init/cron.conf
/etc/init.d
/etc/crontab
/usr
/usr/share
/usr/share/bug
/usr/share/bug/cron
/usr/share/bug/cron/script
/usr/share/bug/cron/control
/usr/share/man
/usr/share/man/man1
/usr/share/man/man1/crontab.1.gz
/usr/share/man/man5
/usr/share/man/man5/crontab.5.gz
/usr/share/man/man8
/usr/share/man/man8/cron.8.gz
/usr/share/doc
/usr/share/doc/cron
/usr/share/doc/cron/README
/usr/share/doc/cron/README.anacron
/usr/share/doc/cron/README.Debian
/usr/share/doc/cron/FEATURES
/usr/share/doc/cron/copyright
/usr/share/doc/cron/examples
/usr/share/doc/cron/examples/crontab2english.pl
/usr/share/doc/cron/examples/cron-stats.pl
/usr/share/doc/cron/examples/cron-tasks-review.sh
/usr/share/doc/cron/NEWS.Debian.gz
/usr/share/doc/cron/changelog.Debian.gz
/usr/share/doc/cron/THANKS
/usr/share/doc/cron/TODO.Debian
/usr/sbin
/usr/sbin/cron
/usr/bin
/usr/bin/crontab
/var
/var/spool
/var/spool/cron
/var/spool/cron/crontabs
/etc/init.d/cron
Tests run: 11, Failures: 0, Errors: 0, Skipped: 3, Time elapsed: 1.774 sec
Running org.apache.bigtop.itest.TestContractJava
Tests run: 2, Failures: 0, Errors: 0, Skipped: 0, Time elapsed: 0.001 sec
Running org.apache.bigtop.itest.TestListUtilsTest
Tests run: 1, Failures: 0, Errors: 0, Skipped: 0, Time elapsed: 0.016 sec
Running org.apache.bigtop.itest.shell.ShellTest
Tests run: 2, Failures: 0, Errors: 0, Skipped: 1, Time elapsed: 0.008 sec
Running org.apache.bigtop.itest.JarContentTest
log4j:WARN No appenders could be found for logger (org.apache.bigtop.itest.JarContent).
log4j:WARN Please initialize the log4j system properly.
Tests run: 6, Failures: 0, Errors: 0, Skipped: 0, Time elapsed: 0.889 sec
Running org.apache.bigtop.itest.TestContractJavaProc
Tests run: 2, Failures: 0, Errors: 0, Skipped: 0, Time elapsed: 0.001 sec
Results :
Tests run: 41, Failures: 0, Errors: 0, Skipped: 5
[JENKINS] Recording test results
log4j:WARN No appenders could be found for logger (org.apache.commons.beanutils.converters.BooleanConverter).
log4j:WARN Please initialize the log4j system properly.
[INFO]
[INFO] --- maven-jar-plugin:2.2:jar (default-jar) @ itest-common ---
[INFO] Building jar: <https://builds.apache.org/job/Bigtop-trunk-iTest/org.apache.bigtop.itest$itest-common/ws/target/itest-common-0.9.0-SNAPSHOT.jar>
[INFO]
[INFO] --- maven-jar-plugin:2.2:test-jar (default) @ itest-common ---
[INFO] Building jar: <https://builds.apache.org/job/Bigtop-trunk-iTest/org.apache.bigtop.itest$itest-common/ws/target/itest-common-0.9.0-SNAPSHOT-tests.jar>
[INFO]
[INFO] --- maven-failsafe-plugin:2.17:verify (default) @ itest-common ---
[INFO] Failsafe report directory: <https://builds.apache.org/job/Bigtop-trunk-iTest/org.apache.bigtop.itest$itest-common/ws/target/failsafe-reports>
[WARNING] File encoding has not been set, using platform encoding ISO-8859-1, i.e. build is platform dependent!
[JENKINS] Recording test results
[INFO] ------------------------------------------------------------------------
[INFO] BUILD FAILURE
[INFO] ------------------------------------------------------------------------
[INFO] Total time: 23.748s
[INFO] Finished at: Thu Jan 29 04:58:43 UTC 2015
[INFO] Final Memory: 14M/244M
[INFO] ------------------------------------------------------------------------
Waiting for Jenkins to finish collecting data
[ERROR] Failed to execute goal org.apache.maven.plugins:maven-failsafe-plugin:2.17:verify (default) on project itest-common: <https://builds.apache.org/job/Bigtop-trunk-iTest/org.apache.bigtop.itest$itest-common/ws/target/failsafe-reports/failsafe-summary.xml> (No such file or directory) -> [Help 1]
[ERROR]
[ERROR] To see the full stack trace of the errors, re-run Maven with the -e switch.
[ERROR] Re-run Maven using the -X switch to enable full debug logging.
[ERROR]
[ERROR] For more information about the errors and possible solutions, please read the following articles:
[ERROR] [Help 1] http://cwiki.apache.org/confluence/display/MAVEN/MojoExecutionException
Build failed in Jenkins: Bigtop-trunk-iTest » iTest: system and integration testing in the cloud #2005
Posted by Apache Jenkins Server <je...@builds.apache.org>.
See <https://builds.apache.org/job/Bigtop-trunk-iTest/org.apache.bigtop.itest$itest-common/2005/>
------------------------------------------
maven3-agent.jar already up to date
maven3-interceptor.jar already up to date
maven3-interceptor-commons.jar already up to date
<===[JENKINS REMOTING CAPACITY]===> channel started
Executing Maven: -B -f <https://builds.apache.org/job/Bigtop-trunk-iTest/org.apache.bigtop.itest$itest-common/ws/pom.xml> -Dmaven.repo.local=/home/jenkins/jenkins-slave/maven-repositories/0 clean deploy
[INFO] Scanning for projects...
[INFO]
[INFO] ------------------------------------------------------------------------
[INFO] Building iTest: system and integration testing in the cloud 0.9.0-SNAPSHOT
[INFO] ------------------------------------------------------------------------
[INFO]
[INFO] --- maven-clean-plugin:2.4.1:clean (default-clean) @ itest-common ---
[INFO]
[INFO] --- groovy-eclipse-compiler:2.8.0-01:add-groovy-build-paths (default-add-groovy-build-paths) @ itest-common ---
[INFO] Adding /src/main/groovy to the list of source folders
[INFO] Adding /src/test/groovy to the list of test source folders
[INFO]
[INFO] --- maven-remote-resources-plugin:1.1:process (default) @ itest-common ---
[INFO] Setting property: classpath.resource.loader.class => 'org.codehaus.plexus.velocity.ContextClassLoaderResourceLoader'.
[INFO] Setting property: velocimacro.messages.on => 'false'.
[INFO] Setting property: resource.loader => 'classpath'.
[INFO] Setting property: resource.manager.logwhenfound => 'false'.
[INFO]
[INFO] --- maven-resources-plugin:2.4:resources (default-resources) @ itest-common ---
[INFO] Using 'UTF-8' encoding to copy filtered resources.
[INFO] skip non existing resourceDirectory <https://builds.apache.org/job/Bigtop-trunk-iTest/org.apache.bigtop.itest$itest-common/ws/src/main/resources>
[INFO] Copying 3 resources
[INFO]
[INFO] --- maven-compiler-plugin:3.1:compile (default-compile) @ itest-common ---
[INFO] Changes detected - recompiling the module!
[INFO] Using Groovy-Eclipse compiler to compile both Java and Groovy files
[INFO]
[INFO] --- maven-resources-plugin:2.4:testResources (default-testResources) @ itest-common ---
[INFO] Using 'UTF-8' encoding to copy filtered resources.
[INFO] skip non existing resourceDirectory <https://builds.apache.org/job/Bigtop-trunk-iTest/org.apache.bigtop.itest$itest-common/ws/src/test/resources>
[INFO] Copying 3 resources
[INFO]
[INFO] --- maven-compiler-plugin:3.1:testCompile (default-testCompile) @ itest-common ---
[INFO] Changes detected - recompiling the module!
[INFO] Using Groovy-Eclipse compiler to compile both Java and Groovy files
[INFO]
[INFO] --- maven-surefire-plugin:2.7:test (default-test) @ itest-common ---
[INFO] Surefire report directory: <https://builds.apache.org/job/Bigtop-trunk-iTest/org.apache.bigtop.itest$itest-common/ws/target/surefire-reports>
-------------------------------------------------------
T E S T S
-------------------------------------------------------
Running org.apache.bigtop.itest.JUnitUtilsTest
Disclaimer: This test expected to show a failure in an embeded testcase
[junit] Running org.apache.bigtop.itest.DummyTestPassTests run: 1, Failures: 0, Errors: 0, Time elapsed: 0.275 secRunning org.apache.bigtop.itest.DummyTestFail
[junit] Tests run: 1, Failures: 1, Errors: 0, Time elapsed: 0.144 secTEST org.apache.bigtop.itest.DummyTestFail FAILED
[junit] Tests FAILED
Disclaimer: This test expected to show an error in an embeded testcase
[junit] Running org.apache.bigtop.itest.DummyTestError
[junit] Tests run: 1, Failures: 0, Errors: 1, Time elapsed: 0.317 sec
[junit] Test org.apache.bigtop.itest.DummyTestError FAILED
[junit] Running org.apache.bigtop.itest.DummyTestPass
[junit] Tests run: 1, Failures: 0, Errors: 0, Time elapsed: 0.275 sec
[junit] Running org.apache.bigtop.itest.DummyTestPass
[junit] Tests run: 1, Failures: 0, Errors: 0, Time elapsed: 0.288 sec
Tests run: 4, Failures: 0, Errors: 0, Skipped: 0, Time elapsed: 5.071 sec
Running org.apache.bigtop.itest.junit.OrderedParameterizedTest
Tests run: 3, Failures: 0, Errors: 0, Skipped: 0, Time elapsed: 0.051 sec
Running org.apache.bigtop.itest.junit.OrderedTest
Tests run: 3, Failures: 0, Errors: 0, Skipped: 0, Time elapsed: 0.008 sec
Running org.apache.bigtop.itest.posix.UGITest
Tests run: 2, Failures: 0, Errors: 0, Skipped: 0, Time elapsed: 0.077 sec
Running org.apache.bigtop.itest.posix.ServiceTest
Status []
Tests run: 2, Failures: 0, Errors: 0, Skipped: 1, Time elapsed: 0.111 sec
Running org.apache.bigtop.itest.posix.AlternativeTest
Tests run: 1, Failures: 0, Errors: 0, Skipped: 0, Time elapsed: 1.445 sec
Running org.apache.bigtop.itest.TestContractGroovy
Tests run: 2, Failures: 0, Errors: 0, Skipped: 0, Time elapsed: 0.011 sec
Running org.apache.bigtop.itest.pmanager.PackageManagerTest
/etc/cron.monthly/.placeholder
/etc/cron.hourly/.placeholder
/etc/default/cron
/etc/cron.weekly/.placeholder
/etc/cron.d/.placeholder
/etc/cron.daily/.placeholder
/etc/pam.d/cron
/etc/init/cron.conf
/etc/crontab
/.
/etc
/etc/cron.monthly
/etc/cron.monthly/.placeholder
/etc/cron.hourly
/etc/cron.hourly/.placeholder
/etc/default
/etc/default/cron
/etc/cron.weekly
/etc/cron.weekly/.placeholder
/etc/cron.d
/etc/cron.d/.placeholder
/etc/cron.daily
/etc/cron.daily/.placeholder
/etc/pam.d
/etc/pam.d/cron
/etc/init
/etc/init/cron.conf
/etc/init.d
/etc/crontab
/usr
/usr/share
/usr/share/bug
/usr/share/bug/cron
/usr/share/bug/cron/script
/usr/share/bug/cron/control
/usr/share/man
/usr/share/man/man1
/usr/share/man/man1/crontab.1.gz
/usr/share/man/man5
/usr/share/man/man5/crontab.5.gz
/usr/share/man/man8
/usr/share/man/man8/cron.8.gz
/usr/share/doc
/usr/share/doc/cron
/usr/share/doc/cron/README
/usr/share/doc/cron/README.anacron
/usr/share/doc/cron/README.Debian
/usr/share/doc/cron/FEATURES
/usr/share/doc/cron/copyright
/usr/share/doc/cron/examples
/usr/share/doc/cron/examples/crontab2english.pl
/usr/share/doc/cron/examples/cron-stats.pl
/usr/share/doc/cron/examples/cron-tasks-review.sh
/usr/share/doc/cron/NEWS.Debian.gz
/usr/share/doc/cron/changelog.Debian.gz
/usr/share/doc/cron/THANKS
/usr/share/doc/cron/TODO.Debian
/usr/sbin
/usr/sbin/cron
/usr/bin
/usr/bin/crontab
/var
/var/spool
/var/spool/cron
/var/spool/cron/crontabs
/etc/init.d/cron
Tests run: 11, Failures: 0, Errors: 0, Skipped: 3, Time elapsed: 1.814 sec
Running org.apache.bigtop.itest.TestContractJava
Tests run: 2, Failures: 0, Errors: 0, Skipped: 0, Time elapsed: 0.002 sec
Running org.apache.bigtop.itest.TestListUtilsTest
Tests run: 1, Failures: 0, Errors: 0, Skipped: 0, Time elapsed: 0.017 sec
Running org.apache.bigtop.itest.shell.ShellTest
Tests run: 2, Failures: 0, Errors: 0, Skipped: 1, Time elapsed: 0.008 sec
Running org.apache.bigtop.itest.JarContentTest
log4j:WARN No appenders could be found for logger (org.apache.bigtop.itest.JarContent).
log4j:WARN Please initialize the log4j system properly.
Tests run: 6, Failures: 0, Errors: 0, Skipped: 0, Time elapsed: 0.855 sec
Running org.apache.bigtop.itest.TestContractJavaProc
Tests run: 2, Failures: 0, Errors: 0, Skipped: 0, Time elapsed: 0.001 sec
Results :
Tests run: 41, Failures: 0, Errors: 0, Skipped: 5
[JENKINS] Recording test results
log4j:WARN No appenders could be found for logger (org.apache.commons.beanutils.converters.BooleanConverter).
log4j:WARN Please initialize the log4j system properly.
[INFO]
[INFO] --- maven-jar-plugin:2.2:jar (default-jar) @ itest-common ---
[INFO] Building jar: <https://builds.apache.org/job/Bigtop-trunk-iTest/org.apache.bigtop.itest$itest-common/ws/target/itest-common-0.9.0-SNAPSHOT.jar>
[INFO]
[INFO] --- maven-jar-plugin:2.2:test-jar (default) @ itest-common ---
[INFO] Building jar: <https://builds.apache.org/job/Bigtop-trunk-iTest/org.apache.bigtop.itest$itest-common/ws/target/itest-common-0.9.0-SNAPSHOT-tests.jar>
[INFO]
[INFO] --- maven-failsafe-plugin:2.17:verify (default) @ itest-common ---
[INFO] Failsafe report directory: <https://builds.apache.org/job/Bigtop-trunk-iTest/org.apache.bigtop.itest$itest-common/ws/target/failsafe-reports>
[WARNING] File encoding has not been set, using platform encoding ISO-8859-1, i.e. build is platform dependent!
[JENKINS] Recording test results
[INFO] ------------------------------------------------------------------------
[INFO] BUILD FAILURE
[INFO] ------------------------------------------------------------------------
[INFO] Total time: 24.559s
[INFO] Finished at: Thu Jan 29 02:32:27 UTC 2015
[INFO] Final Memory: 14M/244M
[INFO] ------------------------------------------------------------------------
Waiting for Jenkins to finish collecting data
[ERROR] Failed to execute goal org.apache.maven.plugins:maven-failsafe-plugin:2.17:verify (default) on project itest-common: <https://builds.apache.org/job/Bigtop-trunk-iTest/org.apache.bigtop.itest$itest-common/ws/target/failsafe-reports/failsafe-summary.xml> (No such file or directory) -> [Help 1]
[ERROR]
[ERROR] To see the full stack trace of the errors, re-run Maven with the -e switch.
[ERROR] Re-run Maven using the -X switch to enable full debug logging.
[ERROR]
[ERROR] For more information about the errors and possible solutions, please read the following articles:
[ERROR] [Help 1] http://cwiki.apache.org/confluence/display/MAVEN/MojoExecutionException
Build failed in Jenkins: Bigtop-trunk-iTest » iTest: system and integration testing in the cloud #2004
Posted by Apache Jenkins Server <je...@builds.apache.org>.
See <https://builds.apache.org/job/Bigtop-trunk-iTest/org.apache.bigtop.itest$itest-common/2004/>
------------------------------------------
[...truncated 21 lines...]
Downloaded: http://nexus.codehaus.org/snapshots/org/codehaus/groovy/groovy-eclipse-batch/2.3.1-01-SNAPSHOT/maven-metadata.xml (2 KB at 4.9 KB/sec)
Downloading: http://repository.codehaus.org/org/codehaus/groovy/groovy-eclipse-batch/2.3.2-01-SNAPSHOT/maven-metadata.xml
Downloading: http://nexus.codehaus.org/snapshots/org/codehaus/groovy/groovy-eclipse-batch/2.3.2-01-SNAPSHOT/maven-metadata.xml
Downloaded: http://nexus.codehaus.org/snapshots/org/codehaus/groovy/groovy-eclipse-batch/2.3.2-01-SNAPSHOT/maven-metadata.xml (2 KB at 4.6 KB/sec)
Downloading: http://repository.codehaus.org/org/codehaus/groovy/groovy-eclipse-batch/2.3.3-01-SNAPSHOT/maven-metadata.xml
Downloading: http://nexus.codehaus.org/snapshots/org/codehaus/groovy/groovy-eclipse-batch/2.3.3-01-SNAPSHOT/maven-metadata.xml
Downloaded: http://nexus.codehaus.org/snapshots/org/codehaus/groovy/groovy-eclipse-batch/2.3.3-01-SNAPSHOT/maven-metadata.xml (2 KB at 5.0 KB/sec)
Downloading: http://nexus.codehaus.org/snapshots/org/codehaus/groovy/groovy-eclipse-batch/2.3.4-01-SNAPSHOT/maven-metadata.xml
Downloading: http://repository.codehaus.org/org/codehaus/groovy/groovy-eclipse-batch/2.3.4-01-SNAPSHOT/maven-metadata.xml
Downloaded: http://nexus.codehaus.org/snapshots/org/codehaus/groovy/groovy-eclipse-batch/2.3.4-01-SNAPSHOT/maven-metadata.xml (378 B at 1.5 KB/sec)
[INFO]
[INFO] ------------------------------------------------------------------------
[INFO] Building iTest: system and integration testing in the cloud 0.9.0-SNAPSHOT
[INFO] ------------------------------------------------------------------------
[INFO]
[INFO] --- groovy-eclipse-compiler:2.8.0-01:add-groovy-build-paths (default-add-groovy-build-paths) @ itest-common ---
[INFO] Adding /src/main/groovy to the list of source folders
[INFO] Adding /src/test/groovy to the list of test source folders
[INFO]
[INFO] --- maven-remote-resources-plugin:1.1:process (default) @ itest-common ---
[INFO] Setting property: classpath.resource.loader.class => 'org.codehaus.plexus.velocity.ContextClassLoaderResourceLoader'.
[INFO] Setting property: velocimacro.messages.on => 'false'.
[INFO] Setting property: resource.loader => 'classpath'.
[INFO] Setting property: resource.manager.logwhenfound => 'false'.
[INFO]
[INFO] --- maven-resources-plugin:2.4:resources (default-resources) @ itest-common ---
[INFO] Using 'UTF-8' encoding to copy filtered resources.
[INFO] skip non existing resourceDirectory <https://builds.apache.org/job/Bigtop-trunk-iTest/org.apache.bigtop.itest$itest-common/ws/src/main/resources>
[INFO] Copying 3 resources
[INFO]
[INFO] --- maven-compiler-plugin:3.1:compile (default-compile) @ itest-common ---
[INFO] Changes detected - recompiling the module!
[INFO] Using Groovy-Eclipse compiler to compile both Java and Groovy files
[INFO]
[INFO] --- maven-resources-plugin:2.4:testResources (default-testResources) @ itest-common ---
[INFO] Using 'UTF-8' encoding to copy filtered resources.
[INFO] skip non existing resourceDirectory <https://builds.apache.org/job/Bigtop-trunk-iTest/org.apache.bigtop.itest$itest-common/ws/src/test/resources>
[INFO] Copying 3 resources
[INFO]
[INFO] --- maven-compiler-plugin:3.1:testCompile (default-testCompile) @ itest-common ---
[INFO] Changes detected - recompiling the module!
[INFO] Using Groovy-Eclipse compiler to compile both Java and Groovy files
[INFO]
[INFO] --- maven-surefire-plugin:2.7:test (default-test) @ itest-common ---
[INFO] Surefire report directory: <https://builds.apache.org/job/Bigtop-trunk-iTest/org.apache.bigtop.itest$itest-common/ws/target/surefire-reports>
-------------------------------------------------------
T E S T S
-------------------------------------------------------
Running org.apache.bigtop.itest.JUnitUtilsTest
Disclaimer: This test expected to show a failure in an embeded testcase
[junit] Running org.apache.bigtop.itest.DummyTestPassTests run: 1, Failures: 0, Errors: 0, Time elapsed: 0.275 secRunning org.apache.bigtop.itest.DummyTestFail
[junit] Tests run: 1, Failures: 1, Errors: 0, Time elapsed: 0.149 secTEST org.apache.bigtop.itest.DummyTestFail FAILED
[junit] Tests FAILED
Disclaimer: This test expected to show an error in an embeded testcase
[junit] Running org.apache.bigtop.itest.DummyTestErrorTests run: 1, Failures: 0, Errors: 1, Time elapsed: 0.295 sec
[junit] Test org.apache.bigtop.itest.DummyTestError FAILED
[junit] Running org.apache.bigtop.itest.DummyTestPass
[junit] Tests run: 1, Failures: 0, Errors: 0, Time elapsed: 0.275 sec
[junit] Running org.apache.bigtop.itest.DummyTestPass
[junit] Tests run: 1, Failures: 0, Errors: 0, Time elapsed: 0.279 sec
Tests run: 4, Failures: 0, Errors: 0, Skipped: 0, Time elapsed: 5.004 sec
Running org.apache.bigtop.itest.junit.OrderedParameterizedTest
Tests run: 3, Failures: 0, Errors: 0, Skipped: 0, Time elapsed: 0.051 sec
Running org.apache.bigtop.itest.junit.OrderedTest
Tests run: 3, Failures: 0, Errors: 0, Skipped: 0, Time elapsed: 0.008 sec
Running org.apache.bigtop.itest.posix.UGITest
Tests run: 2, Failures: 0, Errors: 0, Skipped: 0, Time elapsed: 0.079 sec
Running org.apache.bigtop.itest.posix.ServiceTest
Status []
Tests run: 2, Failures: 0, Errors: 0, Skipped: 1, Time elapsed: 0.116 sec
Running org.apache.bigtop.itest.posix.AlternativeTest
Tests run: 1, Failures: 0, Errors: 0, Skipped: 0, Time elapsed: 1.287 sec
Running org.apache.bigtop.itest.TestContractGroovy
Tests run: 2, Failures: 0, Errors: 0, Skipped: 0, Time elapsed: 0.011 sec
Running org.apache.bigtop.itest.pmanager.PackageManagerTest
/etc/cron.monthly/.placeholder
/etc/cron.hourly/.placeholder
/etc/default/cron
/etc/cron.weekly/.placeholder
/etc/cron.d/.placeholder
/etc/cron.daily/.placeholder
/etc/pam.d/cron
/etc/init/cron.conf
/etc/crontab
/.
/etc
/etc/cron.monthly
/etc/cron.monthly/.placeholder
/etc/cron.hourly
/etc/cron.hourly/.placeholder
/etc/default
/etc/default/cron
/etc/cron.weekly
/etc/cron.weekly/.placeholder
/etc/cron.d
/etc/cron.d/.placeholder
/etc/cron.daily
/etc/cron.daily/.placeholder
/etc/pam.d
/etc/pam.d/cron
/etc/init
/etc/init/cron.conf
/etc/init.d
/etc/crontab
/usr
/usr/share
/usr/share/bug
/usr/share/bug/cron
/usr/share/bug/cron/script
/usr/share/bug/cron/control
/usr/share/man
/usr/share/man/man1
/usr/share/man/man1/crontab.1.gz
/usr/share/man/man5
/usr/share/man/man5/crontab.5.gz
/usr/share/man/man8
/usr/share/man/man8/cron.8.gz
/usr/share/doc
/usr/share/doc/cron
/usr/share/doc/cron/README
/usr/share/doc/cron/README.anacron
/usr/share/doc/cron/README.Debian
/usr/share/doc/cron/FEATURES
/usr/share/doc/cron/copyright
/usr/share/doc/cron/examples
/usr/share/doc/cron/examples/crontab2english.pl
/usr/share/doc/cron/examples/cron-stats.pl
/usr/share/doc/cron/examples/cron-tasks-review.sh
/usr/share/doc/cron/NEWS.Debian.gz
/usr/share/doc/cron/changelog.Debian.gz
/usr/share/doc/cron/THANKS
/usr/share/doc/cron/TODO.Debian
/usr/sbin
/usr/sbin/cron
/usr/bin
/usr/bin/crontab
/var
/var/spool
/var/spool/cron
/var/spool/cron/crontabs
/etc/init.d/cron
Tests run: 11, Failures: 0, Errors: 0, Skipped: 3, Time elapsed: 1.667 sec
Running org.apache.bigtop.itest.TestContractJava
Tests run: 2, Failures: 0, Errors: 0, Skipped: 0, Time elapsed: 0.001 sec
Running org.apache.bigtop.itest.TestListUtilsTest
Tests run: 1, Failures: 0, Errors: 0, Skipped: 0, Time elapsed: 0.016 sec
Running org.apache.bigtop.itest.shell.ShellTest
Tests run: 2, Failures: 0, Errors: 0, Skipped: 1, Time elapsed: 0.019 sec
Running org.apache.bigtop.itest.JarContentTest
log4j:WARN No appenders could be found for logger (org.apache.bigtop.itest.JarContent).
log4j:WARN Please initialize the log4j system properly.
Tests run: 6, Failures: 0, Errors: 0, Skipped: 0, Time elapsed: 0.856 sec
Running org.apache.bigtop.itest.TestContractJavaProc
Tests run: 2, Failures: 0, Errors: 0, Skipped: 0, Time elapsed: 0.003 sec
Results :
Tests run: 41, Failures: 0, Errors: 0, Skipped: 5
[JENKINS] Recording test results
log4j:WARN No appenders could be found for logger (org.apache.commons.beanutils.converters.BooleanConverter).
log4j:WARN Please initialize the log4j system properly.
[INFO]
[INFO] --- maven-jar-plugin:2.2:jar (default-jar) @ itest-common ---
[INFO] Building jar: <https://builds.apache.org/job/Bigtop-trunk-iTest/org.apache.bigtop.itest$itest-common/ws/target/itest-common-0.9.0-SNAPSHOT.jar>
[INFO]
[INFO] --- maven-jar-plugin:2.2:test-jar (default) @ itest-common ---
[INFO] Building jar: <https://builds.apache.org/job/Bigtop-trunk-iTest/org.apache.bigtop.itest$itest-common/ws/target/itest-common-0.9.0-SNAPSHOT-tests.jar>
[INFO]
[INFO] --- maven-failsafe-plugin:2.17:verify (default) @ itest-common ---
[INFO] Failsafe report directory: <https://builds.apache.org/job/Bigtop-trunk-iTest/org.apache.bigtop.itest$itest-common/ws/target/failsafe-reports>
[WARNING] File encoding has not been set, using platform encoding ISO-8859-1, i.e. build is platform dependent!
[ERROR] There are test failures.
Please refer to <https://builds.apache.org/job/Bigtop-trunk-iTest/org.apache.bigtop.itest$itest-common/ws/target/failsafe-reports> for the individual test results.
[JENKINS] Recording test results
hudson.AbortException: Test reports were found but none of them are new. Did tests run?
For example, <https://builds.apache.org/job/Bigtop-trunk-iTest/org.apache.bigtop.itest$itest-common/ws/target/failsafe-reports/TEST-org.apache.bigtop.itest.failures.IntegrationTestClusterFailures.xml> is 2 days 11 hr old
at hudson.tasks.junit.TestResult.parse(TestResult.java:213)
at hudson.maven.reporters.SurefireArchiver.postExecute(SurefireArchiver.java:148)
at hudson.maven.Maven3Builder$MavenExecutionListener.recordMojoEnded(Maven3Builder.java:634)
at hudson.maven.Maven3Builder$MavenExecutionListener.mojoSucceeded(Maven3Builder.java:615)
at org.apache.maven.lifecycle.internal.DefaultExecutionEventCatapult.fire(DefaultExecutionEventCatapult.java:87)
at org.apache.maven.lifecycle.internal.DefaultExecutionEventCatapult.fire(DefaultExecutionEventCatapult.java:42)
at org.apache.maven.lifecycle.internal.MojoExecutor.execute(MojoExecutor.java:228)
at org.apache.maven.lifecycle.internal.MojoExecutor.execute(MojoExecutor.java:153)
at org.apache.maven.lifecycle.internal.MojoExecutor.execute(MojoExecutor.java:145)
at org.apache.maven.lifecycle.internal.LifecycleModuleBuilder.buildProject(LifecycleModuleBuilder.java:84)
at org.apache.maven.lifecycle.internal.LifecycleModuleBuilder.buildProject(LifecycleModuleBuilder.java:59)
at org.apache.maven.lifecycle.internal.LifecycleStarter.singleThreadedBuild(LifecycleStarter.java:183)
at org.apache.maven.lifecycle.internal.LifecycleStarter.execute(LifecycleStarter.java:161)
at org.apache.maven.DefaultMaven.doExecute(DefaultMaven.java:320)
at org.apache.maven.DefaultMaven.execute(DefaultMaven.java:156)
at org.jvnet.hudson.maven3.launcher.Maven3Launcher.main(Maven3Launcher.java:117)
at sun.reflect.NativeMethodAccessorImpl.invoke0(Native Method)
at sun.reflect.NativeMethodAccessorImpl.invoke(NativeMethodAccessorImpl.java:39)
at sun.reflect.DelegatingMethodAccessorImpl.invoke(DelegatingMethodAccessorImpl.java:25)
at java.lang.reflect.Method.invoke(Method.java:597)
at org.codehaus.plexus.classworlds.launcher.Launcher.launchStandard(Launcher.java:329)
at org.codehaus.plexus.classworlds.launcher.Launcher.launch(Launcher.java:239)
at org.jvnet.hudson.maven3.agent.Maven3Main.launch(Maven3Main.java:178)
at sun.reflect.NativeMethodAccessorImpl.invoke0(Native Method)
at sun.reflect.NativeMethodAccessorImpl.invoke(NativeMethodAccessorImpl.java:39)
at sun.reflect.DelegatingMethodAccessorImpl.invoke(DelegatingMethodAccessorImpl.java:25)
at java.lang.reflect.Method.invoke(Method.java:597)
at hudson.maven.Maven3Builder.call(Maven3Builder.java:136)
at hudson.maven.Maven3Builder.call(Maven3Builder.java:71)
at hudson.remoting.UserRequest.perform(UserRequest.java:118)
at hudson.remoting.UserRequest.perform(UserRequest.java:48)
at hudson.remoting.Request$2.run(Request.java:328)
at hudson.remoting.InterceptingExecutorService$1.call(InterceptingExecutorService.java:72)
at java.util.concurrent.FutureTask$Sync.innerRun(FutureTask.java:303)
at java.util.concurrent.FutureTask.run(FutureTask.java:138)
at java.util.concurrent.ThreadPoolExecutor$Worker.runTask(ThreadPoolExecutor.java:895)
at java.util.concurrent.ThreadPoolExecutor$Worker.run(ThreadPoolExecutor.java:918)
at java.lang.Thread.run(Thread.java:662)
[INFO]
[INFO] --- maven-install-plugin:2.3:install (default-install) @ itest-common ---
[INFO] Installing <https://builds.apache.org/job/Bigtop-trunk-iTest/org.apache.bigtop.itest$itest-common/ws/target/itest-common-0.9.0-SNAPSHOT.jar> to /home/jenkins/jenkins-slave/maven-repositories/1/org/apache/bigtop/itest/itest-common/0.9.0-SNAPSHOT/itest-common-0.9.0-SNAPSHOT.jar
[INFO] Installing <https://builds.apache.org/job/Bigtop-trunk-iTest/org.apache.bigtop.itest$itest-common/ws/pom.xml> to /home/jenkins/jenkins-slave/maven-repositories/1/org/apache/bigtop/itest/itest-common/0.9.0-SNAPSHOT/itest-common-0.9.0-SNAPSHOT.pom
[INFO] Installing <https://builds.apache.org/job/Bigtop-trunk-iTest/org.apache.bigtop.itest$itest-common/ws/target/itest-common-0.9.0-SNAPSHOT-tests.jar> to /home/jenkins/jenkins-slave/maven-repositories/1/org/apache/bigtop/itest/itest-common/0.9.0-SNAPSHOT/itest-common-0.9.0-SNAPSHOT-tests.jar
[INFO]
[INFO] --- maven-deploy-plugin:2.5:deploy (default-deploy) @ itest-common ---
Downloading: https://repository.apache.org/content/repositories/snapshots/org/apache/bigtop/itest/itest-common/0.9.0-SNAPSHOT/maven-metadata.xml
Downloaded: https://repository.apache.org/content/repositories/snapshots/org/apache/bigtop/itest/itest-common/0.9.0-SNAPSHOT/maven-metadata.xml (1005 B at 2.6 KB/sec)
Uploading: https://repository.apache.org/content/repositories/snapshots/org/apache/bigtop/itest/itest-common/0.9.0-SNAPSHOT/itest-common-0.9.0-20150129.020112-199.jar
Uploaded: https://repository.apache.org/content/repositories/snapshots/org/apache/bigtop/itest/itest-common/0.9.0-SNAPSHOT/itest-common-0.9.0-20150129.020112-199.jar (206 KB at 1073.5 KB/sec)
Uploading: https://repository.apache.org/content/repositories/snapshots/org/apache/bigtop/itest/itest-common/0.9.0-SNAPSHOT/itest-common-0.9.0-20150129.020112-199.pom
Uploaded: https://repository.apache.org/content/repositories/snapshots/org/apache/bigtop/itest/itest-common/0.9.0-SNAPSHOT/itest-common-0.9.0-20150129.020112-199.pom (6 KB at 32.9 KB/sec)
Downloading: https://repository.apache.org/content/repositories/snapshots/org/apache/bigtop/itest/itest-common/maven-metadata.xml
Downloaded: https://repository.apache.org/content/repositories/snapshots/org/apache/bigtop/itest/itest-common/maven-metadata.xml (466 B at 6.6 KB/sec)
Uploading: https://repository.apache.org/content/repositories/snapshots/org/apache/bigtop/itest/itest-common/0.9.0-SNAPSHOT/maven-metadata.xml
Uploaded: https://repository.apache.org/content/repositories/snapshots/org/apache/bigtop/itest/itest-common/0.9.0-SNAPSHOT/maven-metadata.xml (1005 B at 8.6 KB/sec)
Uploading: https://repository.apache.org/content/repositories/snapshots/org/apache/bigtop/itest/itest-common/maven-metadata.xml
Uploaded: https://repository.apache.org/content/repositories/snapshots/org/apache/bigtop/itest/itest-common/maven-metadata.xml (466 B at 3.3 KB/sec)
Uploading: https://repository.apache.org/content/repositories/snapshots/org/apache/bigtop/itest/itest-common/0.9.0-SNAPSHOT/itest-common-0.9.0-20150129.020112-199-tests.jar
Uploaded: https://repository.apache.org/content/repositories/snapshots/org/apache/bigtop/itest/itest-common/0.9.0-SNAPSHOT/itest-common-0.9.0-20150129.020112-199-tests.jar (70 KB at 396.9 KB/sec)
Uploading: https://repository.apache.org/content/repositories/snapshots/org/apache/bigtop/itest/itest-common/0.9.0-SNAPSHOT/maven-metadata.xml
Uploaded: https://repository.apache.org/content/repositories/snapshots/org/apache/bigtop/itest/itest-common/0.9.0-SNAPSHOT/maven-metadata.xml (1005 B at 6.7 KB/sec)
[INFO] ------------------------------------------------------------------------
[INFO] BUILD SUCCESS
[INFO] ------------------------------------------------------------------------
[INFO] Total time: 28.230s
[INFO] Finished at: Thu Jan 29 02:01:13 UTC 2015
[INFO] Final Memory: 16M/245M
[INFO] ------------------------------------------------------------------------
Waiting for Jenkins to finish collecting data
Build failed in Jenkins: Bigtop-trunk-iTest » iTest: system and integration testing in the cloud #2003
Posted by Apache Jenkins Server <je...@builds.apache.org>.
See <https://builds.apache.org/job/Bigtop-trunk-iTest/org.apache.bigtop.itest$itest-common/2003/>
------------------------------------------
[...truncated 22 lines...]
Downloading: http://repository.codehaus.org/org/codehaus/groovy/groovy-eclipse-batch/2.3.2-01-SNAPSHOT/maven-metadata.xml
Downloading: http://nexus.codehaus.org/snapshots/org/codehaus/groovy/groovy-eclipse-batch/2.3.2-01-SNAPSHOT/maven-metadata.xml
Downloaded: http://nexus.codehaus.org/snapshots/org/codehaus/groovy/groovy-eclipse-batch/2.3.2-01-SNAPSHOT/maven-metadata.xml (2 KB at 4.5 KB/sec)
Downloading: http://repository.codehaus.org/org/codehaus/groovy/groovy-eclipse-batch/2.3.3-01-SNAPSHOT/maven-metadata.xml
Downloading: http://nexus.codehaus.org/snapshots/org/codehaus/groovy/groovy-eclipse-batch/2.3.3-01-SNAPSHOT/maven-metadata.xml
Downloaded: http://nexus.codehaus.org/snapshots/org/codehaus/groovy/groovy-eclipse-batch/2.3.3-01-SNAPSHOT/maven-metadata.xml (2 KB at 5.0 KB/sec)
Downloading: http://nexus.codehaus.org/snapshots/org/codehaus/groovy/groovy-eclipse-batch/2.3.4-01-SNAPSHOT/maven-metadata.xml
Downloading: http://repository.codehaus.org/org/codehaus/groovy/groovy-eclipse-batch/2.3.4-01-SNAPSHOT/maven-metadata.xml
Downloaded: http://nexus.codehaus.org/snapshots/org/codehaus/groovy/groovy-eclipse-batch/2.3.4-01-SNAPSHOT/maven-metadata.xml (378 B at 1.5 KB/sec)
[INFO]
[INFO] ------------------------------------------------------------------------
[INFO] Building iTest: system and integration testing in the cloud 0.9.0-SNAPSHOT
[INFO] ------------------------------------------------------------------------
[INFO]
[INFO] --- groovy-eclipse-compiler:2.8.0-01:add-groovy-build-paths (default-add-groovy-build-paths) @ itest-common ---
[INFO] Adding /src/main/groovy to the list of source folders
[INFO] Adding /src/test/groovy to the list of test source folders
[INFO]
[INFO] --- maven-remote-resources-plugin:1.1:process (default) @ itest-common ---
[INFO] Setting property: classpath.resource.loader.class => 'org.codehaus.plexus.velocity.ContextClassLoaderResourceLoader'.
[INFO] Setting property: velocimacro.messages.on => 'false'.
[INFO] Setting property: resource.loader => 'classpath'.
[INFO] Setting property: resource.manager.logwhenfound => 'false'.
[INFO]
[INFO] --- maven-resources-plugin:2.4:resources (default-resources) @ itest-common ---
[INFO] Using 'UTF-8' encoding to copy filtered resources.
[INFO] skip non existing resourceDirectory <https://builds.apache.org/job/Bigtop-trunk-iTest/org.apache.bigtop.itest$itest-common/ws/src/main/resources>
[INFO] Copying 3 resources
[INFO]
[INFO] --- maven-compiler-plugin:3.1:compile (default-compile) @ itest-common ---
[INFO] Changes detected - recompiling the module!
[INFO] Using Groovy-Eclipse compiler to compile both Java and Groovy files
[INFO]
[INFO] --- maven-resources-plugin:2.4:testResources (default-testResources) @ itest-common ---
[INFO] Using 'UTF-8' encoding to copy filtered resources.
[INFO] skip non existing resourceDirectory <https://builds.apache.org/job/Bigtop-trunk-iTest/org.apache.bigtop.itest$itest-common/ws/src/test/resources>
[INFO] Copying 3 resources
[INFO]
[INFO] --- maven-compiler-plugin:3.1:testCompile (default-testCompile) @ itest-common ---
[INFO] Changes detected - recompiling the module!
[INFO] Using Groovy-Eclipse compiler to compile both Java and Groovy files
[INFO]
[INFO] --- maven-surefire-plugin:2.7:test (default-test) @ itest-common ---
[INFO] Surefire report directory: <https://builds.apache.org/job/Bigtop-trunk-iTest/org.apache.bigtop.itest$itest-common/ws/target/surefire-reports>
-------------------------------------------------------
T E S T S
-------------------------------------------------------
Running org.apache.bigtop.itest.JUnitUtilsTest
Disclaimer: This test expected to show a failure in an embeded testcase
[junit] Running org.apache.bigtop.itest.DummyTestPassTests run: 1, Failures: 0, Errors: 0, Time elapsed: 0.282 secRunning org.apache.bigtop.itest.DummyTestFail
[junit] Tests run: 1, Failures: 1, Errors: 0, Time elapsed: 0.142 secTEST org.apache.bigtop.itest.DummyTestFail FAILED
[junit] Tests FAILED
Disclaimer: This test expected to show an error in an embeded testcase
[junit] Running org.apache.bigtop.itest.DummyTestError
[junit] Tests run: 1, Failures: 0, Errors: 1, Time elapsed: 0.284 sec
[junit] Test org.apache.bigtop.itest.DummyTestError FAILED
[junit] Running org.apache.bigtop.itest.DummyTestPass
[junit] Tests run: 1, Failures: 0, Errors: 0, Time elapsed: 0.279 sec
[junit] Running org.apache.bigtop.itest.DummyTestPass
[junit] Tests run: 1, Failures: 0, Errors: 0, Time elapsed: 0.28 sec
Tests run: 4, Failures: 0, Errors: 0, Skipped: 0, Time elapsed: 4.991 sec
Running org.apache.bigtop.itest.junit.OrderedParameterizedTest
Tests run: 3, Failures: 0, Errors: 0, Skipped: 0, Time elapsed: 0.051 sec
Running org.apache.bigtop.itest.junit.OrderedTest
Tests run: 3, Failures: 0, Errors: 0, Skipped: 0, Time elapsed: 0.008 sec
Running org.apache.bigtop.itest.posix.UGITest
Tests run: 2, Failures: 0, Errors: 0, Skipped: 0, Time elapsed: 0.075 sec
Running org.apache.bigtop.itest.posix.ServiceTest
Status []
Tests run: 2, Failures: 0, Errors: 0, Skipped: 1, Time elapsed: 0.124 sec
Running org.apache.bigtop.itest.posix.AlternativeTest
Tests run: 1, Failures: 0, Errors: 0, Skipped: 0, Time elapsed: 1.322 sec
Running org.apache.bigtop.itest.TestContractGroovy
Tests run: 2, Failures: 0, Errors: 0, Skipped: 0, Time elapsed: 0.011 sec
Running org.apache.bigtop.itest.pmanager.PackageManagerTest
/etc/cron.monthly/.placeholder
/etc/cron.hourly/.placeholder
/etc/default/cron
/etc/cron.weekly/.placeholder
/etc/cron.d/.placeholder
/etc/cron.daily/.placeholder
/etc/pam.d/cron
/etc/init/cron.conf
/etc/crontab
/.
/etc
/etc/cron.monthly
/etc/cron.monthly/.placeholder
/etc/cron.hourly
/etc/cron.hourly/.placeholder
/etc/default
/etc/default/cron
/etc/cron.weekly
/etc/cron.weekly/.placeholder
/etc/cron.d
/etc/cron.d/.placeholder
/etc/cron.daily
/etc/cron.daily/.placeholder
/etc/pam.d
/etc/pam.d/cron
/etc/init
/etc/init/cron.conf
/etc/init.d
/etc/crontab
/usr
/usr/share
/usr/share/bug
/usr/share/bug/cron
/usr/share/bug/cron/script
/usr/share/bug/cron/control
/usr/share/man
/usr/share/man/man1
/usr/share/man/man1/crontab.1.gz
/usr/share/man/man5
/usr/share/man/man5/crontab.5.gz
/usr/share/man/man8
/usr/share/man/man8/cron.8.gz
/usr/share/doc
/usr/share/doc/cron
/usr/share/doc/cron/README
/usr/share/doc/cron/README.anacron
/usr/share/doc/cron/README.Debian
/usr/share/doc/cron/FEATURES
/usr/share/doc/cron/copyright
/usr/share/doc/cron/examples
/usr/share/doc/cron/examples/crontab2english.pl
/usr/share/doc/cron/examples/cron-stats.pl
/usr/share/doc/cron/examples/cron-tasks-review.sh
/usr/share/doc/cron/NEWS.Debian.gz
/usr/share/doc/cron/changelog.Debian.gz
/usr/share/doc/cron/THANKS
/usr/share/doc/cron/TODO.Debian
/usr/sbin
/usr/sbin/cron
/usr/bin
/usr/bin/crontab
/var
/var/spool
/var/spool/cron
/var/spool/cron/crontabs
/etc/init.d/cron
Tests run: 11, Failures: 0, Errors: 0, Skipped: 3, Time elapsed: 2.782 sec
Running org.apache.bigtop.itest.TestContractJava
Tests run: 2, Failures: 0, Errors: 0, Skipped: 0, Time elapsed: 0.002 sec
Running org.apache.bigtop.itest.TestListUtilsTest
Tests run: 1, Failures: 0, Errors: 0, Skipped: 0, Time elapsed: 0.017 sec
Running org.apache.bigtop.itest.shell.ShellTest
Tests run: 2, Failures: 0, Errors: 0, Skipped: 1, Time elapsed: 0.008 sec
Running org.apache.bigtop.itest.JarContentTest
log4j:WARN No appenders could be found for logger (org.apache.bigtop.itest.JarContent).
log4j:WARN Please initialize the log4j system properly.
Tests run: 6, Failures: 0, Errors: 0, Skipped: 0, Time elapsed: 0.882 sec
Running org.apache.bigtop.itest.TestContractJavaProc
Tests run: 2, Failures: 0, Errors: 0, Skipped: 0, Time elapsed: 0.001 sec
Results :
Tests run: 41, Failures: 0, Errors: 0, Skipped: 5
[JENKINS] Recording test results
log4j:WARN No appenders could be found for logger (org.apache.commons.beanutils.converters.BooleanConverter).
log4j:WARN Please initialize the log4j system properly.
[INFO]
[INFO] --- maven-jar-plugin:2.2:jar (default-jar) @ itest-common ---
[INFO] Building jar: <https://builds.apache.org/job/Bigtop-trunk-iTest/org.apache.bigtop.itest$itest-common/ws/target/itest-common-0.9.0-SNAPSHOT.jar>
[INFO]
[INFO] --- maven-jar-plugin:2.2:test-jar (default) @ itest-common ---
[INFO] Building jar: <https://builds.apache.org/job/Bigtop-trunk-iTest/org.apache.bigtop.itest$itest-common/ws/target/itest-common-0.9.0-SNAPSHOT-tests.jar>
[INFO]
[INFO] --- maven-failsafe-plugin:2.17:verify (default) @ itest-common ---
[INFO] Failsafe report directory: <https://builds.apache.org/job/Bigtop-trunk-iTest/org.apache.bigtop.itest$itest-common/ws/target/failsafe-reports>
[WARNING] File encoding has not been set, using platform encoding ISO-8859-1, i.e. build is platform dependent!
[ERROR] There are test failures.
Please refer to <https://builds.apache.org/job/Bigtop-trunk-iTest/org.apache.bigtop.itest$itest-common/ws/target/failsafe-reports> for the individual test results.
[JENKINS] Recording test results
hudson.AbortException: Test reports were found but none of them are new. Did tests run?
For example, <https://builds.apache.org/job/Bigtop-trunk-iTest/org.apache.bigtop.itest$itest-common/ws/target/failsafe-reports/TEST-org.apache.bigtop.itest.failures.IntegrationTestClusterFailures.xml> is 2 days 11 hr old
at hudson.tasks.junit.TestResult.parse(TestResult.java:213)
at hudson.maven.reporters.SurefireArchiver.postExecute(SurefireArchiver.java:148)
at hudson.maven.Maven3Builder$MavenExecutionListener.recordMojoEnded(Maven3Builder.java:634)
at hudson.maven.Maven3Builder$MavenExecutionListener.mojoSucceeded(Maven3Builder.java:615)
at org.apache.maven.lifecycle.internal.DefaultExecutionEventCatapult.fire(DefaultExecutionEventCatapult.java:87)
at org.apache.maven.lifecycle.internal.DefaultExecutionEventCatapult.fire(DefaultExecutionEventCatapult.java:42)
at org.apache.maven.lifecycle.internal.MojoExecutor.execute(MojoExecutor.java:228)
at org.apache.maven.lifecycle.internal.MojoExecutor.execute(MojoExecutor.java:153)
at org.apache.maven.lifecycle.internal.MojoExecutor.execute(MojoExecutor.java:145)
at org.apache.maven.lifecycle.internal.LifecycleModuleBuilder.buildProject(LifecycleModuleBuilder.java:84)
at org.apache.maven.lifecycle.internal.LifecycleModuleBuilder.buildProject(LifecycleModuleBuilder.java:59)
at org.apache.maven.lifecycle.internal.LifecycleStarter.singleThreadedBuild(LifecycleStarter.java:183)
at org.apache.maven.lifecycle.internal.LifecycleStarter.execute(LifecycleStarter.java:161)
at org.apache.maven.DefaultMaven.doExecute(DefaultMaven.java:320)
at org.apache.maven.DefaultMaven.execute(DefaultMaven.java:156)
at org.jvnet.hudson.maven3.launcher.Maven3Launcher.main(Maven3Launcher.java:117)
at sun.reflect.NativeMethodAccessorImpl.invoke0(Native Method)
at sun.reflect.NativeMethodAccessorImpl.invoke(NativeMethodAccessorImpl.java:39)
at sun.reflect.DelegatingMethodAccessorImpl.invoke(DelegatingMethodAccessorImpl.java:25)
at java.lang.reflect.Method.invoke(Method.java:597)
at org.codehaus.plexus.classworlds.launcher.Launcher.launchStandard(Launcher.java:329)
at org.codehaus.plexus.classworlds.launcher.Launcher.launch(Launcher.java:239)
at org.jvnet.hudson.maven3.agent.Maven3Main.launch(Maven3Main.java:178)
at sun.reflect.NativeMethodAccessorImpl.invoke0(Native Method)
at sun.reflect.NativeMethodAccessorImpl.invoke(NativeMethodAccessorImpl.java:39)
at sun.reflect.DelegatingMethodAccessorImpl.invoke(DelegatingMethodAccessorImpl.java:25)
at java.lang.reflect.Method.invoke(Method.java:597)
at hudson.maven.Maven3Builder.call(Maven3Builder.java:136)
at hudson.maven.Maven3Builder.call(Maven3Builder.java:71)
at hudson.remoting.UserRequest.perform(UserRequest.java:118)
at hudson.remoting.UserRequest.perform(UserRequest.java:48)
at hudson.remoting.Request$2.run(Request.java:328)
at hudson.remoting.InterceptingExecutorService$1.call(InterceptingExecutorService.java:72)
at java.util.concurrent.FutureTask$Sync.innerRun(FutureTask.java:303)
at java.util.concurrent.FutureTask.run(FutureTask.java:138)
at java.util.concurrent.ThreadPoolExecutor$Worker.runTask(ThreadPoolExecutor.java:895)
at java.util.concurrent.ThreadPoolExecutor$Worker.run(ThreadPoolExecutor.java:918)
at java.lang.Thread.run(Thread.java:662)
[INFO]
[INFO] --- maven-install-plugin:2.3:install (default-install) @ itest-common ---
[INFO] Installing <https://builds.apache.org/job/Bigtop-trunk-iTest/org.apache.bigtop.itest$itest-common/ws/target/itest-common-0.9.0-SNAPSHOT.jar> to /home/jenkins/jenkins-slave/maven-repositories/0/org/apache/bigtop/itest/itest-common/0.9.0-SNAPSHOT/itest-common-0.9.0-SNAPSHOT.jar
[INFO] Installing <https://builds.apache.org/job/Bigtop-trunk-iTest/org.apache.bigtop.itest$itest-common/ws/pom.xml> to /home/jenkins/jenkins-slave/maven-repositories/0/org/apache/bigtop/itest/itest-common/0.9.0-SNAPSHOT/itest-common-0.9.0-SNAPSHOT.pom
[INFO] Installing <https://builds.apache.org/job/Bigtop-trunk-iTest/org.apache.bigtop.itest$itest-common/ws/target/itest-common-0.9.0-SNAPSHOT-tests.jar> to /home/jenkins/jenkins-slave/maven-repositories/0/org/apache/bigtop/itest/itest-common/0.9.0-SNAPSHOT/itest-common-0.9.0-SNAPSHOT-tests.jar
[INFO]
[INFO] --- maven-deploy-plugin:2.5:deploy (default-deploy) @ itest-common ---
Downloading: https://repository.apache.org/content/repositories/snapshots/org/apache/bigtop/itest/itest-common/0.9.0-SNAPSHOT/maven-metadata.xml
Downloaded: https://repository.apache.org/content/repositories/snapshots/org/apache/bigtop/itest/itest-common/0.9.0-SNAPSHOT/maven-metadata.xml (1005 B at 1.5 KB/sec)
Uploading: https://repository.apache.org/content/repositories/snapshots/org/apache/bigtop/itest/itest-common/0.9.0-SNAPSHOT/itest-common-0.9.0-20150129.015844-198.jar
Uploaded: https://repository.apache.org/content/repositories/snapshots/org/apache/bigtop/itest/itest-common/0.9.0-SNAPSHOT/itest-common-0.9.0-20150129.015844-198.jar (206 KB at 1079.2 KB/sec)
Uploading: https://repository.apache.org/content/repositories/snapshots/org/apache/bigtop/itest/itest-common/0.9.0-SNAPSHOT/itest-common-0.9.0-20150129.015844-198.pom
Uploaded: https://repository.apache.org/content/repositories/snapshots/org/apache/bigtop/itest/itest-common/0.9.0-SNAPSHOT/itest-common-0.9.0-20150129.015844-198.pom (6 KB at 30.7 KB/sec)
Downloading: https://repository.apache.org/content/repositories/snapshots/org/apache/bigtop/itest/itest-common/maven-metadata.xml
Downloaded: https://repository.apache.org/content/repositories/snapshots/org/apache/bigtop/itest/itest-common/maven-metadata.xml (466 B at 4.6 KB/sec)
Uploading: https://repository.apache.org/content/repositories/snapshots/org/apache/bigtop/itest/itest-common/0.9.0-SNAPSHOT/maven-metadata.xml
Uploaded: https://repository.apache.org/content/repositories/snapshots/org/apache/bigtop/itest/itest-common/0.9.0-SNAPSHOT/maven-metadata.xml (1005 B at 6.5 KB/sec)
Uploading: https://repository.apache.org/content/repositories/snapshots/org/apache/bigtop/itest/itest-common/maven-metadata.xml
Uploaded: https://repository.apache.org/content/repositories/snapshots/org/apache/bigtop/itest/itest-common/maven-metadata.xml (466 B at 2.4 KB/sec)
Uploading: https://repository.apache.org/content/repositories/snapshots/org/apache/bigtop/itest/itest-common/0.9.0-SNAPSHOT/itest-common-0.9.0-20150129.015844-198-tests.jar
Uploaded: https://repository.apache.org/content/repositories/snapshots/org/apache/bigtop/itest/itest-common/0.9.0-SNAPSHOT/itest-common-0.9.0-20150129.015844-198-tests.jar (70 KB at 396.9 KB/sec)
Uploading: https://repository.apache.org/content/repositories/snapshots/org/apache/bigtop/itest/itest-common/0.9.0-SNAPSHOT/maven-metadata.xml
Uploaded: https://repository.apache.org/content/repositories/snapshots/org/apache/bigtop/itest/itest-common/0.9.0-SNAPSHOT/maven-metadata.xml (1005 B at 7.1 KB/sec)
[INFO] ------------------------------------------------------------------------
[INFO] BUILD SUCCESS
[INFO] ------------------------------------------------------------------------
[INFO] Total time: 30.117s
[INFO] Finished at: Thu Jan 29 01:58:46 UTC 2015
[INFO] Final Memory: 18M/246M
[INFO] ------------------------------------------------------------------------
Waiting for Jenkins to finish collecting data
Build failed in Jenkins: Bigtop-trunk-iTest » iTest: system and integration testing in the cloud #2002
Posted by Apache Jenkins Server <je...@builds.apache.org>.
See <https://builds.apache.org/job/Bigtop-trunk-iTest/org.apache.bigtop.itest$itest-common/2002/>
------------------------------------------
maven3-agent.jar already up to date
maven3-interceptor.jar already up to date
maven3-interceptor-commons.jar already up to date
<===[JENKINS REMOTING CAPACITY]===> channel started
Executing Maven: -B -f <https://builds.apache.org/job/Bigtop-trunk-iTest/org.apache.bigtop.itest$itest-common/ws/pom.xml> -Dmaven.repo.local=/home/jenkins/jenkins-slave/maven-repositories/1 deploy
[INFO] Scanning for projects...
Downloading: http://nexus.codehaus.org/snapshots/org/codehaus/groovy/groovy-eclipse-batch/maven-metadata.xml
Downloading: http://repository.codehaus.org/org/codehaus/groovy/groovy-eclipse-batch/maven-metadata.xml
Downloaded: http://repository.codehaus.org/org/codehaus/groovy/groovy-eclipse-batch/maven-metadata.xml (2 KB at 3.2 KB/sec)
Downloaded: http://nexus.codehaus.org/snapshots/org/codehaus/groovy/groovy-eclipse-batch/maven-metadata.xml (599 B at 1.4 KB/sec)
Downloading: http://repository.codehaus.org/org/codehaus/groovy/groovy-eclipse-batch/2.1.8-01-SNAPSHOT/maven-metadata.xml
Downloading: http://nexus.codehaus.org/snapshots/org/codehaus/groovy/groovy-eclipse-batch/2.1.8-01-SNAPSHOT/maven-metadata.xml
Downloaded: http://nexus.codehaus.org/snapshots/org/codehaus/groovy/groovy-eclipse-batch/2.1.8-01-SNAPSHOT/maven-metadata.xml (798 B at 3.1 KB/sec)
Downloading: http://repository.codehaus.org/org/codehaus/groovy/groovy-eclipse-batch/2.2.1-01-SNAPSHOT/maven-metadata.xml
Downloading: http://nexus.codehaus.org/snapshots/org/codehaus/groovy/groovy-eclipse-batch/2.2.1-01-SNAPSHOT/maven-metadata.xml
Downloaded: http://nexus.codehaus.org/snapshots/org/codehaus/groovy/groovy-eclipse-batch/2.2.1-01-SNAPSHOT/maven-metadata.xml (2 KB at 4.9 KB/sec)
Downloading: http://repository.codehaus.org/org/codehaus/groovy/groovy-eclipse-batch/2.3.0-01-SNAPSHOT/maven-metadata.xml
Downloading: http://nexus.codehaus.org/snapshots/org/codehaus/groovy/groovy-eclipse-batch/2.3.0-01-SNAPSHOT/maven-metadata.xml
Downloaded: http://nexus.codehaus.org/snapshots/org/codehaus/groovy/groovy-eclipse-batch/2.3.0-01-SNAPSHOT/maven-metadata.xml (2 KB at 5.0 KB/sec)
Downloading: http://repository.codehaus.org/org/codehaus/groovy/groovy-eclipse-batch/2.3.1-01-SNAPSHOT/maven-metadata.xml
Downloading: http://nexus.codehaus.org/snapshots/org/codehaus/groovy/groovy-eclipse-batch/2.3.1-01-SNAPSHOT/maven-metadata.xml
Downloaded: http://nexus.codehaus.org/snapshots/org/codehaus/groovy/groovy-eclipse-batch/2.3.1-01-SNAPSHOT/maven-metadata.xml (2 KB at 4.8 KB/sec)
Downloading: http://repository.codehaus.org/org/codehaus/groovy/groovy-eclipse-batch/2.3.2-01-SNAPSHOT/maven-metadata.xml
Downloading: http://nexus.codehaus.org/snapshots/org/codehaus/groovy/groovy-eclipse-batch/2.3.2-01-SNAPSHOT/maven-metadata.xml
Downloaded: http://nexus.codehaus.org/snapshots/org/codehaus/groovy/groovy-eclipse-batch/2.3.2-01-SNAPSHOT/maven-metadata.xml (2 KB at 4.9 KB/sec)
Downloading: http://repository.codehaus.org/org/codehaus/groovy/groovy-eclipse-batch/2.3.3-01-SNAPSHOT/maven-metadata.xml
Downloading: http://nexus.codehaus.org/snapshots/org/codehaus/groovy/groovy-eclipse-batch/2.3.3-01-SNAPSHOT/maven-metadata.xml
Downloaded: http://nexus.codehaus.org/snapshots/org/codehaus/groovy/groovy-eclipse-batch/2.3.3-01-SNAPSHOT/maven-metadata.xml (2 KB at 4.9 KB/sec)
Downloading: http://repository.codehaus.org/org/codehaus/groovy/groovy-eclipse-batch/2.3.4-01-SNAPSHOT/maven-metadata.xml
Downloading: http://nexus.codehaus.org/snapshots/org/codehaus/groovy/groovy-eclipse-batch/2.3.4-01-SNAPSHOT/maven-metadata.xml
Downloaded: http://nexus.codehaus.org/snapshots/org/codehaus/groovy/groovy-eclipse-batch/2.3.4-01-SNAPSHOT/maven-metadata.xml (378 B at 1.5 KB/sec)
[INFO]
[INFO] ------------------------------------------------------------------------
[INFO] Building iTest: system and integration testing in the cloud 0.9.0-SNAPSHOT
[INFO] ------------------------------------------------------------------------
[INFO]
[INFO] --- groovy-eclipse-compiler:2.8.0-01:add-groovy-build-paths (default-add-groovy-build-paths) @ itest-common ---
[INFO] Adding /src/main/groovy to the list of source folders
[INFO] Adding /src/test/groovy to the list of test source folders
[INFO]
[INFO] --- maven-remote-resources-plugin:1.1:process (default) @ itest-common ---
[INFO] Setting property: classpath.resource.loader.class => 'org.codehaus.plexus.velocity.ContextClassLoaderResourceLoader'.
[INFO] Setting property: velocimacro.messages.on => 'false'.
[INFO] Setting property: resource.loader => 'classpath'.
[INFO] Setting property: resource.manager.logwhenfound => 'false'.
[INFO]
[INFO] --- maven-resources-plugin:2.4:resources (default-resources) @ itest-common ---
[INFO] Using 'UTF-8' encoding to copy filtered resources.
[INFO] skip non existing resourceDirectory <https://builds.apache.org/job/Bigtop-trunk-iTest/org.apache.bigtop.itest$itest-common/ws/src/main/resources>
[INFO] Copying 3 resources
[INFO]
[INFO] --- maven-compiler-plugin:3.1:compile (default-compile) @ itest-common ---
[INFO] Changes detected - recompiling the module!
[INFO] Using Groovy-Eclipse compiler to compile both Java and Groovy files
[INFO]
[INFO] --- maven-resources-plugin:2.4:testResources (default-testResources) @ itest-common ---
[INFO] Using 'UTF-8' encoding to copy filtered resources.
[INFO] skip non existing resourceDirectory <https://builds.apache.org/job/Bigtop-trunk-iTest/org.apache.bigtop.itest$itest-common/ws/src/test/resources>
[INFO] Copying 3 resources
[INFO]
[INFO] --- maven-compiler-plugin:3.1:testCompile (default-testCompile) @ itest-common ---
[INFO] Changes detected - recompiling the module!
[INFO] Using Groovy-Eclipse compiler to compile both Java and Groovy files
[INFO]
[INFO] --- maven-surefire-plugin:2.7:test (default-test) @ itest-common ---
[INFO] Surefire report directory: <https://builds.apache.org/job/Bigtop-trunk-iTest/org.apache.bigtop.itest$itest-common/ws/target/surefire-reports>
-------------------------------------------------------
T E S T S
-------------------------------------------------------
Running org.apache.bigtop.itest.TestContractGroovy
Tests run: 2, Failures: 0, Errors: 0, Skipped: 0, Time elapsed: 0.429 sec
Running org.apache.bigtop.itest.TestContractJava
Tests run: 2, Failures: 0, Errors: 0, Skipped: 0, Time elapsed: 0.002 sec
Running org.apache.bigtop.itest.JarContentTest
log4j:WARN No appenders could be found for logger (org.apache.bigtop.itest.JarContent).
log4j:WARN Please initialize the log4j system properly.
Tests run: 6, Failures: 0, Errors: 0, Skipped: 0, Time elapsed: 1.105 sec
Running org.apache.bigtop.itest.TestContractJavaProc
Tests run: 2, Failures: 0, Errors: 0, Skipped: 0, Time elapsed: 0.002 sec
Running org.apache.bigtop.itest.posix.UGITest
Tests run: 2, Failures: 0, Errors: 0, Skipped: 0, Time elapsed: 0.048 sec
Running org.apache.bigtop.itest.posix.AlternativeTest
Tests run: 1, Failures: 0, Errors: 0, Skipped: 0, Time elapsed: 1.861 sec
Running org.apache.bigtop.itest.posix.ServiceTest
Status []
Tests run: 2, Failures: 0, Errors: 0, Skipped: 1, Time elapsed: 0.154 sec
Running org.apache.bigtop.itest.shell.ShellTest
Tests run: 2, Failures: 0, Errors: 0, Skipped: 1, Time elapsed: 0.027 sec
Running org.apache.bigtop.itest.JUnitUtilsTest
Disclaimer: This test expected to show a failure in an embeded testcase
[junit] Running org.apache.bigtop.itest.DummyTestPassTests run: 1, Failures: 0, Errors: 0, Time elapsed: 0.271 secRunning org.apache.bigtop.itest.DummyTestFailTests run: 1, Failures: 1, Errors: 0, Time elapsed: 0.141 sec
[junit] TEST org.apache.bigtop.itest.DummyTestFail FAILED
[junit] Tests FAILED
Disclaimer: This test expected to show an error in an embeded testcase
[junit] Running org.apache.bigtop.itest.DummyTestError
[junit] Tests run: 1, Failures: 0, Errors: 1, Time elapsed: 0.287 sec
[junit] Test org.apache.bigtop.itest.DummyTestError FAILED
[junit] Running org.apache.bigtop.itest.DummyTestPass
[junit] Tests run: 1, Failures: 0, Errors: 0, Time elapsed: 0.273 sec
[junit] Running org.apache.bigtop.itest.DummyTestPass
[junit] Tests run: 1, Failures: 0, Errors: 0, Time elapsed: 0.275 sec
Tests run: 4, Failures: 0, Errors: 0, Skipped: 0, Time elapsed: 4.441 sec
Running org.apache.bigtop.itest.pmanager.PackageManagerTest
/etc/cron.monthly/.placeholder
/etc/cron.hourly/.placeholder
/etc/default/cron
/etc/cron.weekly/.placeholder
/etc/cron.d/.placeholder
/etc/cron.daily/.placeholder
/etc/pam.d/cron
/etc/init/cron.conf
/etc/crontab
/.
/etc
/etc/cron.monthly
/etc/cron.monthly/.placeholder
/etc/cron.hourly
/etc/cron.hourly/.placeholder
/etc/default
/etc/default/cron
/etc/cron.weekly
/etc/cron.weekly/.placeholder
/etc/cron.d
/etc/cron.d/.placeholder
/etc/cron.daily
/etc/cron.daily/.placeholder
/etc/pam.d
/etc/pam.d/cron
/etc/init
/etc/init/cron.conf
/etc/init.d
/etc/crontab
/usr
/usr/share
/usr/share/bug
/usr/share/bug/cron
/usr/share/bug/cron/script
/usr/share/bug/cron/control
/usr/share/man
/usr/share/man/man1
/usr/share/man/man1/crontab.1.gz
/usr/share/man/man5
/usr/share/man/man5/crontab.5.gz
/usr/share/man/man8
/usr/share/man/man8/cron.8.gz
/usr/share/doc
/usr/share/doc/cron
/usr/share/doc/cron/README
/usr/share/doc/cron/README.anacron
/usr/share/doc/cron/README.Debian
/usr/share/doc/cron/FEATURES
/usr/share/doc/cron/copyright
/usr/share/doc/cron/examples
/usr/share/doc/cron/examples/crontab2english.pl
/usr/share/doc/cron/examples/cron-stats.pl
/usr/share/doc/cron/examples/cron-tasks-review.sh
/usr/share/doc/cron/NEWS.Debian.gz
/usr/share/doc/cron/changelog.Debian.gz
/usr/share/doc/cron/THANKS
/usr/share/doc/cron/TODO.Debian
/usr/sbin
/usr/sbin/cron
/usr/bin
/usr/bin/crontab
/var
/var/spool
/var/spool/cron
/var/spool/cron/crontabs
/etc/init.d/cron
Tests run: 11, Failures: 0, Errors: 0, Skipped: 3, Time elapsed: 4.042 sec
Running org.apache.bigtop.itest.TestListUtilsTest
Tests run: 1, Failures: 0, Errors: 0, Skipped: 0, Time elapsed: 0.012 sec
Running org.apache.bigtop.itest.junit.OrderedParameterizedTest
Tests run: 3, Failures: 0, Errors: 0, Skipped: 0, Time elapsed: 0.03 sec
Running org.apache.bigtop.itest.junit.OrderedTest
Tests run: 3, Failures: 0, Errors: 0, Skipped: 0, Time elapsed: 0.008 sec
Results :
Tests run: 41, Failures: 0, Errors: 0, Skipped: 5
[JENKINS] Recording test results
log4j:WARN No appenders could be found for logger (org.apache.commons.beanutils.converters.BooleanConverter).
log4j:WARN Please initialize the log4j system properly.
[INFO]
[INFO] --- maven-jar-plugin:2.2:jar (default-jar) @ itest-common ---
[INFO] Building jar: <https://builds.apache.org/job/Bigtop-trunk-iTest/org.apache.bigtop.itest$itest-common/ws/target/itest-common-0.9.0-SNAPSHOT.jar>
[INFO]
[INFO] --- maven-jar-plugin:2.2:test-jar (default) @ itest-common ---
[INFO] Building jar: <https://builds.apache.org/job/Bigtop-trunk-iTest/org.apache.bigtop.itest$itest-common/ws/target/itest-common-0.9.0-SNAPSHOT-tests.jar>
[INFO]
[INFO] --- maven-failsafe-plugin:2.17:verify (default) @ itest-common ---
[INFO] Failsafe report directory: <https://builds.apache.org/job/Bigtop-trunk-iTest/org.apache.bigtop.itest$itest-common/ws/target/failsafe-reports>
[WARNING] File encoding has not been set, using platform encoding ISO-8859-1, i.e. build is platform dependent!
[JENKINS] Recording test results
[INFO] ------------------------------------------------------------------------
[INFO] BUILD FAILURE
[INFO] ------------------------------------------------------------------------
[INFO] Total time: 31.250s
[INFO] Finished at: Thu Jan 29 00:46:15 UTC 2015
[INFO] Final Memory: 15M/245M
[INFO] ------------------------------------------------------------------------
Waiting for Jenkins to finish collecting data
[ERROR] Failed to execute goal org.apache.maven.plugins:maven-failsafe-plugin:2.17:verify (default) on project itest-common: <https://builds.apache.org/job/Bigtop-trunk-iTest/org.apache.bigtop.itest$itest-common/ws/target/failsafe-reports/failsafe-summary.xml> (No such file or directory) -> [Help 1]
[ERROR]
[ERROR] To see the full stack trace of the errors, re-run Maven with the -e switch.
[ERROR] Re-run Maven using the -X switch to enable full debug logging.
[ERROR]
[ERROR] For more information about the errors and possible solutions, please read the following articles:
[ERROR] [Help 1] http://cwiki.apache.org/confluence/display/MAVEN/MojoExecutionException
Build failed in Jenkins: Bigtop-trunk-iTest » iTest: system and integration testing in the cloud #2001
Posted by Apache Jenkins Server <je...@builds.apache.org>.
See <https://builds.apache.org/job/Bigtop-trunk-iTest/org.apache.bigtop.itest$itest-common/2001/>
------------------------------------------
[...truncated 22 lines...]
Downloading: http://repository.codehaus.org/org/codehaus/groovy/groovy-eclipse-batch/2.3.2-01-SNAPSHOT/maven-metadata.xml
Downloading: http://nexus.codehaus.org/snapshots/org/codehaus/groovy/groovy-eclipse-batch/2.3.2-01-SNAPSHOT/maven-metadata.xml
Downloaded: http://nexus.codehaus.org/snapshots/org/codehaus/groovy/groovy-eclipse-batch/2.3.2-01-SNAPSHOT/maven-metadata.xml (2 KB at 2.7 KB/sec)
Downloading: http://repository.codehaus.org/org/codehaus/groovy/groovy-eclipse-batch/2.3.3-01-SNAPSHOT/maven-metadata.xml
Downloading: http://nexus.codehaus.org/snapshots/org/codehaus/groovy/groovy-eclipse-batch/2.3.3-01-SNAPSHOT/maven-metadata.xml
Downloaded: http://nexus.codehaus.org/snapshots/org/codehaus/groovy/groovy-eclipse-batch/2.3.3-01-SNAPSHOT/maven-metadata.xml (2 KB at 4.9 KB/sec)
Downloading: http://repository.codehaus.org/org/codehaus/groovy/groovy-eclipse-batch/2.3.4-01-SNAPSHOT/maven-metadata.xml
Downloading: http://nexus.codehaus.org/snapshots/org/codehaus/groovy/groovy-eclipse-batch/2.3.4-01-SNAPSHOT/maven-metadata.xml
Downloaded: http://nexus.codehaus.org/snapshots/org/codehaus/groovy/groovy-eclipse-batch/2.3.4-01-SNAPSHOT/maven-metadata.xml (378 B at 1.5 KB/sec)
[INFO]
[INFO] ------------------------------------------------------------------------
[INFO] Building iTest: system and integration testing in the cloud 0.9.0-SNAPSHOT
[INFO] ------------------------------------------------------------------------
[INFO]
[INFO] --- groovy-eclipse-compiler:2.8.0-01:add-groovy-build-paths (default-add-groovy-build-paths) @ itest-common ---
[INFO] Adding /src/main/groovy to the list of source folders
[INFO] Adding /src/test/groovy to the list of test source folders
[INFO]
[INFO] --- maven-remote-resources-plugin:1.1:process (default) @ itest-common ---
[INFO] Setting property: classpath.resource.loader.class => 'org.codehaus.plexus.velocity.ContextClassLoaderResourceLoader'.
[INFO] Setting property: velocimacro.messages.on => 'false'.
[INFO] Setting property: resource.loader => 'classpath'.
[INFO] Setting property: resource.manager.logwhenfound => 'false'.
[INFO]
[INFO] --- maven-resources-plugin:2.4:resources (default-resources) @ itest-common ---
[INFO] Using 'UTF-8' encoding to copy filtered resources.
[INFO] skip non existing resourceDirectory <https://builds.apache.org/job/Bigtop-trunk-iTest/org.apache.bigtop.itest$itest-common/ws/src/main/resources>
[INFO] Copying 3 resources
[INFO]
[INFO] --- maven-compiler-plugin:3.1:compile (default-compile) @ itest-common ---
[INFO] Changes detected - recompiling the module!
[INFO] Using Groovy-Eclipse compiler to compile both Java and Groovy files
[INFO]
[INFO] --- maven-resources-plugin:2.4:testResources (default-testResources) @ itest-common ---
[INFO] Using 'UTF-8' encoding to copy filtered resources.
[INFO] skip non existing resourceDirectory <https://builds.apache.org/job/Bigtop-trunk-iTest/org.apache.bigtop.itest$itest-common/ws/src/test/resources>
[INFO] Copying 3 resources
[INFO]
[INFO] --- maven-compiler-plugin:3.1:testCompile (default-testCompile) @ itest-common ---
[INFO] Changes detected - recompiling the module!
[INFO] Using Groovy-Eclipse compiler to compile both Java and Groovy files
[INFO]
[INFO] --- maven-surefire-plugin:2.7:test (default-test) @ itest-common ---
[INFO] Surefire report directory: <https://builds.apache.org/job/Bigtop-trunk-iTest/org.apache.bigtop.itest$itest-common/ws/target/surefire-reports>
-------------------------------------------------------
T E S T S
-------------------------------------------------------
Running org.apache.bigtop.itest.JUnitUtilsTest
Disclaimer: This test expected to show a failure in an embeded testcase
[junit] Running org.apache.bigtop.itest.DummyTestPassTests run: 1, Failures: 0, Errors: 0, Time elapsed: 0.274 secRunning org.apache.bigtop.itest.DummyTestFail
[junit] Tests run: 1, Failures: 1, Errors: 0, Time elapsed: 0.145 secTEST org.apache.bigtop.itest.DummyTestFail FAILED
[junit] Tests FAILED
Disclaimer: This test expected to show an error in an embeded testcase
[junit] Running org.apache.bigtop.itest.DummyTestError
[junit] Tests run: 1, Failures: 0, Errors: 1, Time elapsed: 0.288 sec
[junit] Test org.apache.bigtop.itest.DummyTestError FAILED
[junit] Running org.apache.bigtop.itest.DummyTestPass
[junit] Tests run: 1, Failures: 0, Errors: 0, Time elapsed: 0.275 sec
[junit] Running org.apache.bigtop.itest.DummyTestPass
[junit] Tests run: 1, Failures: 0, Errors: 0, Time elapsed: 0.272 sec
Tests run: 4, Failures: 0, Errors: 0, Skipped: 0, Time elapsed: 4.961 sec
Running org.apache.bigtop.itest.junit.OrderedParameterizedTest
Tests run: 3, Failures: 0, Errors: 0, Skipped: 0, Time elapsed: 0.049 sec
Running org.apache.bigtop.itest.junit.OrderedTest
Tests run: 3, Failures: 0, Errors: 0, Skipped: 0, Time elapsed: 0.008 sec
Running org.apache.bigtop.itest.posix.UGITest
Tests run: 2, Failures: 0, Errors: 0, Skipped: 0, Time elapsed: 0.072 sec
Running org.apache.bigtop.itest.posix.ServiceTest
Status []
Tests run: 2, Failures: 0, Errors: 0, Skipped: 1, Time elapsed: 0.094 sec
Running org.apache.bigtop.itest.posix.AlternativeTest
Tests run: 1, Failures: 0, Errors: 0, Skipped: 0, Time elapsed: 1.249 sec
Running org.apache.bigtop.itest.TestContractGroovy
Tests run: 2, Failures: 0, Errors: 0, Skipped: 0, Time elapsed: 0.011 sec
Running org.apache.bigtop.itest.pmanager.PackageManagerTest
/etc/cron.monthly/.placeholder
/etc/cron.hourly/.placeholder
/etc/default/cron
/etc/cron.weekly/.placeholder
/etc/cron.d/.placeholder
/etc/cron.daily/.placeholder
/etc/pam.d/cron
/etc/init/cron.conf
/etc/crontab
/.
/etc
/etc/cron.monthly
/etc/cron.monthly/.placeholder
/etc/cron.hourly
/etc/cron.hourly/.placeholder
/etc/default
/etc/default/cron
/etc/cron.weekly
/etc/cron.weekly/.placeholder
/etc/cron.d
/etc/cron.d/.placeholder
/etc/cron.daily
/etc/cron.daily/.placeholder
/etc/pam.d
/etc/pam.d/cron
/etc/init
/etc/init/cron.conf
/etc/init.d
/etc/crontab
/usr
/usr/share
/usr/share/bug
/usr/share/bug/cron
/usr/share/bug/cron/script
/usr/share/bug/cron/control
/usr/share/man
/usr/share/man/man1
/usr/share/man/man1/crontab.1.gz
/usr/share/man/man5
/usr/share/man/man5/crontab.5.gz
/usr/share/man/man8
/usr/share/man/man8/cron.8.gz
/usr/share/doc
/usr/share/doc/cron
/usr/share/doc/cron/README
/usr/share/doc/cron/README.anacron
/usr/share/doc/cron/README.Debian
/usr/share/doc/cron/FEATURES
/usr/share/doc/cron/copyright
/usr/share/doc/cron/examples
/usr/share/doc/cron/examples/crontab2english.pl
/usr/share/doc/cron/examples/cron-stats.pl
/usr/share/doc/cron/examples/cron-tasks-review.sh
/usr/share/doc/cron/NEWS.Debian.gz
/usr/share/doc/cron/changelog.Debian.gz
/usr/share/doc/cron/THANKS
/usr/share/doc/cron/TODO.Debian
/usr/sbin
/usr/sbin/cron
/usr/bin
/usr/bin/crontab
/var
/var/spool
/var/spool/cron
/var/spool/cron/crontabs
/etc/init.d/cron
Tests run: 11, Failures: 0, Errors: 0, Skipped: 3, Time elapsed: 1.858 sec
Running org.apache.bigtop.itest.TestContractJava
Tests run: 2, Failures: 0, Errors: 0, Skipped: 0, Time elapsed: 0.002 sec
Running org.apache.bigtop.itest.TestListUtilsTest
Tests run: 1, Failures: 0, Errors: 0, Skipped: 0, Time elapsed: 0.016 sec
Running org.apache.bigtop.itest.shell.ShellTest
Tests run: 2, Failures: 0, Errors: 0, Skipped: 1, Time elapsed: 0.007 sec
Running org.apache.bigtop.itest.JarContentTest
log4j:WARN No appenders could be found for logger (org.apache.bigtop.itest.JarContent).
log4j:WARN Please initialize the log4j system properly.
Tests run: 6, Failures: 0, Errors: 0, Skipped: 0, Time elapsed: 0.799 sec
Running org.apache.bigtop.itest.TestContractJavaProc
Tests run: 2, Failures: 0, Errors: 0, Skipped: 0, Time elapsed: 0.001 sec
Results :
Tests run: 41, Failures: 0, Errors: 0, Skipped: 5
[JENKINS] Recording test results
log4j:WARN No appenders could be found for logger (org.apache.commons.beanutils.converters.BooleanConverter).
log4j:WARN Please initialize the log4j system properly.
[INFO]
[INFO] --- maven-jar-plugin:2.2:jar (default-jar) @ itest-common ---
[INFO] Building jar: <https://builds.apache.org/job/Bigtop-trunk-iTest/org.apache.bigtop.itest$itest-common/ws/target/itest-common-0.9.0-SNAPSHOT.jar>
[INFO]
[INFO] --- maven-jar-plugin:2.2:test-jar (default) @ itest-common ---
[INFO] Building jar: <https://builds.apache.org/job/Bigtop-trunk-iTest/org.apache.bigtop.itest$itest-common/ws/target/itest-common-0.9.0-SNAPSHOT-tests.jar>
[INFO]
[INFO] --- maven-failsafe-plugin:2.17:verify (default) @ itest-common ---
[INFO] Failsafe report directory: <https://builds.apache.org/job/Bigtop-trunk-iTest/org.apache.bigtop.itest$itest-common/ws/target/failsafe-reports>
[WARNING] File encoding has not been set, using platform encoding ISO-8859-1, i.e. build is platform dependent!
[ERROR] There are test failures.
Please refer to <https://builds.apache.org/job/Bigtop-trunk-iTest/org.apache.bigtop.itest$itest-common/ws/target/failsafe-reports> for the individual test results.
[JENKINS] Recording test results
hudson.AbortException: Test reports were found but none of them are new. Did tests run?
For example, <https://builds.apache.org/job/Bigtop-trunk-iTest/org.apache.bigtop.itest$itest-common/ws/target/failsafe-reports/TEST-org.apache.bigtop.itest.failures.IntegrationTestClusterFailures.xml> is 2 days 6 hr old
at hudson.tasks.junit.TestResult.parse(TestResult.java:213)
at hudson.maven.reporters.SurefireArchiver.postExecute(SurefireArchiver.java:148)
at hudson.maven.Maven3Builder$MavenExecutionListener.recordMojoEnded(Maven3Builder.java:634)
at hudson.maven.Maven3Builder$MavenExecutionListener.mojoSucceeded(Maven3Builder.java:615)
at org.apache.maven.lifecycle.internal.DefaultExecutionEventCatapult.fire(DefaultExecutionEventCatapult.java:87)
at org.apache.maven.lifecycle.internal.DefaultExecutionEventCatapult.fire(DefaultExecutionEventCatapult.java:42)
at org.apache.maven.lifecycle.internal.MojoExecutor.execute(MojoExecutor.java:228)
at org.apache.maven.lifecycle.internal.MojoExecutor.execute(MojoExecutor.java:153)
at org.apache.maven.lifecycle.internal.MojoExecutor.execute(MojoExecutor.java:145)
at org.apache.maven.lifecycle.internal.LifecycleModuleBuilder.buildProject(LifecycleModuleBuilder.java:84)
at org.apache.maven.lifecycle.internal.LifecycleModuleBuilder.buildProject(LifecycleModuleBuilder.java:59)
at org.apache.maven.lifecycle.internal.LifecycleStarter.singleThreadedBuild(LifecycleStarter.java:183)
at org.apache.maven.lifecycle.internal.LifecycleStarter.execute(LifecycleStarter.java:161)
at org.apache.maven.DefaultMaven.doExecute(DefaultMaven.java:320)
at org.apache.maven.DefaultMaven.execute(DefaultMaven.java:156)
at org.jvnet.hudson.maven3.launcher.Maven3Launcher.main(Maven3Launcher.java:117)
at sun.reflect.NativeMethodAccessorImpl.invoke0(Native Method)
at sun.reflect.NativeMethodAccessorImpl.invoke(NativeMethodAccessorImpl.java:39)
at sun.reflect.DelegatingMethodAccessorImpl.invoke(DelegatingMethodAccessorImpl.java:25)
at java.lang.reflect.Method.invoke(Method.java:597)
at org.codehaus.plexus.classworlds.launcher.Launcher.launchStandard(Launcher.java:329)
at org.codehaus.plexus.classworlds.launcher.Launcher.launch(Launcher.java:239)
at org.jvnet.hudson.maven3.agent.Maven3Main.launch(Maven3Main.java:178)
at sun.reflect.NativeMethodAccessorImpl.invoke0(Native Method)
at sun.reflect.NativeMethodAccessorImpl.invoke(NativeMethodAccessorImpl.java:39)
at sun.reflect.DelegatingMethodAccessorImpl.invoke(DelegatingMethodAccessorImpl.java:25)
at java.lang.reflect.Method.invoke(Method.java:597)
at hudson.maven.Maven3Builder.call(Maven3Builder.java:136)
at hudson.maven.Maven3Builder.call(Maven3Builder.java:71)
at hudson.remoting.UserRequest.perform(UserRequest.java:118)
at hudson.remoting.UserRequest.perform(UserRequest.java:48)
at hudson.remoting.Request$2.run(Request.java:328)
at hudson.remoting.InterceptingExecutorService$1.call(InterceptingExecutorService.java:72)
at java.util.concurrent.FutureTask$Sync.innerRun(FutureTask.java:303)
at java.util.concurrent.FutureTask.run(FutureTask.java:138)
at java.util.concurrent.ThreadPoolExecutor$Worker.runTask(ThreadPoolExecutor.java:895)
at java.util.concurrent.ThreadPoolExecutor$Worker.run(ThreadPoolExecutor.java:918)
at java.lang.Thread.run(Thread.java:662)
[INFO]
[INFO] --- maven-install-plugin:2.3:install (default-install) @ itest-common ---
[INFO] Installing <https://builds.apache.org/job/Bigtop-trunk-iTest/org.apache.bigtop.itest$itest-common/ws/target/itest-common-0.9.0-SNAPSHOT.jar> to /home/jenkins/jenkins-slave/maven-repositories/1/org/apache/bigtop/itest/itest-common/0.9.0-SNAPSHOT/itest-common-0.9.0-SNAPSHOT.jar
[INFO] Installing <https://builds.apache.org/job/Bigtop-trunk-iTest/org.apache.bigtop.itest$itest-common/ws/pom.xml> to /home/jenkins/jenkins-slave/maven-repositories/1/org/apache/bigtop/itest/itest-common/0.9.0-SNAPSHOT/itest-common-0.9.0-SNAPSHOT.pom
[INFO] Installing <https://builds.apache.org/job/Bigtop-trunk-iTest/org.apache.bigtop.itest$itest-common/ws/target/itest-common-0.9.0-SNAPSHOT-tests.jar> to /home/jenkins/jenkins-slave/maven-repositories/1/org/apache/bigtop/itest/itest-common/0.9.0-SNAPSHOT/itest-common-0.9.0-SNAPSHOT-tests.jar
[INFO]
[INFO] --- maven-deploy-plugin:2.5:deploy (default-deploy) @ itest-common ---
Downloading: https://repository.apache.org/content/repositories/snapshots/org/apache/bigtop/itest/itest-common/0.9.0-SNAPSHOT/maven-metadata.xml
Downloaded: https://repository.apache.org/content/repositories/snapshots/org/apache/bigtop/itest/itest-common/0.9.0-SNAPSHOT/maven-metadata.xml (1005 B at 1.7 KB/sec)
Uploading: https://repository.apache.org/content/repositories/snapshots/org/apache/bigtop/itest/itest-common/0.9.0-SNAPSHOT/itest-common-0.9.0-20150128.211627-197.jar
Uploaded: https://repository.apache.org/content/repositories/snapshots/org/apache/bigtop/itest/itest-common/0.9.0-SNAPSHOT/itest-common-0.9.0-20150128.211627-197.jar (206 KB at 572.7 KB/sec)
Uploading: https://repository.apache.org/content/repositories/snapshots/org/apache/bigtop/itest/itest-common/0.9.0-SNAPSHOT/itest-common-0.9.0-20150128.211627-197.pom
Uploaded: https://repository.apache.org/content/repositories/snapshots/org/apache/bigtop/itest/itest-common/0.9.0-SNAPSHOT/itest-common-0.9.0-20150128.211627-197.pom (6 KB at 31.5 KB/sec)
Downloading: https://repository.apache.org/content/repositories/snapshots/org/apache/bigtop/itest/itest-common/maven-metadata.xml
Downloaded: https://repository.apache.org/content/repositories/snapshots/org/apache/bigtop/itest/itest-common/maven-metadata.xml (466 B at 5.9 KB/sec)
Uploading: https://repository.apache.org/content/repositories/snapshots/org/apache/bigtop/itest/itest-common/0.9.0-SNAPSHOT/maven-metadata.xml
Uploaded: https://repository.apache.org/content/repositories/snapshots/org/apache/bigtop/itest/itest-common/0.9.0-SNAPSHOT/maven-metadata.xml (1005 B at 8.5 KB/sec)
Uploading: https://repository.apache.org/content/repositories/snapshots/org/apache/bigtop/itest/itest-common/maven-metadata.xml
Uploaded: https://repository.apache.org/content/repositories/snapshots/org/apache/bigtop/itest/itest-common/maven-metadata.xml (466 B at 3.4 KB/sec)
Uploading: https://repository.apache.org/content/repositories/snapshots/org/apache/bigtop/itest/itest-common/0.9.0-SNAPSHOT/itest-common-0.9.0-20150128.211627-197-tests.jar
Uploaded: https://repository.apache.org/content/repositories/snapshots/org/apache/bigtop/itest/itest-common/0.9.0-SNAPSHOT/itest-common-0.9.0-20150128.211627-197-tests.jar (70 KB at 401.4 KB/sec)
Uploading: https://repository.apache.org/content/repositories/snapshots/org/apache/bigtop/itest/itest-common/0.9.0-SNAPSHOT/maven-metadata.xml
Uploaded: https://repository.apache.org/content/repositories/snapshots/org/apache/bigtop/itest/itest-common/0.9.0-SNAPSHOT/maven-metadata.xml (1005 B at 7.1 KB/sec)
[INFO] ------------------------------------------------------------------------
[INFO] BUILD SUCCESS
[INFO] ------------------------------------------------------------------------
[INFO] Total time: 40.420s
[INFO] Finished at: Wed Jan 28 21:16:29 UTC 2015
[INFO] Final Memory: 16M/246M
[INFO] ------------------------------------------------------------------------
Waiting for Jenkins to finish collecting data
Build failed in Jenkins: Bigtop-trunk-iTest » iTest: system and integration testing in the cloud #2000
Posted by Apache Jenkins Server <je...@builds.apache.org>.
See <https://builds.apache.org/job/Bigtop-trunk-iTest/org.apache.bigtop.itest$itest-common/2000/>
------------------------------------------
maven3-agent.jar already up to date
maven3-interceptor.jar already up to date
maven3-interceptor-commons.jar already up to date
<===[JENKINS REMOTING CAPACITY]===> channel started
Executing Maven: -B -f <https://builds.apache.org/job/Bigtop-trunk-iTest/org.apache.bigtop.itest$itest-common/ws/pom.xml> -Dmaven.repo.local=/home/jenkins/jenkins-slave/maven-repositories/0 deploy
[INFO] Scanning for projects...
[INFO]
[INFO] ------------------------------------------------------------------------
[INFO] Building iTest: system and integration testing in the cloud 0.9.0-SNAPSHOT
[INFO] ------------------------------------------------------------------------
[INFO]
[INFO] --- groovy-eclipse-compiler:2.8.0-01:add-groovy-build-paths (default-add-groovy-build-paths) @ itest-common ---
[INFO] Adding /src/main/groovy to the list of source folders
[INFO] Adding /src/test/groovy to the list of test source folders
[INFO]
[INFO] --- maven-remote-resources-plugin:1.1:process (default) @ itest-common ---
[INFO] Setting property: classpath.resource.loader.class => 'org.codehaus.plexus.velocity.ContextClassLoaderResourceLoader'.
[INFO] Setting property: velocimacro.messages.on => 'false'.
[INFO] Setting property: resource.loader => 'classpath'.
[INFO] Setting property: resource.manager.logwhenfound => 'false'.
[INFO]
[INFO] --- maven-resources-plugin:2.4:resources (default-resources) @ itest-common ---
[INFO] Using 'UTF-8' encoding to copy filtered resources.
[INFO] skip non existing resourceDirectory <https://builds.apache.org/job/Bigtop-trunk-iTest/org.apache.bigtop.itest$itest-common/ws/src/main/resources>
[INFO] Copying 3 resources
[INFO]
[INFO] --- maven-compiler-plugin:3.1:compile (default-compile) @ itest-common ---
[INFO] Changes detected - recompiling the module!
[INFO] Using Groovy-Eclipse compiler to compile both Java and Groovy files
[INFO]
[INFO] --- maven-resources-plugin:2.4:testResources (default-testResources) @ itest-common ---
[INFO] Using 'UTF-8' encoding to copy filtered resources.
[INFO] skip non existing resourceDirectory <https://builds.apache.org/job/Bigtop-trunk-iTest/org.apache.bigtop.itest$itest-common/ws/src/test/resources>
[INFO] Copying 3 resources
[INFO]
[INFO] --- maven-compiler-plugin:3.1:testCompile (default-testCompile) @ itest-common ---
[INFO] Changes detected - recompiling the module!
[INFO] Using Groovy-Eclipse compiler to compile both Java and Groovy files
[INFO]
[INFO] --- maven-surefire-plugin:2.7:test (default-test) @ itest-common ---
[INFO] Surefire report directory: <https://builds.apache.org/job/Bigtop-trunk-iTest/org.apache.bigtop.itest$itest-common/ws/target/surefire-reports>
-------------------------------------------------------
T E S T S
-------------------------------------------------------
Running org.apache.bigtop.itest.JUnitUtilsTest
Disclaimer: This test expected to show a failure in an embeded testcase
[junit] Running org.apache.bigtop.itest.DummyTestPassTests run: 1, Failures: 0, Errors: 0, Time elapsed: 0.273 secRunning org.apache.bigtop.itest.DummyTestFail
[junit] Tests run: 1, Failures: 1, Errors: 0, Time elapsed: 0.141 secTEST org.apache.bigtop.itest.DummyTestFail FAILED
[junit] Tests FAILED
Disclaimer: This test expected to show an error in an embeded testcase
[junit] Running org.apache.bigtop.itest.DummyTestError
[junit] Tests run: 1, Failures: 0, Errors: 1, Time elapsed: 0.288 sec
[junit] Test org.apache.bigtop.itest.DummyTestError FAILED
[junit] Running org.apache.bigtop.itest.DummyTestPass
[junit] Tests run: 1, Failures: 0, Errors: 0, Time elapsed: 0.274 sec
[junit] Running org.apache.bigtop.itest.DummyTestPass
[junit] Tests run: 1, Failures: 0, Errors: 0, Time elapsed: 0.275 sec
Tests run: 4, Failures: 0, Errors: 0, Skipped: 0, Time elapsed: 4.955 sec
Running org.apache.bigtop.itest.junit.OrderedParameterizedTest
Tests run: 3, Failures: 0, Errors: 0, Skipped: 0, Time elapsed: 0.051 sec
Running org.apache.bigtop.itest.junit.OrderedTest
Tests run: 3, Failures: 0, Errors: 0, Skipped: 0, Time elapsed: 0.008 sec
Running org.apache.bigtop.itest.posix.UGITest
Tests run: 2, Failures: 0, Errors: 0, Skipped: 0, Time elapsed: 0.075 sec
Running org.apache.bigtop.itest.posix.ServiceTest
Status []
Tests run: 2, Failures: 0, Errors: 0, Skipped: 1, Time elapsed: 0.146 sec
Running org.apache.bigtop.itest.posix.AlternativeTest
Tests run: 1, Failures: 0, Errors: 0, Skipped: 0, Time elapsed: 1.323 sec
Running org.apache.bigtop.itest.TestContractGroovy
Tests run: 2, Failures: 0, Errors: 0, Skipped: 0, Time elapsed: 0.01 sec
Running org.apache.bigtop.itest.pmanager.PackageManagerTest
/etc/cron.monthly/.placeholder
/etc/cron.hourly/.placeholder
/etc/default/cron
/etc/cron.weekly/.placeholder
/etc/cron.d/.placeholder
/etc/cron.daily/.placeholder
/etc/pam.d/cron
/etc/init/cron.conf
/etc/crontab
/.
/etc
/etc/cron.monthly
/etc/cron.monthly/.placeholder
/etc/cron.hourly
/etc/cron.hourly/.placeholder
/etc/default
/etc/default/cron
/etc/cron.weekly
/etc/cron.weekly/.placeholder
/etc/cron.d
/etc/cron.d/.placeholder
/etc/cron.daily
/etc/cron.daily/.placeholder
/etc/pam.d
/etc/pam.d/cron
/etc/init
/etc/init/cron.conf
/etc/init.d
/etc/crontab
/usr
/usr/share
/usr/share/bug
/usr/share/bug/cron
/usr/share/bug/cron/script
/usr/share/bug/cron/control
/usr/share/man
/usr/share/man/man1
/usr/share/man/man1/crontab.1.gz
/usr/share/man/man5
/usr/share/man/man5/crontab.5.gz
/usr/share/man/man8
/usr/share/man/man8/cron.8.gz
/usr/share/doc
/usr/share/doc/cron
/usr/share/doc/cron/README
/usr/share/doc/cron/README.anacron
/usr/share/doc/cron/README.Debian
/usr/share/doc/cron/FEATURES
/usr/share/doc/cron/copyright
/usr/share/doc/cron/examples
/usr/share/doc/cron/examples/crontab2english.pl
/usr/share/doc/cron/examples/cron-stats.pl
/usr/share/doc/cron/examples/cron-tasks-review.sh
/usr/share/doc/cron/NEWS.Debian.gz
/usr/share/doc/cron/changelog.Debian.gz
/usr/share/doc/cron/THANKS
/usr/share/doc/cron/TODO.Debian
/usr/sbin
/usr/sbin/cron
/usr/bin
/usr/bin/crontab
/var
/var/spool
/var/spool/cron
/var/spool/cron/crontabs
/etc/init.d/cron
Tests run: 11, Failures: 0, Errors: 0, Skipped: 3, Time elapsed: 1.796 sec
Running org.apache.bigtop.itest.TestContractJava
Tests run: 2, Failures: 0, Errors: 0, Skipped: 0, Time elapsed: 0.002 sec
Running org.apache.bigtop.itest.TestListUtilsTest
Tests run: 1, Failures: 0, Errors: 0, Skipped: 0, Time elapsed: 0.016 sec
Running org.apache.bigtop.itest.shell.ShellTest
Tests run: 2, Failures: 0, Errors: 0, Skipped: 1, Time elapsed: 0.008 sec
Running org.apache.bigtop.itest.JarContentTest
log4j:WARN No appenders could be found for logger (org.apache.bigtop.itest.JarContent).
log4j:WARN Please initialize the log4j system properly.
Tests run: 6, Failures: 0, Errors: 0, Skipped: 0, Time elapsed: 1.073 sec
Running org.apache.bigtop.itest.TestContractJavaProc
Tests run: 2, Failures: 0, Errors: 0, Skipped: 0, Time elapsed: 0.002 sec
Results :
Tests run: 41, Failures: 0, Errors: 0, Skipped: 5
[JENKINS] Recording test results
log4j:WARN No appenders could be found for logger (org.apache.commons.beanutils.converters.BooleanConverter).
log4j:WARN Please initialize the log4j system properly.
[INFO]
[INFO] --- maven-jar-plugin:2.2:jar (default-jar) @ itest-common ---
[INFO] Building jar: <https://builds.apache.org/job/Bigtop-trunk-iTest/org.apache.bigtop.itest$itest-common/ws/target/itest-common-0.9.0-SNAPSHOT.jar>
[INFO]
[INFO] --- maven-jar-plugin:2.2:test-jar (default) @ itest-common ---
[INFO] Building jar: <https://builds.apache.org/job/Bigtop-trunk-iTest/org.apache.bigtop.itest$itest-common/ws/target/itest-common-0.9.0-SNAPSHOT-tests.jar>
[INFO]
[INFO] --- maven-failsafe-plugin:2.17:verify (default) @ itest-common ---
[INFO] Failsafe report directory: <https://builds.apache.org/job/Bigtop-trunk-iTest/org.apache.bigtop.itest$itest-common/ws/target/failsafe-reports>
[WARNING] File encoding has not been set, using platform encoding ISO-8859-1, i.e. build is platform dependent!
[ERROR] There are test failures.
Please refer to <https://builds.apache.org/job/Bigtop-trunk-iTest/org.apache.bigtop.itest$itest-common/ws/target/failsafe-reports> for the individual test results.
[JENKINS] Recording test results
hudson.AbortException: Test reports were found but none of them are new. Did tests run?
For example, <https://builds.apache.org/job/Bigtop-trunk-iTest/org.apache.bigtop.itest$itest-common/ws/target/failsafe-reports/TEST-org.apache.bigtop.itest.failures.IntegrationTestClusterFailures.xml> is 2 days 6 hr old
at hudson.tasks.junit.TestResult.parse(TestResult.java:213)
at hudson.maven.reporters.SurefireArchiver.postExecute(SurefireArchiver.java:148)
at hudson.maven.Maven3Builder$MavenExecutionListener.recordMojoEnded(Maven3Builder.java:634)
at hudson.maven.Maven3Builder$MavenExecutionListener.mojoSucceeded(Maven3Builder.java:615)
at org.apache.maven.lifecycle.internal.DefaultExecutionEventCatapult.fire(DefaultExecutionEventCatapult.java:87)
at org.apache.maven.lifecycle.internal.DefaultExecutionEventCatapult.fire(DefaultExecutionEventCatapult.java:42)
at org.apache.maven.lifecycle.internal.MojoExecutor.execute(MojoExecutor.java:228)
at org.apache.maven.lifecycle.internal.MojoExecutor.execute(MojoExecutor.java:153)
at org.apache.maven.lifecycle.internal.MojoExecutor.execute(MojoExecutor.java:145)
at org.apache.maven.lifecycle.internal.LifecycleModuleBuilder.buildProject(LifecycleModuleBuilder.java:84)
at org.apache.maven.lifecycle.internal.LifecycleModuleBuilder.buildProject(LifecycleModuleBuilder.java:59)
at org.apache.maven.lifecycle.internal.LifecycleStarter.singleThreadedBuild(LifecycleStarter.java:183)
at org.apache.maven.lifecycle.internal.LifecycleStarter.execute(LifecycleStarter.java:161)
at org.apache.maven.DefaultMaven.doExecute(DefaultMaven.java:320)
at org.apache.maven.DefaultMaven.execute(DefaultMaven.java:156)
at org.jvnet.hudson.maven3.launcher.Maven3Launcher.main(Maven3Launcher.java:117)
at sun.reflect.NativeMethodAccessorImpl.invoke0(Native Method)
at sun.reflect.NativeMethodAccessorImpl.invoke(NativeMethodAccessorImpl.java:39)
at sun.reflect.DelegatingMethodAccessorImpl.invoke(DelegatingMethodAccessorImpl.java:25)
at java.lang.reflect.Method.invoke(Method.java:597)
at org.codehaus.plexus.classworlds.launcher.Launcher.launchStandard(Launcher.java:329)
at org.codehaus.plexus.classworlds.launcher.Launcher.launch(Launcher.java:239)
at org.jvnet.hudson.maven3.agent.Maven3Main.launch(Maven3Main.java:178)
at sun.reflect.NativeMethodAccessorImpl.invoke0(Native Method)
at sun.reflect.NativeMethodAccessorImpl.invoke(NativeMethodAccessorImpl.java:39)
at sun.reflect.DelegatingMethodAccessorImpl.invoke(DelegatingMethodAccessorImpl.java:25)
at java.lang.reflect.Method.invoke(Method.java:597)
at hudson.maven.Maven3Builder.call(Maven3Builder.java:136)
at hudson.maven.Maven3Builder.call(Maven3Builder.java:71)
at hudson.remoting.UserRequest.perform(UserRequest.java:118)
at hudson.remoting.UserRequest.perform(UserRequest.java:48)
at hudson.remoting.Request$2.run(Request.java:328)
at hudson.remoting.InterceptingExecutorService$1.call(InterceptingExecutorService.java:72)
at java.util.concurrent.FutureTask$Sync.innerRun(FutureTask.java:303)
at java.util.concurrent.FutureTask.run(FutureTask.java:138)
at java.util.concurrent.ThreadPoolExecutor$Worker.runTask(ThreadPoolExecutor.java:895)
at java.util.concurrent.ThreadPoolExecutor$Worker.run(ThreadPoolExecutor.java:918)
at java.lang.Thread.run(Thread.java:662)
[INFO]
[INFO] --- maven-install-plugin:2.3:install (default-install) @ itest-common ---
[INFO] Installing <https://builds.apache.org/job/Bigtop-trunk-iTest/org.apache.bigtop.itest$itest-common/ws/target/itest-common-0.9.0-SNAPSHOT.jar> to /home/jenkins/jenkins-slave/maven-repositories/0/org/apache/bigtop/itest/itest-common/0.9.0-SNAPSHOT/itest-common-0.9.0-SNAPSHOT.jar
[INFO] Installing <https://builds.apache.org/job/Bigtop-trunk-iTest/org.apache.bigtop.itest$itest-common/ws/pom.xml> to /home/jenkins/jenkins-slave/maven-repositories/0/org/apache/bigtop/itest/itest-common/0.9.0-SNAPSHOT/itest-common-0.9.0-SNAPSHOT.pom
[INFO] Installing <https://builds.apache.org/job/Bigtop-trunk-iTest/org.apache.bigtop.itest$itest-common/ws/target/itest-common-0.9.0-SNAPSHOT-tests.jar> to /home/jenkins/jenkins-slave/maven-repositories/0/org/apache/bigtop/itest/itest-common/0.9.0-SNAPSHOT/itest-common-0.9.0-SNAPSHOT-tests.jar
[INFO]
[INFO] --- maven-deploy-plugin:2.5:deploy (default-deploy) @ itest-common ---
Downloading: https://repository.apache.org/content/repositories/snapshots/org/apache/bigtop/itest/itest-common/0.9.0-SNAPSHOT/maven-metadata.xml
Downloaded: https://repository.apache.org/content/repositories/snapshots/org/apache/bigtop/itest/itest-common/0.9.0-SNAPSHOT/maven-metadata.xml (1005 B at 0.6 KB/sec)
Uploading: https://repository.apache.org/content/repositories/snapshots/org/apache/bigtop/itest/itest-common/0.9.0-SNAPSHOT/itest-common-0.9.0-20150128.211349-196.jar
Uploaded: https://repository.apache.org/content/repositories/snapshots/org/apache/bigtop/itest/itest-common/0.9.0-SNAPSHOT/itest-common-0.9.0-20150128.211349-196.jar (206 KB at 953.7 KB/sec)
Uploading: https://repository.apache.org/content/repositories/snapshots/org/apache/bigtop/itest/itest-common/0.9.0-SNAPSHOT/itest-common-0.9.0-20150128.211349-196.pom
Uploaded: https://repository.apache.org/content/repositories/snapshots/org/apache/bigtop/itest/itest-common/0.9.0-SNAPSHOT/itest-common-0.9.0-20150128.211349-196.pom (6 KB at 32.7 KB/sec)
Downloading: https://repository.apache.org/content/repositories/snapshots/org/apache/bigtop/itest/itest-common/maven-metadata.xml
Downloaded: https://repository.apache.org/content/repositories/snapshots/org/apache/bigtop/itest/itest-common/maven-metadata.xml (466 B at 4.6 KB/sec)
Uploading: https://repository.apache.org/content/repositories/snapshots/org/apache/bigtop/itest/itest-common/0.9.0-SNAPSHOT/maven-metadata.xml
Uploaded: https://repository.apache.org/content/repositories/snapshots/org/apache/bigtop/itest/itest-common/0.9.0-SNAPSHOT/maven-metadata.xml (1005 B at 8.2 KB/sec)
Uploading: https://repository.apache.org/content/repositories/snapshots/org/apache/bigtop/itest/itest-common/maven-metadata.xml
Uploaded: https://repository.apache.org/content/repositories/snapshots/org/apache/bigtop/itest/itest-common/maven-metadata.xml (466 B at 3.3 KB/sec)
Uploading: https://repository.apache.org/content/repositories/snapshots/org/apache/bigtop/itest/itest-common/0.9.0-SNAPSHOT/itest-common-0.9.0-20150128.211349-196-tests.jar
Uploaded: https://repository.apache.org/content/repositories/snapshots/org/apache/bigtop/itest/itest-common/0.9.0-SNAPSHOT/itest-common-0.9.0-20150128.211349-196-tests.jar (70 KB at 392.4 KB/sec)
Uploading: https://repository.apache.org/content/repositories/snapshots/org/apache/bigtop/itest/itest-common/0.9.0-SNAPSHOT/maven-metadata.xml
Uploaded: https://repository.apache.org/content/repositories/snapshots/org/apache/bigtop/itest/itest-common/0.9.0-SNAPSHOT/maven-metadata.xml (1005 B at 6.9 KB/sec)
[INFO] ------------------------------------------------------------------------
[INFO] BUILD SUCCESS
[INFO] ------------------------------------------------------------------------
[INFO] Total time: 27.522s
[INFO] Finished at: Wed Jan 28 21:13:51 UTC 2015
[INFO] Final Memory: 16M/245M
[INFO] ------------------------------------------------------------------------
Waiting for Jenkins to finish collecting data
Build failed in Jenkins: Bigtop-trunk-iTest » iTest: system and integration testing in the cloud #1999
Posted by Apache Jenkins Server <je...@builds.apache.org>.
See <https://builds.apache.org/job/Bigtop-trunk-iTest/org.apache.bigtop.itest$itest-common/1999/>
------------------------------------------
[...truncated 22 lines...]
Downloading: http://repository.codehaus.org/org/codehaus/groovy/groovy-eclipse-batch/2.3.2-01-SNAPSHOT/maven-metadata.xml
Downloading: http://nexus.codehaus.org/snapshots/org/codehaus/groovy/groovy-eclipse-batch/2.3.2-01-SNAPSHOT/maven-metadata.xml
Downloaded: http://nexus.codehaus.org/snapshots/org/codehaus/groovy/groovy-eclipse-batch/2.3.2-01-SNAPSHOT/maven-metadata.xml (2 KB at 4.4 KB/sec)
Downloading: http://repository.codehaus.org/org/codehaus/groovy/groovy-eclipse-batch/2.3.3-01-SNAPSHOT/maven-metadata.xml
Downloading: http://nexus.codehaus.org/snapshots/org/codehaus/groovy/groovy-eclipse-batch/2.3.3-01-SNAPSHOT/maven-metadata.xml
Downloaded: http://nexus.codehaus.org/snapshots/org/codehaus/groovy/groovy-eclipse-batch/2.3.3-01-SNAPSHOT/maven-metadata.xml (2 KB at 4.9 KB/sec)
Downloading: http://nexus.codehaus.org/snapshots/org/codehaus/groovy/groovy-eclipse-batch/2.3.4-01-SNAPSHOT/maven-metadata.xml
Downloading: http://repository.codehaus.org/org/codehaus/groovy/groovy-eclipse-batch/2.3.4-01-SNAPSHOT/maven-metadata.xml
Downloaded: http://nexus.codehaus.org/snapshots/org/codehaus/groovy/groovy-eclipse-batch/2.3.4-01-SNAPSHOT/maven-metadata.xml (378 B at 1.5 KB/sec)
[INFO]
[INFO] ------------------------------------------------------------------------
[INFO] Building iTest: system and integration testing in the cloud 0.9.0-SNAPSHOT
[INFO] ------------------------------------------------------------------------
[INFO]
[INFO] --- groovy-eclipse-compiler:2.8.0-01:add-groovy-build-paths (default-add-groovy-build-paths) @ itest-common ---
[INFO] Adding /src/main/groovy to the list of source folders
[INFO] Adding /src/test/groovy to the list of test source folders
[INFO]
[INFO] --- maven-remote-resources-plugin:1.1:process (default) @ itest-common ---
[INFO] Setting property: classpath.resource.loader.class => 'org.codehaus.plexus.velocity.ContextClassLoaderResourceLoader'.
[INFO] Setting property: velocimacro.messages.on => 'false'.
[INFO] Setting property: resource.loader => 'classpath'.
[INFO] Setting property: resource.manager.logwhenfound => 'false'.
[INFO]
[INFO] --- maven-resources-plugin:2.4:resources (default-resources) @ itest-common ---
[INFO] Using 'UTF-8' encoding to copy filtered resources.
[INFO] skip non existing resourceDirectory <https://builds.apache.org/job/Bigtop-trunk-iTest/org.apache.bigtop.itest$itest-common/ws/src/main/resources>
[INFO] Copying 3 resources
[INFO]
[INFO] --- maven-compiler-plugin:3.1:compile (default-compile) @ itest-common ---
[INFO] Changes detected - recompiling the module!
[INFO] Using Groovy-Eclipse compiler to compile both Java and Groovy files
[INFO]
[INFO] --- maven-resources-plugin:2.4:testResources (default-testResources) @ itest-common ---
[INFO] Using 'UTF-8' encoding to copy filtered resources.
[INFO] skip non existing resourceDirectory <https://builds.apache.org/job/Bigtop-trunk-iTest/org.apache.bigtop.itest$itest-common/ws/src/test/resources>
[INFO] Copying 3 resources
[INFO]
[INFO] --- maven-compiler-plugin:3.1:testCompile (default-testCompile) @ itest-common ---
[INFO] Changes detected - recompiling the module!
[INFO] Using Groovy-Eclipse compiler to compile both Java and Groovy files
[INFO]
[INFO] --- maven-surefire-plugin:2.7:test (default-test) @ itest-common ---
[INFO] Surefire report directory: <https://builds.apache.org/job/Bigtop-trunk-iTest/org.apache.bigtop.itest$itest-common/ws/target/surefire-reports>
-------------------------------------------------------
T E S T S
-------------------------------------------------------
Running org.apache.bigtop.itest.JUnitUtilsTest
Disclaimer: This test expected to show a failure in an embeded testcase
[junit] Running org.apache.bigtop.itest.DummyTestPassTests run: 1, Failures: 0, Errors: 0, Time elapsed: 0.276 secRunning org.apache.bigtop.itest.DummyTestFail
[junit] Tests run: 1, Failures: 1, Errors: 0, Time elapsed: 0.146 secTEST org.apache.bigtop.itest.DummyTestFail FAILED
[junit] Tests FAILED
Disclaimer: This test expected to show an error in an embeded testcase
[junit] Running org.apache.bigtop.itest.DummyTestError
[junit] Tests run: 1, Failures: 0, Errors: 1, Time elapsed: 0.289 sec
[junit] Test org.apache.bigtop.itest.DummyTestError FAILED
[junit] Running org.apache.bigtop.itest.DummyTestPass
[junit] Tests run: 1, Failures: 0, Errors: 0, Time elapsed: 0.275 sec
[junit] Running org.apache.bigtop.itest.DummyTestPass
[junit] Tests run: 1, Failures: 0, Errors: 0, Time elapsed: 0.273 sec
Tests run: 4, Failures: 0, Errors: 0, Skipped: 0, Time elapsed: 4.984 sec
Running org.apache.bigtop.itest.junit.OrderedParameterizedTest
Tests run: 3, Failures: 0, Errors: 0, Skipped: 0, Time elapsed: 0.054 sec
Running org.apache.bigtop.itest.junit.OrderedTest
Tests run: 3, Failures: 0, Errors: 0, Skipped: 0, Time elapsed: 0.009 sec
Running org.apache.bigtop.itest.posix.UGITest
Tests run: 2, Failures: 0, Errors: 0, Skipped: 0, Time elapsed: 0.076 sec
Running org.apache.bigtop.itest.posix.ServiceTest
Status []
Tests run: 2, Failures: 0, Errors: 0, Skipped: 1, Time elapsed: 0.11 sec
Running org.apache.bigtop.itest.posix.AlternativeTest
Tests run: 1, Failures: 0, Errors: 0, Skipped: 0, Time elapsed: 1.339 sec
Running org.apache.bigtop.itest.TestContractGroovy
Tests run: 2, Failures: 0, Errors: 0, Skipped: 0, Time elapsed: 0.01 sec
Running org.apache.bigtop.itest.pmanager.PackageManagerTest
/etc/cron.monthly/.placeholder
/etc/cron.hourly/.placeholder
/etc/default/cron
/etc/cron.weekly/.placeholder
/etc/cron.d/.placeholder
/etc/cron.daily/.placeholder
/etc/pam.d/cron
/etc/init/cron.conf
/etc/crontab
/.
/etc
/etc/cron.monthly
/etc/cron.monthly/.placeholder
/etc/cron.hourly
/etc/cron.hourly/.placeholder
/etc/default
/etc/default/cron
/etc/cron.weekly
/etc/cron.weekly/.placeholder
/etc/cron.d
/etc/cron.d/.placeholder
/etc/cron.daily
/etc/cron.daily/.placeholder
/etc/pam.d
/etc/pam.d/cron
/etc/init
/etc/init/cron.conf
/etc/init.d
/etc/crontab
/usr
/usr/share
/usr/share/bug
/usr/share/bug/cron
/usr/share/bug/cron/script
/usr/share/bug/cron/control
/usr/share/man
/usr/share/man/man1
/usr/share/man/man1/crontab.1.gz
/usr/share/man/man5
/usr/share/man/man5/crontab.5.gz
/usr/share/man/man8
/usr/share/man/man8/cron.8.gz
/usr/share/doc
/usr/share/doc/cron
/usr/share/doc/cron/README
/usr/share/doc/cron/README.anacron
/usr/share/doc/cron/README.Debian
/usr/share/doc/cron/FEATURES
/usr/share/doc/cron/copyright
/usr/share/doc/cron/examples
/usr/share/doc/cron/examples/crontab2english.pl
/usr/share/doc/cron/examples/cron-stats.pl
/usr/share/doc/cron/examples/cron-tasks-review.sh
/usr/share/doc/cron/NEWS.Debian.gz
/usr/share/doc/cron/changelog.Debian.gz
/usr/share/doc/cron/THANKS
/usr/share/doc/cron/TODO.Debian
/usr/sbin
/usr/sbin/cron
/usr/bin
/usr/bin/crontab
/var
/var/spool
/var/spool/cron
/var/spool/cron/crontabs
/etc/init.d/cron
Tests run: 11, Failures: 0, Errors: 0, Skipped: 3, Time elapsed: 1.9 sec
Running org.apache.bigtop.itest.TestContractJava
Tests run: 2, Failures: 0, Errors: 0, Skipped: 0, Time elapsed: 0.001 sec
Running org.apache.bigtop.itest.TestListUtilsTest
Tests run: 1, Failures: 0, Errors: 0, Skipped: 0, Time elapsed: 0.015 sec
Running org.apache.bigtop.itest.shell.ShellTest
Tests run: 2, Failures: 0, Errors: 0, Skipped: 1, Time elapsed: 0.023 sec
Running org.apache.bigtop.itest.JarContentTest
log4j:WARN No appenders could be found for logger (org.apache.bigtop.itest.JarContent).
log4j:WARN Please initialize the log4j system properly.
Tests run: 6, Failures: 0, Errors: 0, Skipped: 0, Time elapsed: 0.822 sec
Running org.apache.bigtop.itest.TestContractJavaProc
Tests run: 2, Failures: 0, Errors: 0, Skipped: 0, Time elapsed: 0.001 sec
Results :
Tests run: 41, Failures: 0, Errors: 0, Skipped: 5
[JENKINS] Recording test results
log4j:WARN No appenders could be found for logger (org.apache.commons.beanutils.converters.BooleanConverter).
log4j:WARN Please initialize the log4j system properly.
[INFO]
[INFO] --- maven-jar-plugin:2.2:jar (default-jar) @ itest-common ---
[INFO] Building jar: <https://builds.apache.org/job/Bigtop-trunk-iTest/org.apache.bigtop.itest$itest-common/ws/target/itest-common-0.9.0-SNAPSHOT.jar>
[INFO]
[INFO] --- maven-jar-plugin:2.2:test-jar (default) @ itest-common ---
[INFO] Building jar: <https://builds.apache.org/job/Bigtop-trunk-iTest/org.apache.bigtop.itest$itest-common/ws/target/itest-common-0.9.0-SNAPSHOT-tests.jar>
[INFO]
[INFO] --- maven-failsafe-plugin:2.17:verify (default) @ itest-common ---
[INFO] Failsafe report directory: <https://builds.apache.org/job/Bigtop-trunk-iTest/org.apache.bigtop.itest$itest-common/ws/target/failsafe-reports>
[WARNING] File encoding has not been set, using platform encoding ISO-8859-1, i.e. build is platform dependent!
[ERROR] There are test failures.
Please refer to <https://builds.apache.org/job/Bigtop-trunk-iTest/org.apache.bigtop.itest$itest-common/ws/target/failsafe-reports> for the individual test results.
[JENKINS] Recording test results
hudson.AbortException: Test reports were found but none of them are new. Did tests run?
For example, <https://builds.apache.org/job/Bigtop-trunk-iTest/org.apache.bigtop.itest$itest-common/ws/target/failsafe-reports/TEST-org.apache.bigtop.itest.failures.IntegrationTestClusterFailures.xml> is 1 day 13 hr old
at hudson.tasks.junit.TestResult.parse(TestResult.java:213)
at hudson.maven.reporters.SurefireArchiver.postExecute(SurefireArchiver.java:148)
at hudson.maven.Maven3Builder$MavenExecutionListener.recordMojoEnded(Maven3Builder.java:634)
at hudson.maven.Maven3Builder$MavenExecutionListener.mojoSucceeded(Maven3Builder.java:615)
at org.apache.maven.lifecycle.internal.DefaultExecutionEventCatapult.fire(DefaultExecutionEventCatapult.java:87)
at org.apache.maven.lifecycle.internal.DefaultExecutionEventCatapult.fire(DefaultExecutionEventCatapult.java:42)
at org.apache.maven.lifecycle.internal.MojoExecutor.execute(MojoExecutor.java:228)
at org.apache.maven.lifecycle.internal.MojoExecutor.execute(MojoExecutor.java:153)
at org.apache.maven.lifecycle.internal.MojoExecutor.execute(MojoExecutor.java:145)
at org.apache.maven.lifecycle.internal.LifecycleModuleBuilder.buildProject(LifecycleModuleBuilder.java:84)
at org.apache.maven.lifecycle.internal.LifecycleModuleBuilder.buildProject(LifecycleModuleBuilder.java:59)
at org.apache.maven.lifecycle.internal.LifecycleStarter.singleThreadedBuild(LifecycleStarter.java:183)
at org.apache.maven.lifecycle.internal.LifecycleStarter.execute(LifecycleStarter.java:161)
at org.apache.maven.DefaultMaven.doExecute(DefaultMaven.java:320)
at org.apache.maven.DefaultMaven.execute(DefaultMaven.java:156)
at org.jvnet.hudson.maven3.launcher.Maven3Launcher.main(Maven3Launcher.java:117)
at sun.reflect.NativeMethodAccessorImpl.invoke0(Native Method)
at sun.reflect.NativeMethodAccessorImpl.invoke(NativeMethodAccessorImpl.java:39)
at sun.reflect.DelegatingMethodAccessorImpl.invoke(DelegatingMethodAccessorImpl.java:25)
at java.lang.reflect.Method.invoke(Method.java:597)
at org.codehaus.plexus.classworlds.launcher.Launcher.launchStandard(Launcher.java:329)
at org.codehaus.plexus.classworlds.launcher.Launcher.launch(Launcher.java:239)
at org.jvnet.hudson.maven3.agent.Maven3Main.launch(Maven3Main.java:178)
at sun.reflect.NativeMethodAccessorImpl.invoke0(Native Method)
at sun.reflect.NativeMethodAccessorImpl.invoke(NativeMethodAccessorImpl.java:39)
at sun.reflect.DelegatingMethodAccessorImpl.invoke(DelegatingMethodAccessorImpl.java:25)
at java.lang.reflect.Method.invoke(Method.java:597)
at hudson.maven.Maven3Builder.call(Maven3Builder.java:136)
at hudson.maven.Maven3Builder.call(Maven3Builder.java:71)
at hudson.remoting.UserRequest.perform(UserRequest.java:118)
at hudson.remoting.UserRequest.perform(UserRequest.java:48)
at hudson.remoting.Request$2.run(Request.java:328)
at hudson.remoting.InterceptingExecutorService$1.call(InterceptingExecutorService.java:72)
at java.util.concurrent.FutureTask$Sync.innerRun(FutureTask.java:303)
at java.util.concurrent.FutureTask.run(FutureTask.java:138)
at java.util.concurrent.ThreadPoolExecutor$Worker.runTask(ThreadPoolExecutor.java:895)
at java.util.concurrent.ThreadPoolExecutor$Worker.run(ThreadPoolExecutor.java:918)
at java.lang.Thread.run(Thread.java:662)
[INFO]
[INFO] --- maven-install-plugin:2.3:install (default-install) @ itest-common ---
[INFO] Installing <https://builds.apache.org/job/Bigtop-trunk-iTest/org.apache.bigtop.itest$itest-common/ws/target/itest-common-0.9.0-SNAPSHOT.jar> to /home/jenkins/jenkins-slave/maven-repositories/0/org/apache/bigtop/itest/itest-common/0.9.0-SNAPSHOT/itest-common-0.9.0-SNAPSHOT.jar
[INFO] Installing <https://builds.apache.org/job/Bigtop-trunk-iTest/org.apache.bigtop.itest$itest-common/ws/pom.xml> to /home/jenkins/jenkins-slave/maven-repositories/0/org/apache/bigtop/itest/itest-common/0.9.0-SNAPSHOT/itest-common-0.9.0-SNAPSHOT.pom
[INFO] Installing <https://builds.apache.org/job/Bigtop-trunk-iTest/org.apache.bigtop.itest$itest-common/ws/target/itest-common-0.9.0-SNAPSHOT-tests.jar> to /home/jenkins/jenkins-slave/maven-repositories/0/org/apache/bigtop/itest/itest-common/0.9.0-SNAPSHOT/itest-common-0.9.0-SNAPSHOT-tests.jar
[INFO]
[INFO] --- maven-deploy-plugin:2.5:deploy (default-deploy) @ itest-common ---
Downloading: https://repository.apache.org/content/repositories/snapshots/org/apache/bigtop/itest/itest-common/0.9.0-SNAPSHOT/maven-metadata.xml
Downloaded: https://repository.apache.org/content/repositories/snapshots/org/apache/bigtop/itest/itest-common/0.9.0-SNAPSHOT/maven-metadata.xml (1005 B at 2.3 KB/sec)
Uploading: https://repository.apache.org/content/repositories/snapshots/org/apache/bigtop/itest/itest-common/0.9.0-SNAPSHOT/itest-common-0.9.0-20150128.041603-195.jar
Uploaded: https://repository.apache.org/content/repositories/snapshots/org/apache/bigtop/itest/itest-common/0.9.0-SNAPSHOT/itest-common-0.9.0-20150128.041603-195.jar (206 KB at 1108.3 KB/sec)
Uploading: https://repository.apache.org/content/repositories/snapshots/org/apache/bigtop/itest/itest-common/0.9.0-SNAPSHOT/itest-common-0.9.0-20150128.041603-195.pom
Uploaded: https://repository.apache.org/content/repositories/snapshots/org/apache/bigtop/itest/itest-common/0.9.0-SNAPSHOT/itest-common-0.9.0-20150128.041603-195.pom (6 KB at 29.8 KB/sec)
Downloading: https://repository.apache.org/content/repositories/snapshots/org/apache/bigtop/itest/itest-common/maven-metadata.xml
Downloaded: https://repository.apache.org/content/repositories/snapshots/org/apache/bigtop/itest/itest-common/maven-metadata.xml (466 B at 7.1 KB/sec)
Uploading: https://repository.apache.org/content/repositories/snapshots/org/apache/bigtop/itest/itest-common/0.9.0-SNAPSHOT/maven-metadata.xml
Uploaded: https://repository.apache.org/content/repositories/snapshots/org/apache/bigtop/itest/itest-common/0.9.0-SNAPSHOT/maven-metadata.xml (1005 B at 8.5 KB/sec)
Uploading: https://repository.apache.org/content/repositories/snapshots/org/apache/bigtop/itest/itest-common/maven-metadata.xml
Uploaded: https://repository.apache.org/content/repositories/snapshots/org/apache/bigtop/itest/itest-common/maven-metadata.xml (466 B at 3.3 KB/sec)
Uploading: https://repository.apache.org/content/repositories/snapshots/org/apache/bigtop/itest/itest-common/0.9.0-SNAPSHOT/itest-common-0.9.0-20150128.041603-195-tests.jar
Uploaded: https://repository.apache.org/content/repositories/snapshots/org/apache/bigtop/itest/itest-common/0.9.0-SNAPSHOT/itest-common-0.9.0-20150128.041603-195-tests.jar (70 KB at 379.5 KB/sec)
Uploading: https://repository.apache.org/content/repositories/snapshots/org/apache/bigtop/itest/itest-common/0.9.0-SNAPSHOT/maven-metadata.xml
Uploaded: https://repository.apache.org/content/repositories/snapshots/org/apache/bigtop/itest/itest-common/0.9.0-SNAPSHOT/maven-metadata.xml (1005 B at 6.8 KB/sec)
[INFO] ------------------------------------------------------------------------
[INFO] BUILD SUCCESS
[INFO] ------------------------------------------------------------------------
[INFO] Total time: 28.123s
[INFO] Finished at: Wed Jan 28 04:16:04 UTC 2015
[INFO] Final Memory: 16M/245M
[INFO] ------------------------------------------------------------------------
Waiting for Jenkins to finish collecting data
Build failed in Jenkins: Bigtop-trunk-iTest » iTest: system and integration testing in the cloud #1998
Posted by Apache Jenkins Server <je...@builds.apache.org>.
See <https://builds.apache.org/job/Bigtop-trunk-iTest/org.apache.bigtop.itest$itest-common/1998/>
------------------------------------------
maven3-agent.jar already up to date
maven3-interceptor.jar already up to date
maven3-interceptor-commons.jar already up to date
<===[JENKINS REMOTING CAPACITY]===> channel started
Executing Maven: -B -f <https://builds.apache.org/job/Bigtop-trunk-iTest/org.apache.bigtop.itest$itest-common/ws/pom.xml> -Dmaven.repo.local=/home/jenkins/jenkins-slave/maven-repositories/0 deploy
[INFO] Scanning for projects...
Downloading: http://repository.codehaus.org/org/codehaus/groovy/groovy-eclipse-batch/maven-metadata.xml
Downloaded: http://repository.codehaus.org/org/codehaus/groovy/groovy-eclipse-batch/maven-metadata.xml (2 KB at 3.4 KB/sec)
[INFO]
[INFO] ------------------------------------------------------------------------
[INFO] Building iTest: system and integration testing in the cloud 0.9.0-SNAPSHOT
[INFO] ------------------------------------------------------------------------
[INFO]
[INFO] --- groovy-eclipse-compiler:2.8.0-01:add-groovy-build-paths (default-add-groovy-build-paths) @ itest-common ---
[INFO] Adding /src/main/groovy to the list of source folders
[INFO] Adding /src/test/groovy to the list of test source folders
[INFO]
[INFO] --- maven-remote-resources-plugin:1.1:process (default) @ itest-common ---
[INFO] Setting property: classpath.resource.loader.class => 'org.codehaus.plexus.velocity.ContextClassLoaderResourceLoader'.
[INFO] Setting property: velocimacro.messages.on => 'false'.
[INFO] Setting property: resource.loader => 'classpath'.
[INFO] Setting property: resource.manager.logwhenfound => 'false'.
[INFO]
[INFO] --- maven-resources-plugin:2.4:resources (default-resources) @ itest-common ---
[INFO] Using 'UTF-8' encoding to copy filtered resources.
[INFO] skip non existing resourceDirectory <https://builds.apache.org/job/Bigtop-trunk-iTest/org.apache.bigtop.itest$itest-common/ws/src/main/resources>
[INFO] Copying 3 resources
[INFO]
[INFO] --- maven-compiler-plugin:3.1:compile (default-compile) @ itest-common ---
[INFO] Changes detected - recompiling the module!
[INFO] Using Groovy-Eclipse compiler to compile both Java and Groovy files
[INFO]
[INFO] --- maven-resources-plugin:2.4:testResources (default-testResources) @ itest-common ---
[INFO] Using 'UTF-8' encoding to copy filtered resources.
[INFO] skip non existing resourceDirectory <https://builds.apache.org/job/Bigtop-trunk-iTest/org.apache.bigtop.itest$itest-common/ws/src/test/resources>
[INFO] Copying 3 resources
[INFO]
[INFO] --- maven-compiler-plugin:3.1:testCompile (default-testCompile) @ itest-common ---
[INFO] Changes detected - recompiling the module!
[INFO] Using Groovy-Eclipse compiler to compile both Java and Groovy files
[INFO]
[INFO] --- maven-surefire-plugin:2.7:test (default-test) @ itest-common ---
[INFO] Surefire report directory: <https://builds.apache.org/job/Bigtop-trunk-iTest/org.apache.bigtop.itest$itest-common/ws/target/surefire-reports>
-------------------------------------------------------
T E S T S
-------------------------------------------------------
Running org.apache.bigtop.itest.TestContractJava
Tests run: 2, Failures: 0, Errors: 0, Skipped: 0, Time elapsed: 0.062 sec
Running org.apache.bigtop.itest.TestContractGroovy
Tests run: 2, Failures: 0, Errors: 0, Skipped: 0, Time elapsed: 0.392 sec
Running org.apache.bigtop.itest.posix.AlternativeTest
Tests run: 1, Failures: 0, Errors: 0, Skipped: 0, Time elapsed: 1.379 sec
Running org.apache.bigtop.itest.posix.UGITest
Tests run: 2, Failures: 0, Errors: 0, Skipped: 0, Time elapsed: 0.052 sec
Running org.apache.bigtop.itest.posix.ServiceTest
Status []
Tests run: 2, Failures: 0, Errors: 0, Skipped: 1, Time elapsed: 0.046 sec
Running org.apache.bigtop.itest.JUnitUtilsTest
Disclaimer: This test expected to show a failure in an embeded testcase
[junit] Running org.apache.bigtop.itest.DummyTestPassTests run: 1, Failures: 0, Errors: 0, Time elapsed: 0.286 secRunning org.apache.bigtop.itest.DummyTestFail
[junit] Tests run: 1, Failures: 1, Errors: 0, Time elapsed: 0.147 secTEST org.apache.bigtop.itest.DummyTestFail FAILED
[junit] Tests FAILED
Disclaimer: This test expected to show an error in an embeded testcase
[junit] Running org.apache.bigtop.itest.DummyTestError
[junit] Tests run: 1, Failures: 0, Errors: 1, Time elapsed: 0.294 sec
[junit] Test org.apache.bigtop.itest.DummyTestError FAILED
[junit] Running org.apache.bigtop.itest.DummyTestPass
[junit] Tests run: 1, Failures: 0, Errors: 0, Time elapsed: 0.275 sec
[junit] Running org.apache.bigtop.itest.DummyTestPass
[junit] Tests run: 1, Failures: 0, Errors: 0, Time elapsed: 0.278 sec
Tests run: 4, Failures: 0, Errors: 0, Skipped: 0, Time elapsed: 4.549 sec
Running org.apache.bigtop.itest.TestListUtilsTest
Tests run: 1, Failures: 0, Errors: 0, Skipped: 0, Time elapsed: 0.017 sec
Running org.apache.bigtop.itest.JarContentTest
log4j:WARN No appenders could be found for logger (org.apache.bigtop.itest.JarContent).
log4j:WARN Please initialize the log4j system properly.
Tests run: 6, Failures: 0, Errors: 0, Skipped: 0, Time elapsed: 1.057 sec
Running org.apache.bigtop.itest.TestContractJavaProc
Tests run: 2, Failures: 0, Errors: 0, Skipped: 0, Time elapsed: 0.002 sec
Running org.apache.bigtop.itest.shell.ShellTest
Tests run: 2, Failures: 0, Errors: 0, Skipped: 1, Time elapsed: 0.009 sec
Running org.apache.bigtop.itest.junit.OrderedParameterizedTest
Tests run: 3, Failures: 0, Errors: 0, Skipped: 0, Time elapsed: 0.035 sec
Running org.apache.bigtop.itest.junit.OrderedTest
Tests run: 3, Failures: 0, Errors: 0, Skipped: 0, Time elapsed: 0.006 sec
Running org.apache.bigtop.itest.pmanager.PackageManagerTest
/etc/cron.monthly/.placeholder
/etc/cron.hourly/.placeholder
/etc/default/cron
/etc/cron.weekly/.placeholder
/etc/cron.d/.placeholder
/etc/cron.daily/.placeholder
/etc/pam.d/cron
/etc/init/cron.conf
/etc/crontab
/.
/etc
/etc/cron.monthly
/etc/cron.monthly/.placeholder
/etc/cron.hourly
/etc/cron.hourly/.placeholder
/etc/default
/etc/default/cron
/etc/cron.weekly
/etc/cron.weekly/.placeholder
/etc/cron.d
/etc/cron.d/.placeholder
/etc/cron.daily
/etc/cron.daily/.placeholder
/etc/pam.d
/etc/pam.d/cron
/etc/init
/etc/init/cron.conf
/etc/init.d
/etc/crontab
/usr
/usr/share
/usr/share/bug
/usr/share/bug/cron
/usr/share/bug/cron/script
/usr/share/bug/cron/control
/usr/share/man
/usr/share/man/man1
/usr/share/man/man1/crontab.1.gz
/usr/share/man/man5
/usr/share/man/man5/crontab.5.gz
/usr/share/man/man8
/usr/share/man/man8/cron.8.gz
/usr/share/doc
/usr/share/doc/cron
/usr/share/doc/cron/README
/usr/share/doc/cron/README.anacron
/usr/share/doc/cron/README.Debian
/usr/share/doc/cron/FEATURES
/usr/share/doc/cron/copyright
/usr/share/doc/cron/examples
/usr/share/doc/cron/examples/crontab2english.pl
/usr/share/doc/cron/examples/cron-stats.pl
/usr/share/doc/cron/examples/cron-tasks-review.sh
/usr/share/doc/cron/NEWS.Debian.gz
/usr/share/doc/cron/changelog.Debian.gz
/usr/share/doc/cron/THANKS
/usr/share/doc/cron/TODO.Debian
/usr/sbin
/usr/sbin/cron
/usr/bin
/usr/bin/crontab
/var
/var/spool
/var/spool/cron
/var/spool/cron/crontabs
/etc/init.d/cron
Tests run: 11, Failures: 0, Errors: 0, Skipped: 3, Time elapsed: 3.469 sec
Results :
Tests run: 41, Failures: 0, Errors: 0, Skipped: 5
[JENKINS] Recording test results
log4j:WARN No appenders could be found for logger (org.apache.commons.beanutils.converters.BooleanConverter).
log4j:WARN Please initialize the log4j system properly.
[INFO]
[INFO] --- maven-jar-plugin:2.2:jar (default-jar) @ itest-common ---
[INFO] Building jar: <https://builds.apache.org/job/Bigtop-trunk-iTest/org.apache.bigtop.itest$itest-common/ws/target/itest-common-0.9.0-SNAPSHOT.jar>
[INFO]
[INFO] --- maven-jar-plugin:2.2:test-jar (default) @ itest-common ---
[INFO] Building jar: <https://builds.apache.org/job/Bigtop-trunk-iTest/org.apache.bigtop.itest$itest-common/ws/target/itest-common-0.9.0-SNAPSHOT-tests.jar>
[INFO]
[INFO] --- maven-failsafe-plugin:2.17:verify (default) @ itest-common ---
[INFO] Failsafe report directory: <https://builds.apache.org/job/Bigtop-trunk-iTest/org.apache.bigtop.itest$itest-common/ws/target/failsafe-reports>
[WARNING] File encoding has not been set, using platform encoding ISO-8859-1, i.e. build is platform dependent!
[ERROR] There are test failures.
Please refer to <https://builds.apache.org/job/Bigtop-trunk-iTest/org.apache.bigtop.itest$itest-common/ws/target/failsafe-reports> for the individual test results.
[JENKINS] Recording test results
hudson.AbortException: Test reports were found but none of them are new. Did tests run?
For example, <https://builds.apache.org/job/Bigtop-trunk-iTest/org.apache.bigtop.itest$itest-common/ws/target/failsafe-reports/TEST-org.apache.bigtop.itest.failures.IntegrationTestClusterFailures.xml> is 1 day 13 hr old
at hudson.tasks.junit.TestResult.parse(TestResult.java:213)
at hudson.maven.reporters.SurefireArchiver.postExecute(SurefireArchiver.java:148)
at hudson.maven.Maven3Builder$MavenExecutionListener.recordMojoEnded(Maven3Builder.java:634)
at hudson.maven.Maven3Builder$MavenExecutionListener.mojoSucceeded(Maven3Builder.java:615)
at org.apache.maven.lifecycle.internal.DefaultExecutionEventCatapult.fire(DefaultExecutionEventCatapult.java:87)
at org.apache.maven.lifecycle.internal.DefaultExecutionEventCatapult.fire(DefaultExecutionEventCatapult.java:42)
at org.apache.maven.lifecycle.internal.MojoExecutor.execute(MojoExecutor.java:228)
at org.apache.maven.lifecycle.internal.MojoExecutor.execute(MojoExecutor.java:153)
at org.apache.maven.lifecycle.internal.MojoExecutor.execute(MojoExecutor.java:145)
at org.apache.maven.lifecycle.internal.LifecycleModuleBuilder.buildProject(LifecycleModuleBuilder.java:84)
at org.apache.maven.lifecycle.internal.LifecycleModuleBuilder.buildProject(LifecycleModuleBuilder.java:59)
at org.apache.maven.lifecycle.internal.LifecycleStarter.singleThreadedBuild(LifecycleStarter.java:183)
at org.apache.maven.lifecycle.internal.LifecycleStarter.execute(LifecycleStarter.java:161)
at org.apache.maven.DefaultMaven.doExecute(DefaultMaven.java:320)
at org.apache.maven.DefaultMaven.execute(DefaultMaven.java:156)
at org.jvnet.hudson.maven3.launcher.Maven3Launcher.main(Maven3Launcher.java:117)
at sun.reflect.NativeMethodAccessorImpl.invoke0(Native Method)
at sun.reflect.NativeMethodAccessorImpl.invoke(NativeMethodAccessorImpl.java:39)
at sun.reflect.DelegatingMethodAccessorImpl.invoke(DelegatingMethodAccessorImpl.java:25)
at java.lang.reflect.Method.invoke(Method.java:597)
at org.codehaus.plexus.classworlds.launcher.Launcher.launchStandard(Launcher.java:329)
at org.codehaus.plexus.classworlds.launcher.Launcher.launch(Launcher.java:239)
at org.jvnet.hudson.maven3.agent.Maven3Main.launch(Maven3Main.java:178)
at sun.reflect.NativeMethodAccessorImpl.invoke0(Native Method)
at sun.reflect.NativeMethodAccessorImpl.invoke(NativeMethodAccessorImpl.java:39)
at sun.reflect.DelegatingMethodAccessorImpl.invoke(DelegatingMethodAccessorImpl.java:25)
at java.lang.reflect.Method.invoke(Method.java:597)
at hudson.maven.Maven3Builder.call(Maven3Builder.java:136)
at hudson.maven.Maven3Builder.call(Maven3Builder.java:71)
at hudson.remoting.UserRequest.perform(UserRequest.java:118)
at hudson.remoting.UserRequest.perform(UserRequest.java:48)
at hudson.remoting.Request$2.run(Request.java:328)
at hudson.remoting.InterceptingExecutorService$1.call(InterceptingExecutorService.java:72)
at java.util.concurrent.FutureTask$Sync.innerRun(FutureTask.java:303)
at java.util.concurrent.FutureTask.run(FutureTask.java:138)
at java.util.concurrent.ThreadPoolExecutor$Worker.runTask(ThreadPoolExecutor.java:895)
at java.util.concurrent.ThreadPoolExecutor$Worker.run(ThreadPoolExecutor.java:918)
at java.lang.Thread.run(Thread.java:662)
[INFO]
[INFO] --- maven-install-plugin:2.3:install (default-install) @ itest-common ---
[INFO] Installing <https://builds.apache.org/job/Bigtop-trunk-iTest/org.apache.bigtop.itest$itest-common/ws/target/itest-common-0.9.0-SNAPSHOT.jar> to /home/jenkins/jenkins-slave/maven-repositories/0/org/apache/bigtop/itest/itest-common/0.9.0-SNAPSHOT/itest-common-0.9.0-SNAPSHOT.jar
[INFO] Installing <https://builds.apache.org/job/Bigtop-trunk-iTest/org.apache.bigtop.itest$itest-common/ws/pom.xml> to /home/jenkins/jenkins-slave/maven-repositories/0/org/apache/bigtop/itest/itest-common/0.9.0-SNAPSHOT/itest-common-0.9.0-SNAPSHOT.pom
[INFO] Installing <https://builds.apache.org/job/Bigtop-trunk-iTest/org.apache.bigtop.itest$itest-common/ws/target/itest-common-0.9.0-SNAPSHOT-tests.jar> to /home/jenkins/jenkins-slave/maven-repositories/0/org/apache/bigtop/itest/itest-common/0.9.0-SNAPSHOT/itest-common-0.9.0-SNAPSHOT-tests.jar
[INFO]
[INFO] --- maven-deploy-plugin:2.5:deploy (default-deploy) @ itest-common ---
Downloading: https://repository.apache.org/content/repositories/snapshots/org/apache/bigtop/itest/itest-common/0.9.0-SNAPSHOT/maven-metadata.xml
Downloaded: https://repository.apache.org/content/repositories/snapshots/org/apache/bigtop/itest/itest-common/0.9.0-SNAPSHOT/maven-metadata.xml (1005 B at 0.8 KB/sec)
Uploading: https://repository.apache.org/content/repositories/snapshots/org/apache/bigtop/itest/itest-common/0.9.0-SNAPSHOT/itest-common-0.9.0-20150128.041345-194.jar
Uploaded: https://repository.apache.org/content/repositories/snapshots/org/apache/bigtop/itest/itest-common/0.9.0-SNAPSHOT/itest-common-0.9.0-20150128.041345-194.jar (206 KB at 953.7 KB/sec)
Uploading: https://repository.apache.org/content/repositories/snapshots/org/apache/bigtop/itest/itest-common/0.9.0-SNAPSHOT/itest-common-0.9.0-20150128.041345-194.pom
Uploaded: https://repository.apache.org/content/repositories/snapshots/org/apache/bigtop/itest/itest-common/0.9.0-SNAPSHOT/itest-common-0.9.0-20150128.041345-194.pom (6 KB at 27.8 KB/sec)
Downloading: https://repository.apache.org/content/repositories/snapshots/org/apache/bigtop/itest/itest-common/maven-metadata.xml
Downloaded: https://repository.apache.org/content/repositories/snapshots/org/apache/bigtop/itest/itest-common/maven-metadata.xml (466 B at 2.7 KB/sec)
Uploading: https://repository.apache.org/content/repositories/snapshots/org/apache/bigtop/itest/itest-common/0.9.0-SNAPSHOT/maven-metadata.xml
Uploaded: https://repository.apache.org/content/repositories/snapshots/org/apache/bigtop/itest/itest-common/0.9.0-SNAPSHOT/maven-metadata.xml (1005 B at 8.0 KB/sec)
Uploading: https://repository.apache.org/content/repositories/snapshots/org/apache/bigtop/itest/itest-common/maven-metadata.xml
Uploaded: https://repository.apache.org/content/repositories/snapshots/org/apache/bigtop/itest/itest-common/maven-metadata.xml (466 B at 3.0 KB/sec)
Uploading: https://repository.apache.org/content/repositories/snapshots/org/apache/bigtop/itest/itest-common/0.9.0-SNAPSHOT/itest-common-0.9.0-20150128.041345-194-tests.jar
Uploaded: https://repository.apache.org/content/repositories/snapshots/org/apache/bigtop/itest/itest-common/0.9.0-SNAPSHOT/itest-common-0.9.0-20150128.041345-194-tests.jar (70 KB at 410.9 KB/sec)
Uploading: https://repository.apache.org/content/repositories/snapshots/org/apache/bigtop/itest/itest-common/0.9.0-SNAPSHOT/maven-metadata.xml
Uploaded: https://repository.apache.org/content/repositories/snapshots/org/apache/bigtop/itest/itest-common/0.9.0-SNAPSHOT/maven-metadata.xml (1005 B at 7.4 KB/sec)
[INFO] ------------------------------------------------------------------------
[INFO] BUILD SUCCESS
[INFO] ------------------------------------------------------------------------
[INFO] Total time: 30.458s
[INFO] Finished at: Wed Jan 28 04:13:47 UTC 2015
[INFO] Final Memory: 16M/245M
[INFO] ------------------------------------------------------------------------
Waiting for Jenkins to finish collecting data
Build failed in Jenkins: Bigtop-trunk-iTest » iTest: system and integration testing in the cloud #1997
Posted by Apache Jenkins Server <je...@builds.apache.org>.
See <https://builds.apache.org/job/Bigtop-trunk-iTest/org.apache.bigtop.itest$itest-common/1997/>
------------------------------------------
maven3-agent.jar already up to date
maven3-interceptor.jar already up to date
maven3-interceptor-commons.jar already up to date
<===[JENKINS REMOTING CAPACITY]===> channel started
Executing Maven: -B -f <https://builds.apache.org/job/Bigtop-trunk-iTest/org.apache.bigtop.itest$itest-common/ws/pom.xml> -Dmaven.repo.local=/home/jenkins/jenkins-slave/maven-repositories/0 deploy
[INFO] Scanning for projects...
Downloading: http://repository.codehaus.org/org/codehaus/groovy/groovy-eclipse-batch/maven-metadata.xml
Downloaded: http://repository.codehaus.org/org/codehaus/groovy/groovy-eclipse-batch/maven-metadata.xml (2 KB at 3.3 KB/sec)
[INFO]
[INFO] ------------------------------------------------------------------------
[INFO] Building iTest: system and integration testing in the cloud 0.9.0-SNAPSHOT
[INFO] ------------------------------------------------------------------------
[INFO]
[INFO] --- groovy-eclipse-compiler:2.8.0-01:add-groovy-build-paths (default-add-groovy-build-paths) @ itest-common ---
[INFO] Adding /src/main/groovy to the list of source folders
[INFO] Adding /src/test/groovy to the list of test source folders
[INFO]
[INFO] --- maven-remote-resources-plugin:1.1:process (default) @ itest-common ---
[INFO] Setting property: classpath.resource.loader.class => 'org.codehaus.plexus.velocity.ContextClassLoaderResourceLoader'.
[INFO] Setting property: velocimacro.messages.on => 'false'.
[INFO] Setting property: resource.loader => 'classpath'.
[INFO] Setting property: resource.manager.logwhenfound => 'false'.
[INFO]
[INFO] --- maven-resources-plugin:2.4:resources (default-resources) @ itest-common ---
[INFO] Using 'UTF-8' encoding to copy filtered resources.
[INFO] skip non existing resourceDirectory <https://builds.apache.org/job/Bigtop-trunk-iTest/org.apache.bigtop.itest$itest-common/ws/src/main/resources>
[INFO] Copying 3 resources
[INFO]
[INFO] --- maven-compiler-plugin:3.1:compile (default-compile) @ itest-common ---
[INFO] Changes detected - recompiling the module!
[INFO] Using Groovy-Eclipse compiler to compile both Java and Groovy files
[INFO]
[INFO] --- maven-resources-plugin:2.4:testResources (default-testResources) @ itest-common ---
[INFO] Using 'UTF-8' encoding to copy filtered resources.
[INFO] skip non existing resourceDirectory <https://builds.apache.org/job/Bigtop-trunk-iTest/org.apache.bigtop.itest$itest-common/ws/src/test/resources>
[INFO] Copying 3 resources
[INFO]
[INFO] --- maven-compiler-plugin:3.1:testCompile (default-testCompile) @ itest-common ---
[INFO] Changes detected - recompiling the module!
[INFO] Using Groovy-Eclipse compiler to compile both Java and Groovy files
[INFO]
[INFO] --- maven-surefire-plugin:2.7:test (default-test) @ itest-common ---
[INFO] Surefire report directory: <https://builds.apache.org/job/Bigtop-trunk-iTest/org.apache.bigtop.itest$itest-common/ws/target/surefire-reports>
-------------------------------------------------------
T E S T S
-------------------------------------------------------
Running org.apache.bigtop.itest.TestContractJava
Tests run: 2, Failures: 0, Errors: 0, Skipped: 0, Time elapsed: 0.044 sec
Running org.apache.bigtop.itest.TestContractGroovy
Tests run: 2, Failures: 0, Errors: 0, Skipped: 0, Time elapsed: 0.467 sec
Running org.apache.bigtop.itest.posix.AlternativeTest
Tests run: 1, Failures: 0, Errors: 0, Skipped: 0, Time elapsed: 2.315 sec
Running org.apache.bigtop.itest.posix.UGITest
Tests run: 2, Failures: 0, Errors: 0, Skipped: 0, Time elapsed: 0.056 sec
Running org.apache.bigtop.itest.posix.ServiceTest
Status []
Tests run: 2, Failures: 0, Errors: 0, Skipped: 1, Time elapsed: 0.151 sec
Running org.apache.bigtop.itest.JUnitUtilsTest
Disclaimer: This test expected to show a failure in an embeded testcase
[junit] Running org.apache.bigtop.itest.DummyTestPassTests run: 1, Failures: 0, Errors: 0, Time elapsed: 0.275 secRunning org.apache.bigtop.itest.DummyTestFail
[junit] Tests run: 1, Failures: 1, Errors: 0, Time elapsed: 0.14 secTEST org.apache.bigtop.itest.DummyTestFail FAILED
[junit] Tests FAILED
Disclaimer: This test expected to show an error in an embeded testcase
[junit] Running org.apache.bigtop.itest.DummyTestError
[junit] Tests run: 1, Failures: 0, Errors: 1, Time elapsed: 0.289 sec
[junit] Test org.apache.bigtop.itest.DummyTestError FAILED
[junit] Running org.apache.bigtop.itest.DummyTestPass
[junit] Tests run: 1, Failures: 0, Errors: 0, Time elapsed: 0.283 sec
[junit] Running org.apache.bigtop.itest.DummyTestPass
[junit] Tests run: 1, Failures: 0, Errors: 0, Time elapsed: 0.343 sec
Tests run: 4, Failures: 0, Errors: 0, Skipped: 0, Time elapsed: 4.621 sec
Running org.apache.bigtop.itest.TestListUtilsTest
Tests run: 1, Failures: 0, Errors: 0, Skipped: 0, Time elapsed: 0.018 sec
Running org.apache.bigtop.itest.JarContentTest
log4j:WARN No appenders could be found for logger (org.apache.bigtop.itest.JarContent).
log4j:WARN Please initialize the log4j system properly.
Tests run: 6, Failures: 0, Errors: 0, Skipped: 0, Time elapsed: 1.105 sec
Running org.apache.bigtop.itest.TestContractJavaProc
Tests run: 2, Failures: 0, Errors: 0, Skipped: 0, Time elapsed: 0.002 sec
Running org.apache.bigtop.itest.shell.ShellTest
Tests run: 2, Failures: 0, Errors: 0, Skipped: 1, Time elapsed: 0.047 sec
Running org.apache.bigtop.itest.junit.OrderedParameterizedTest
Tests run: 3, Failures: 0, Errors: 0, Skipped: 0, Time elapsed: 0.037 sec
Running org.apache.bigtop.itest.junit.OrderedTest
Tests run: 3, Failures: 0, Errors: 0, Skipped: 0, Time elapsed: 0.007 sec
Running org.apache.bigtop.itest.pmanager.PackageManagerTest
/etc/cron.monthly/.placeholder
/etc/cron.hourly/.placeholder
/etc/default/cron
/etc/cron.weekly/.placeholder
/etc/cron.d/.placeholder
/etc/cron.daily/.placeholder
/etc/pam.d/cron
/etc/init/cron.conf
/etc/crontab
/.
/etc
/etc/cron.monthly
/etc/cron.monthly/.placeholder
/etc/cron.hourly
/etc/cron.hourly/.placeholder
/etc/default
/etc/default/cron
/etc/cron.weekly
/etc/cron.weekly/.placeholder
/etc/cron.d
/etc/cron.d/.placeholder
/etc/cron.daily
/etc/cron.daily/.placeholder
/etc/pam.d
/etc/pam.d/cron
/etc/init
/etc/init/cron.conf
/etc/init.d
/etc/crontab
/usr
/usr/share
/usr/share/bug
/usr/share/bug/cron
/usr/share/bug/cron/script
/usr/share/bug/cron/control
/usr/share/man
/usr/share/man/man1
/usr/share/man/man1/crontab.1.gz
/usr/share/man/man5
/usr/share/man/man5/crontab.5.gz
/usr/share/man/man8
/usr/share/man/man8/cron.8.gz
/usr/share/doc
/usr/share/doc/cron
/usr/share/doc/cron/README
/usr/share/doc/cron/README.anacron
/usr/share/doc/cron/README.Debian
/usr/share/doc/cron/FEATURES
/usr/share/doc/cron/copyright
/usr/share/doc/cron/examples
/usr/share/doc/cron/examples/crontab2english.pl
/usr/share/doc/cron/examples/cron-stats.pl
/usr/share/doc/cron/examples/cron-tasks-review.sh
/usr/share/doc/cron/NEWS.Debian.gz
/usr/share/doc/cron/changelog.Debian.gz
/usr/share/doc/cron/THANKS
/usr/share/doc/cron/TODO.Debian
/usr/sbin
/usr/sbin/cron
/usr/bin
/usr/bin/crontab
/var
/var/spool
/var/spool/cron
/var/spool/cron/crontabs
/etc/init.d/cron
Tests run: 11, Failures: 0, Errors: 0, Skipped: 3, Time elapsed: 3.288 sec
Results :
Tests run: 41, Failures: 0, Errors: 0, Skipped: 5
[JENKINS] Recording test results
log4j:WARN No appenders could be found for logger (org.apache.commons.beanutils.converters.BooleanConverter).
log4j:WARN Please initialize the log4j system properly.
[INFO]
[INFO] --- maven-jar-plugin:2.2:jar (default-jar) @ itest-common ---
[INFO] Building jar: <https://builds.apache.org/job/Bigtop-trunk-iTest/org.apache.bigtop.itest$itest-common/ws/target/itest-common-0.9.0-SNAPSHOT.jar>
[INFO]
[INFO] --- maven-jar-plugin:2.2:test-jar (default) @ itest-common ---
[INFO] Building jar: <https://builds.apache.org/job/Bigtop-trunk-iTest/org.apache.bigtop.itest$itest-common/ws/target/itest-common-0.9.0-SNAPSHOT-tests.jar>
[INFO]
[INFO] --- maven-failsafe-plugin:2.17:verify (default) @ itest-common ---
[INFO] Failsafe report directory: <https://builds.apache.org/job/Bigtop-trunk-iTest/org.apache.bigtop.itest$itest-common/ws/target/failsafe-reports>
[WARNING] File encoding has not been set, using platform encoding ISO-8859-1, i.e. build is platform dependent!
[ERROR] There are test failures.
Please refer to <https://builds.apache.org/job/Bigtop-trunk-iTest/org.apache.bigtop.itest$itest-common/ws/target/failsafe-reports> for the individual test results.
[JENKINS] Recording test results
hudson.AbortException: Test reports were found but none of them are new. Did tests run?
For example, <https://builds.apache.org/job/Bigtop-trunk-iTest/org.apache.bigtop.itest$itest-common/ws/target/failsafe-reports/TEST-org.apache.bigtop.itest.failures.IntegrationTestClusterFailures.xml> is 1 day 0 hr old
at hudson.tasks.junit.TestResult.parse(TestResult.java:213)
at hudson.maven.reporters.SurefireArchiver.postExecute(SurefireArchiver.java:148)
at hudson.maven.Maven3Builder$MavenExecutionListener.recordMojoEnded(Maven3Builder.java:634)
at hudson.maven.Maven3Builder$MavenExecutionListener.mojoSucceeded(Maven3Builder.java:615)
at org.apache.maven.lifecycle.internal.DefaultExecutionEventCatapult.fire(DefaultExecutionEventCatapult.java:87)
at org.apache.maven.lifecycle.internal.DefaultExecutionEventCatapult.fire(DefaultExecutionEventCatapult.java:42)
at org.apache.maven.lifecycle.internal.MojoExecutor.execute(MojoExecutor.java:228)
at org.apache.maven.lifecycle.internal.MojoExecutor.execute(MojoExecutor.java:153)
at org.apache.maven.lifecycle.internal.MojoExecutor.execute(MojoExecutor.java:145)
at org.apache.maven.lifecycle.internal.LifecycleModuleBuilder.buildProject(LifecycleModuleBuilder.java:84)
at org.apache.maven.lifecycle.internal.LifecycleModuleBuilder.buildProject(LifecycleModuleBuilder.java:59)
at org.apache.maven.lifecycle.internal.LifecycleStarter.singleThreadedBuild(LifecycleStarter.java:183)
at org.apache.maven.lifecycle.internal.LifecycleStarter.execute(LifecycleStarter.java:161)
at org.apache.maven.DefaultMaven.doExecute(DefaultMaven.java:320)
at org.apache.maven.DefaultMaven.execute(DefaultMaven.java:156)
at org.jvnet.hudson.maven3.launcher.Maven3Launcher.main(Maven3Launcher.java:117)
at sun.reflect.NativeMethodAccessorImpl.invoke0(Native Method)
at sun.reflect.NativeMethodAccessorImpl.invoke(NativeMethodAccessorImpl.java:39)
at sun.reflect.DelegatingMethodAccessorImpl.invoke(DelegatingMethodAccessorImpl.java:25)
at java.lang.reflect.Method.invoke(Method.java:597)
at org.codehaus.plexus.classworlds.launcher.Launcher.launchStandard(Launcher.java:329)
at org.codehaus.plexus.classworlds.launcher.Launcher.launch(Launcher.java:239)
at org.jvnet.hudson.maven3.agent.Maven3Main.launch(Maven3Main.java:178)
at sun.reflect.NativeMethodAccessorImpl.invoke0(Native Method)
at sun.reflect.NativeMethodAccessorImpl.invoke(NativeMethodAccessorImpl.java:39)
at sun.reflect.DelegatingMethodAccessorImpl.invoke(DelegatingMethodAccessorImpl.java:25)
at java.lang.reflect.Method.invoke(Method.java:597)
at hudson.maven.Maven3Builder.call(Maven3Builder.java:136)
at hudson.maven.Maven3Builder.call(Maven3Builder.java:71)
at hudson.remoting.UserRequest.perform(UserRequest.java:118)
at hudson.remoting.UserRequest.perform(UserRequest.java:48)
at hudson.remoting.Request$2.run(Request.java:328)
at hudson.remoting.InterceptingExecutorService$1.call(InterceptingExecutorService.java:72)
at java.util.concurrent.FutureTask$Sync.innerRun(FutureTask.java:303)
at java.util.concurrent.FutureTask.run(FutureTask.java:138)
at java.util.concurrent.ThreadPoolExecutor$Worker.runTask(ThreadPoolExecutor.java:895)
at java.util.concurrent.ThreadPoolExecutor$Worker.run(ThreadPoolExecutor.java:918)
at java.lang.Thread.run(Thread.java:662)
[INFO]
[INFO] --- maven-install-plugin:2.3:install (default-install) @ itest-common ---
[INFO] Installing <https://builds.apache.org/job/Bigtop-trunk-iTest/org.apache.bigtop.itest$itest-common/ws/target/itest-common-0.9.0-SNAPSHOT.jar> to /home/jenkins/jenkins-slave/maven-repositories/0/org/apache/bigtop/itest/itest-common/0.9.0-SNAPSHOT/itest-common-0.9.0-SNAPSHOT.jar
[INFO] Installing <https://builds.apache.org/job/Bigtop-trunk-iTest/org.apache.bigtop.itest$itest-common/ws/pom.xml> to /home/jenkins/jenkins-slave/maven-repositories/0/org/apache/bigtop/itest/itest-common/0.9.0-SNAPSHOT/itest-common-0.9.0-SNAPSHOT.pom
[INFO] Installing <https://builds.apache.org/job/Bigtop-trunk-iTest/org.apache.bigtop.itest$itest-common/ws/target/itest-common-0.9.0-SNAPSHOT-tests.jar> to /home/jenkins/jenkins-slave/maven-repositories/0/org/apache/bigtop/itest/itest-common/0.9.0-SNAPSHOT/itest-common-0.9.0-SNAPSHOT-tests.jar
[INFO]
[INFO] --- maven-deploy-plugin:2.5:deploy (default-deploy) @ itest-common ---
Downloading: https://repository.apache.org/content/repositories/snapshots/org/apache/bigtop/itest/itest-common/0.9.0-SNAPSHOT/maven-metadata.xml
Downloaded: https://repository.apache.org/content/repositories/snapshots/org/apache/bigtop/itest/itest-common/0.9.0-SNAPSHOT/maven-metadata.xml (1005 B at 0.9 KB/sec)
Uploading: https://repository.apache.org/content/repositories/snapshots/org/apache/bigtop/itest/itest-common/0.9.0-SNAPSHOT/itest-common-0.9.0-20150127.144629-193.jar
Uploaded: https://repository.apache.org/content/repositories/snapshots/org/apache/bigtop/itest/itest-common/0.9.0-SNAPSHOT/itest-common-0.9.0-20150127.144629-193.jar (206 KB at 419.3 KB/sec)
Uploading: https://repository.apache.org/content/repositories/snapshots/org/apache/bigtop/itest/itest-common/0.9.0-SNAPSHOT/itest-common-0.9.0-20150127.144629-193.pom
Uploaded: https://repository.apache.org/content/repositories/snapshots/org/apache/bigtop/itest/itest-common/0.9.0-SNAPSHOT/itest-common-0.9.0-20150127.144629-193.pom (6 KB at 33.4 KB/sec)
Downloading: https://repository.apache.org/content/repositories/snapshots/org/apache/bigtop/itest/itest-common/maven-metadata.xml
Downloaded: https://repository.apache.org/content/repositories/snapshots/org/apache/bigtop/itest/itest-common/maven-metadata.xml (466 B at 7.6 KB/sec)
Uploading: https://repository.apache.org/content/repositories/snapshots/org/apache/bigtop/itest/itest-common/0.9.0-SNAPSHOT/maven-metadata.xml
Uploaded: https://repository.apache.org/content/repositories/snapshots/org/apache/bigtop/itest/itest-common/0.9.0-SNAPSHOT/maven-metadata.xml (1005 B at 8.5 KB/sec)
Uploading: https://repository.apache.org/content/repositories/snapshots/org/apache/bigtop/itest/itest-common/maven-metadata.xml
Uploaded: https://repository.apache.org/content/repositories/snapshots/org/apache/bigtop/itest/itest-common/maven-metadata.xml (466 B at 3.5 KB/sec)
Uploading: https://repository.apache.org/content/repositories/snapshots/org/apache/bigtop/itest/itest-common/0.9.0-SNAPSHOT/itest-common-0.9.0-20150127.144629-193-tests.jar
Uploaded: https://repository.apache.org/content/repositories/snapshots/org/apache/bigtop/itest/itest-common/0.9.0-SNAPSHOT/itest-common-0.9.0-20150127.144629-193-tests.jar (70 KB at 110.4 KB/sec)
Uploading: https://repository.apache.org/content/repositories/snapshots/org/apache/bigtop/itest/itest-common/0.9.0-SNAPSHOT/maven-metadata.xml
Uploaded: https://repository.apache.org/content/repositories/snapshots/org/apache/bigtop/itest/itest-common/0.9.0-SNAPSHOT/maven-metadata.xml (1005 B at 6.8 KB/sec)
[INFO] ------------------------------------------------------------------------
[INFO] BUILD SUCCESS
[INFO] ------------------------------------------------------------------------
[INFO] Total time: 31.688s
[INFO] Finished at: Tue Jan 27 14:46:32 UTC 2015
[INFO] Final Memory: 16M/245M
[INFO] ------------------------------------------------------------------------
Waiting for Jenkins to finish collecting data
Build failed in Jenkins: Bigtop-trunk-iTest » iTest: system and integration testing in the cloud #1996
Posted by Apache Jenkins Server <je...@builds.apache.org>.
See <https://builds.apache.org/job/Bigtop-trunk-iTest/org.apache.bigtop.itest$itest-common/1996/>
------------------------------------------
maven3-agent.jar already up to date
maven3-interceptor.jar already up to date
maven3-interceptor-commons.jar already up to date
<===[JENKINS REMOTING CAPACITY]===> channel started
Executing Maven: -B -f <https://builds.apache.org/job/Bigtop-trunk-iTest/org.apache.bigtop.itest$itest-common/ws/pom.xml> -Dmaven.repo.local=/home/jenkins/jenkins-slave/maven-repositories/0 deploy
[INFO] Scanning for projects...
[INFO]
[INFO] ------------------------------------------------------------------------
[INFO] Building iTest: system and integration testing in the cloud 0.9.0-SNAPSHOT
[INFO] ------------------------------------------------------------------------
[INFO]
[INFO] --- groovy-eclipse-compiler:2.8.0-01:add-groovy-build-paths (default-add-groovy-build-paths) @ itest-common ---
[INFO] Adding /src/main/groovy to the list of source folders
[INFO] Adding /src/test/groovy to the list of test source folders
[INFO]
[INFO] --- maven-remote-resources-plugin:1.1:process (default) @ itest-common ---
[INFO] Setting property: classpath.resource.loader.class => 'org.codehaus.plexus.velocity.ContextClassLoaderResourceLoader'.
[INFO] Setting property: velocimacro.messages.on => 'false'.
[INFO] Setting property: resource.loader => 'classpath'.
[INFO] Setting property: resource.manager.logwhenfound => 'false'.
[INFO]
[INFO] --- maven-resources-plugin:2.4:resources (default-resources) @ itest-common ---
[INFO] Using 'UTF-8' encoding to copy filtered resources.
[INFO] skip non existing resourceDirectory <https://builds.apache.org/job/Bigtop-trunk-iTest/org.apache.bigtop.itest$itest-common/ws/src/main/resources>
[INFO] Copying 3 resources
[INFO]
[INFO] --- maven-compiler-plugin:3.1:compile (default-compile) @ itest-common ---
[INFO] Changes detected - recompiling the module!
[INFO] Using Groovy-Eclipse compiler to compile both Java and Groovy files
[INFO]
[INFO] --- maven-resources-plugin:2.4:testResources (default-testResources) @ itest-common ---
[INFO] Using 'UTF-8' encoding to copy filtered resources.
[INFO] skip non existing resourceDirectory <https://builds.apache.org/job/Bigtop-trunk-iTest/org.apache.bigtop.itest$itest-common/ws/src/test/resources>
[INFO] Copying 3 resources
[INFO]
[INFO] --- maven-compiler-plugin:3.1:testCompile (default-testCompile) @ itest-common ---
[INFO] Changes detected - recompiling the module!
[INFO] Using Groovy-Eclipse compiler to compile both Java and Groovy files
[INFO]
[INFO] --- maven-surefire-plugin:2.7:test (default-test) @ itest-common ---
[INFO] Surefire report directory: <https://builds.apache.org/job/Bigtop-trunk-iTest/org.apache.bigtop.itest$itest-common/ws/target/surefire-reports>
-------------------------------------------------------
T E S T S
-------------------------------------------------------
Running org.apache.bigtop.itest.JUnitUtilsTest
Disclaimer: This test expected to show a failure in an embeded testcase
[junit] Running org.apache.bigtop.itest.DummyTestPassTests run: 1, Failures: 0, Errors: 0, Time elapsed: 0.281 secRunning org.apache.bigtop.itest.DummyTestFail
[junit] Tests run: 1, Failures: 1, Errors: 0, Time elapsed: 0.143 secTEST org.apache.bigtop.itest.DummyTestFail FAILED
[junit] Tests FAILED
Disclaimer: This test expected to show an error in an embeded testcase
[junit] Running org.apache.bigtop.itest.DummyTestErrorTests run: 1, Failures: 0, Errors: 1, Time elapsed: 0.293 sec
[junit] Test org.apache.bigtop.itest.DummyTestError FAILED
[junit] Running org.apache.bigtop.itest.DummyTestPass
[junit] Tests run: 1, Failures: 0, Errors: 0, Time elapsed: 0.279 sec
[junit] Running org.apache.bigtop.itest.DummyTestPass
[junit] Tests run: 1, Failures: 0, Errors: 0, Time elapsed: 0.275 sec
Tests run: 4, Failures: 0, Errors: 0, Skipped: 0, Time elapsed: 4.984 sec
Running org.apache.bigtop.itest.junit.OrderedParameterizedTest
Tests run: 3, Failures: 0, Errors: 0, Skipped: 0, Time elapsed: 0.052 sec
Running org.apache.bigtop.itest.junit.OrderedTest
Tests run: 3, Failures: 0, Errors: 0, Skipped: 0, Time elapsed: 0.008 sec
Running org.apache.bigtop.itest.posix.UGITest
Tests run: 2, Failures: 0, Errors: 0, Skipped: 0, Time elapsed: 0.075 sec
Running org.apache.bigtop.itest.posix.ServiceTest
Status []
Tests run: 2, Failures: 0, Errors: 0, Skipped: 1, Time elapsed: 0.106 sec
Running org.apache.bigtop.itest.posix.AlternativeTest
Tests run: 1, Failures: 0, Errors: 0, Skipped: 0, Time elapsed: 1.193 sec
Running org.apache.bigtop.itest.TestContractGroovy
Tests run: 2, Failures: 0, Errors: 0, Skipped: 0, Time elapsed: 0.01 sec
Running org.apache.bigtop.itest.pmanager.PackageManagerTest
/etc/cron.monthly/.placeholder
/etc/cron.hourly/.placeholder
/etc/default/cron
/etc/cron.weekly/.placeholder
/etc/cron.d/.placeholder
/etc/cron.daily/.placeholder
/etc/pam.d/cron
/etc/init/cron.conf
/etc/crontab
/.
/etc
/etc/cron.monthly
/etc/cron.monthly/.placeholder
/etc/cron.hourly
/etc/cron.hourly/.placeholder
/etc/default
/etc/default/cron
/etc/cron.weekly
/etc/cron.weekly/.placeholder
/etc/cron.d
/etc/cron.d/.placeholder
/etc/cron.daily
/etc/cron.daily/.placeholder
/etc/pam.d
/etc/pam.d/cron
/etc/init
/etc/init/cron.conf
/etc/init.d
/etc/crontab
/usr
/usr/share
/usr/share/bug
/usr/share/bug/cron
/usr/share/bug/cron/script
/usr/share/bug/cron/control
/usr/share/man
/usr/share/man/man1
/usr/share/man/man1/crontab.1.gz
/usr/share/man/man5
/usr/share/man/man5/crontab.5.gz
/usr/share/man/man8
/usr/share/man/man8/cron.8.gz
/usr/share/doc
/usr/share/doc/cron
/usr/share/doc/cron/README
/usr/share/doc/cron/README.anacron
/usr/share/doc/cron/README.Debian
/usr/share/doc/cron/FEATURES
/usr/share/doc/cron/copyright
/usr/share/doc/cron/examples
/usr/share/doc/cron/examples/crontab2english.pl
/usr/share/doc/cron/examples/cron-stats.pl
/usr/share/doc/cron/examples/cron-tasks-review.sh
/usr/share/doc/cron/NEWS.Debian.gz
/usr/share/doc/cron/changelog.Debian.gz
/usr/share/doc/cron/THANKS
/usr/share/doc/cron/TODO.Debian
/usr/sbin
/usr/sbin/cron
/usr/bin
/usr/bin/crontab
/var
/var/spool
/var/spool/cron
/var/spool/cron/crontabs
/etc/init.d/cron
Tests run: 11, Failures: 0, Errors: 0, Skipped: 3, Time elapsed: 1.67 sec
Running org.apache.bigtop.itest.TestContractJava
Tests run: 2, Failures: 0, Errors: 0, Skipped: 0, Time elapsed: 0.002 sec
Running org.apache.bigtop.itest.TestListUtilsTest
Tests run: 1, Failures: 0, Errors: 0, Skipped: 0, Time elapsed: 0.016 sec
Running org.apache.bigtop.itest.shell.ShellTest
Tests run: 2, Failures: 0, Errors: 0, Skipped: 1, Time elapsed: 0.008 sec
Running org.apache.bigtop.itest.JarContentTest
log4j:WARN No appenders could be found for logger (org.apache.bigtop.itest.JarContent).
log4j:WARN Please initialize the log4j system properly.
Tests run: 6, Failures: 0, Errors: 0, Skipped: 0, Time elapsed: 0.695 sec
Running org.apache.bigtop.itest.TestContractJavaProc
Tests run: 2, Failures: 0, Errors: 0, Skipped: 0, Time elapsed: 0.001 sec
Results :
Tests run: 41, Failures: 0, Errors: 0, Skipped: 5
[JENKINS] Recording test results
log4j:WARN No appenders could be found for logger (org.apache.commons.beanutils.converters.BooleanConverter).
log4j:WARN Please initialize the log4j system properly.
[INFO]
[INFO] --- maven-jar-plugin:2.2:jar (default-jar) @ itest-common ---
[INFO] Building jar: <https://builds.apache.org/job/Bigtop-trunk-iTest/org.apache.bigtop.itest$itest-common/ws/target/itest-common-0.9.0-SNAPSHOT.jar>
[INFO]
[INFO] --- maven-jar-plugin:2.2:test-jar (default) @ itest-common ---
[INFO] Building jar: <https://builds.apache.org/job/Bigtop-trunk-iTest/org.apache.bigtop.itest$itest-common/ws/target/itest-common-0.9.0-SNAPSHOT-tests.jar>
[INFO]
[INFO] --- maven-failsafe-plugin:2.17:verify (default) @ itest-common ---
[INFO] Failsafe report directory: <https://builds.apache.org/job/Bigtop-trunk-iTest/org.apache.bigtop.itest$itest-common/ws/target/failsafe-reports>
[WARNING] File encoding has not been set, using platform encoding ISO-8859-1, i.e. build is platform dependent!
[ERROR] There are test failures.
Please refer to <https://builds.apache.org/job/Bigtop-trunk-iTest/org.apache.bigtop.itest$itest-common/ws/target/failsafe-reports> for the individual test results.
[JENKINS] Recording test results
hudson.AbortException: Test reports were found but none of them are new. Did tests run?
For example, <https://builds.apache.org/job/Bigtop-trunk-iTest/org.apache.bigtop.itest$itest-common/ws/target/failsafe-reports/TEST-org.apache.bigtop.itest.failures.IntegrationTestClusterFailures.xml> is 1 day 0 hr old
at hudson.tasks.junit.TestResult.parse(TestResult.java:213)
at hudson.maven.reporters.SurefireArchiver.postExecute(SurefireArchiver.java:148)
at hudson.maven.Maven3Builder$MavenExecutionListener.recordMojoEnded(Maven3Builder.java:634)
at hudson.maven.Maven3Builder$MavenExecutionListener.mojoSucceeded(Maven3Builder.java:615)
at org.apache.maven.lifecycle.internal.DefaultExecutionEventCatapult.fire(DefaultExecutionEventCatapult.java:87)
at org.apache.maven.lifecycle.internal.DefaultExecutionEventCatapult.fire(DefaultExecutionEventCatapult.java:42)
at org.apache.maven.lifecycle.internal.MojoExecutor.execute(MojoExecutor.java:228)
at org.apache.maven.lifecycle.internal.MojoExecutor.execute(MojoExecutor.java:153)
at org.apache.maven.lifecycle.internal.MojoExecutor.execute(MojoExecutor.java:145)
at org.apache.maven.lifecycle.internal.LifecycleModuleBuilder.buildProject(LifecycleModuleBuilder.java:84)
at org.apache.maven.lifecycle.internal.LifecycleModuleBuilder.buildProject(LifecycleModuleBuilder.java:59)
at org.apache.maven.lifecycle.internal.LifecycleStarter.singleThreadedBuild(LifecycleStarter.java:183)
at org.apache.maven.lifecycle.internal.LifecycleStarter.execute(LifecycleStarter.java:161)
at org.apache.maven.DefaultMaven.doExecute(DefaultMaven.java:320)
at org.apache.maven.DefaultMaven.execute(DefaultMaven.java:156)
at org.jvnet.hudson.maven3.launcher.Maven3Launcher.main(Maven3Launcher.java:117)
at sun.reflect.NativeMethodAccessorImpl.invoke0(Native Method)
at sun.reflect.NativeMethodAccessorImpl.invoke(NativeMethodAccessorImpl.java:39)
at sun.reflect.DelegatingMethodAccessorImpl.invoke(DelegatingMethodAccessorImpl.java:25)
at java.lang.reflect.Method.invoke(Method.java:597)
at org.codehaus.plexus.classworlds.launcher.Launcher.launchStandard(Launcher.java:329)
at org.codehaus.plexus.classworlds.launcher.Launcher.launch(Launcher.java:239)
at org.jvnet.hudson.maven3.agent.Maven3Main.launch(Maven3Main.java:178)
at sun.reflect.NativeMethodAccessorImpl.invoke0(Native Method)
at sun.reflect.NativeMethodAccessorImpl.invoke(NativeMethodAccessorImpl.java:39)
at sun.reflect.DelegatingMethodAccessorImpl.invoke(DelegatingMethodAccessorImpl.java:25)
at java.lang.reflect.Method.invoke(Method.java:597)
at hudson.maven.Maven3Builder.call(Maven3Builder.java:136)
at hudson.maven.Maven3Builder.call(Maven3Builder.java:71)
at hudson.remoting.UserRequest.perform(UserRequest.java:118)
at hudson.remoting.UserRequest.perform(UserRequest.java:48)
at hudson.remoting.Request$2.run(Request.java:328)
at hudson.remoting.InterceptingExecutorService$1.call(InterceptingExecutorService.java:72)
at java.util.concurrent.FutureTask$Sync.innerRun(FutureTask.java:303)
at java.util.concurrent.FutureTask.run(FutureTask.java:138)
at java.util.concurrent.ThreadPoolExecutor$Worker.runTask(ThreadPoolExecutor.java:895)
at java.util.concurrent.ThreadPoolExecutor$Worker.run(ThreadPoolExecutor.java:918)
at java.lang.Thread.run(Thread.java:662)
[INFO]
[INFO] --- maven-install-plugin:2.3:install (default-install) @ itest-common ---
[INFO] Installing <https://builds.apache.org/job/Bigtop-trunk-iTest/org.apache.bigtop.itest$itest-common/ws/target/itest-common-0.9.0-SNAPSHOT.jar> to /home/jenkins/jenkins-slave/maven-repositories/0/org/apache/bigtop/itest/itest-common/0.9.0-SNAPSHOT/itest-common-0.9.0-SNAPSHOT.jar
[INFO] Installing <https://builds.apache.org/job/Bigtop-trunk-iTest/org.apache.bigtop.itest$itest-common/ws/pom.xml> to /home/jenkins/jenkins-slave/maven-repositories/0/org/apache/bigtop/itest/itest-common/0.9.0-SNAPSHOT/itest-common-0.9.0-SNAPSHOT.pom
[INFO] Installing <https://builds.apache.org/job/Bigtop-trunk-iTest/org.apache.bigtop.itest$itest-common/ws/target/itest-common-0.9.0-SNAPSHOT-tests.jar> to /home/jenkins/jenkins-slave/maven-repositories/0/org/apache/bigtop/itest/itest-common/0.9.0-SNAPSHOT/itest-common-0.9.0-SNAPSHOT-tests.jar
[INFO]
[INFO] --- maven-deploy-plugin:2.5:deploy (default-deploy) @ itest-common ---
Downloading: https://repository.apache.org/content/repositories/snapshots/org/apache/bigtop/itest/itest-common/0.9.0-SNAPSHOT/maven-metadata.xml
Downloaded: https://repository.apache.org/content/repositories/snapshots/org/apache/bigtop/itest/itest-common/0.9.0-SNAPSHOT/maven-metadata.xml (1005 B at 0.8 KB/sec)
Uploading: https://repository.apache.org/content/repositories/snapshots/org/apache/bigtop/itest/itest-common/0.9.0-SNAPSHOT/itest-common-0.9.0-20150127.144339-192.jar
Uploaded: https://repository.apache.org/content/repositories/snapshots/org/apache/bigtop/itest/itest-common/0.9.0-SNAPSHOT/itest-common-0.9.0-20150127.144339-192.jar (206 KB at 865.2 KB/sec)
Uploading: https://repository.apache.org/content/repositories/snapshots/org/apache/bigtop/itest/itest-common/0.9.0-SNAPSHOT/itest-common-0.9.0-20150127.144339-192.pom
Uploaded: https://repository.apache.org/content/repositories/snapshots/org/apache/bigtop/itest/itest-common/0.9.0-SNAPSHOT/itest-common-0.9.0-20150127.144339-192.pom (6 KB at 24.9 KB/sec)
Downloading: https://repository.apache.org/content/repositories/snapshots/org/apache/bigtop/itest/itest-common/maven-metadata.xml
Downloaded: https://repository.apache.org/content/repositories/snapshots/org/apache/bigtop/itest/itest-common/maven-metadata.xml (466 B at 5.6 KB/sec)
Uploading: https://repository.apache.org/content/repositories/snapshots/org/apache/bigtop/itest/itest-common/0.9.0-SNAPSHOT/maven-metadata.xml
Uploaded: https://repository.apache.org/content/repositories/snapshots/org/apache/bigtop/itest/itest-common/0.9.0-SNAPSHOT/maven-metadata.xml (1005 B at 8.5 KB/sec)
Uploading: https://repository.apache.org/content/repositories/snapshots/org/apache/bigtop/itest/itest-common/maven-metadata.xml
Uploaded: https://repository.apache.org/content/repositories/snapshots/org/apache/bigtop/itest/itest-common/maven-metadata.xml (466 B at 3.3 KB/sec)
Uploading: https://repository.apache.org/content/repositories/snapshots/org/apache/bigtop/itest/itest-common/0.9.0-SNAPSHOT/itest-common-0.9.0-20150127.144339-192-tests.jar
Uploaded: https://repository.apache.org/content/repositories/snapshots/org/apache/bigtop/itest/itest-common/0.9.0-SNAPSHOT/itest-common-0.9.0-20150127.144339-192-tests.jar (70 KB at 385.8 KB/sec)
Uploading: https://repository.apache.org/content/repositories/snapshots/org/apache/bigtop/itest/itest-common/0.9.0-SNAPSHOT/maven-metadata.xml
Uploaded: https://repository.apache.org/content/repositories/snapshots/org/apache/bigtop/itest/itest-common/0.9.0-SNAPSHOT/maven-metadata.xml (1005 B at 7.0 KB/sec)
[INFO] ------------------------------------------------------------------------
[INFO] BUILD SUCCESS
[INFO] ------------------------------------------------------------------------
[INFO] Total time: 26.446s
[INFO] Finished at: Tue Jan 27 14:43:41 UTC 2015
[INFO] Final Memory: 17M/307M
[INFO] ------------------------------------------------------------------------
Waiting for Jenkins to finish collecting data
Build failed in Jenkins: Bigtop-trunk-iTest » iTest: system and integration testing in the cloud #1995
Posted by Apache Jenkins Server <je...@builds.apache.org>.
See <https://builds.apache.org/job/Bigtop-trunk-iTest/org.apache.bigtop.itest$itest-common/1995/>
------------------------------------------
maven3-agent.jar already up to date
maven3-interceptor.jar already up to date
maven3-interceptor-commons.jar already up to date
<===[JENKINS REMOTING CAPACITY]===> channel started
Executing Maven: -B -f <https://builds.apache.org/job/Bigtop-trunk-iTest/org.apache.bigtop.itest$itest-common/ws/pom.xml> -Dmaven.repo.local=/home/jenkins/jenkins-slave/maven-repositories/0 deploy
[INFO] Scanning for projects...
[INFO]
[INFO] ------------------------------------------------------------------------
[INFO] Building iTest: system and integration testing in the cloud 0.9.0-SNAPSHOT
[INFO] ------------------------------------------------------------------------
[INFO]
[INFO] --- groovy-eclipse-compiler:2.8.0-01:add-groovy-build-paths (default-add-groovy-build-paths) @ itest-common ---
[INFO] Adding /src/main/groovy to the list of source folders
[INFO] Adding /src/test/groovy to the list of test source folders
[INFO]
[INFO] --- maven-remote-resources-plugin:1.1:process (default) @ itest-common ---
[INFO] Setting property: classpath.resource.loader.class => 'org.codehaus.plexus.velocity.ContextClassLoaderResourceLoader'.
[INFO] Setting property: velocimacro.messages.on => 'false'.
[INFO] Setting property: resource.loader => 'classpath'.
[INFO] Setting property: resource.manager.logwhenfound => 'false'.
[INFO]
[INFO] --- maven-resources-plugin:2.4:resources (default-resources) @ itest-common ---
[INFO] Using 'UTF-8' encoding to copy filtered resources.
[INFO] skip non existing resourceDirectory <https://builds.apache.org/job/Bigtop-trunk-iTest/org.apache.bigtop.itest$itest-common/ws/src/main/resources>
[INFO] Copying 3 resources
[INFO]
[INFO] --- maven-compiler-plugin:3.1:compile (default-compile) @ itest-common ---
[INFO] Changes detected - recompiling the module!
[INFO] Using Groovy-Eclipse compiler to compile both Java and Groovy files
[INFO]
[INFO] --- maven-resources-plugin:2.4:testResources (default-testResources) @ itest-common ---
[INFO] Using 'UTF-8' encoding to copy filtered resources.
[INFO] skip non existing resourceDirectory <https://builds.apache.org/job/Bigtop-trunk-iTest/org.apache.bigtop.itest$itest-common/ws/src/test/resources>
[INFO] Copying 3 resources
[INFO]
[INFO] --- maven-compiler-plugin:3.1:testCompile (default-testCompile) @ itest-common ---
[INFO] Changes detected - recompiling the module!
[INFO] Using Groovy-Eclipse compiler to compile both Java and Groovy files
[INFO]
[INFO] --- maven-surefire-plugin:2.7:test (default-test) @ itest-common ---
[INFO] Surefire report directory: <https://builds.apache.org/job/Bigtop-trunk-iTest/org.apache.bigtop.itest$itest-common/ws/target/surefire-reports>
-------------------------------------------------------
T E S T S
-------------------------------------------------------
Running org.apache.bigtop.itest.JUnitUtilsTest
Disclaimer: This test expected to show a failure in an embeded testcase
[junit] Running org.apache.bigtop.itest.DummyTestPassTests run: 1, Failures: 0, Errors: 0, Time elapsed: 0.274 secRunning org.apache.bigtop.itest.DummyTestFail
[junit] Tests run: 1, Failures: 1, Errors: 0, Time elapsed: 0.14 secTEST org.apache.bigtop.itest.DummyTestFail FAILED
[junit] Tests FAILED
Disclaimer: This test expected to show an error in an embeded testcase
[junit] Running org.apache.bigtop.itest.DummyTestError
[junit] Tests run: 1, Failures: 0, Errors: 1, Time elapsed: 0.288 sec
[junit] Test org.apache.bigtop.itest.DummyTestError FAILED
[junit] Running org.apache.bigtop.itest.DummyTestPass
[junit] Tests run: 1, Failures: 0, Errors: 0, Time elapsed: 0.274 sec
[junit] Running org.apache.bigtop.itest.DummyTestPass
[junit] Tests run: 1, Failures: 0, Errors: 0, Time elapsed: 0.274 sec
Tests run: 4, Failures: 0, Errors: 0, Skipped: 0, Time elapsed: 4.956 sec
Running org.apache.bigtop.itest.junit.OrderedParameterizedTest
Tests run: 3, Failures: 0, Errors: 0, Skipped: 0, Time elapsed: 0.05 sec
Running org.apache.bigtop.itest.junit.OrderedTest
Tests run: 3, Failures: 0, Errors: 0, Skipped: 0, Time elapsed: 0.008 sec
Running org.apache.bigtop.itest.posix.UGITest
Tests run: 2, Failures: 0, Errors: 0, Skipped: 0, Time elapsed: 0.074 sec
Running org.apache.bigtop.itest.posix.ServiceTest
Status []
Tests run: 2, Failures: 0, Errors: 0, Skipped: 1, Time elapsed: 0.105 sec
Running org.apache.bigtop.itest.posix.AlternativeTest
Tests run: 1, Failures: 0, Errors: 0, Skipped: 0, Time elapsed: 1.233 sec
Running org.apache.bigtop.itest.TestContractGroovy
Tests run: 2, Failures: 0, Errors: 0, Skipped: 0, Time elapsed: 0.011 sec
Running org.apache.bigtop.itest.pmanager.PackageManagerTest
/etc/cron.monthly/.placeholder
/etc/cron.hourly/.placeholder
/etc/default/cron
/etc/cron.weekly/.placeholder
/etc/cron.d/.placeholder
/etc/cron.daily/.placeholder
/etc/pam.d/cron
/etc/init/cron.conf
/etc/crontab
/.
/etc
/etc/cron.monthly
/etc/cron.monthly/.placeholder
/etc/cron.hourly
/etc/cron.hourly/.placeholder
/etc/default
/etc/default/cron
/etc/cron.weekly
/etc/cron.weekly/.placeholder
/etc/cron.d
/etc/cron.d/.placeholder
/etc/cron.daily
/etc/cron.daily/.placeholder
/etc/pam.d
/etc/pam.d/cron
/etc/init
/etc/init/cron.conf
/etc/init.d
/etc/crontab
/usr
/usr/share
/usr/share/bug
/usr/share/bug/cron
/usr/share/bug/cron/script
/usr/share/bug/cron/control
/usr/share/man
/usr/share/man/man1
/usr/share/man/man1/crontab.1.gz
/usr/share/man/man5
/usr/share/man/man5/crontab.5.gz
/usr/share/man/man8
/usr/share/man/man8/cron.8.gz
/usr/share/doc
/usr/share/doc/cron
/usr/share/doc/cron/README
/usr/share/doc/cron/README.anacron
/usr/share/doc/cron/README.Debian
/usr/share/doc/cron/FEATURES
/usr/share/doc/cron/copyright
/usr/share/doc/cron/examples
/usr/share/doc/cron/examples/crontab2english.pl
/usr/share/doc/cron/examples/cron-stats.pl
/usr/share/doc/cron/examples/cron-tasks-review.sh
/usr/share/doc/cron/NEWS.Debian.gz
/usr/share/doc/cron/changelog.Debian.gz
/usr/share/doc/cron/THANKS
/usr/share/doc/cron/TODO.Debian
/usr/sbin
/usr/sbin/cron
/usr/bin
/usr/bin/crontab
/var
/var/spool
/var/spool/cron
/var/spool/cron/crontabs
/etc/init.d/cron
Tests run: 11, Failures: 0, Errors: 0, Skipped: 3, Time elapsed: 1.738 sec
Running org.apache.bigtop.itest.TestContractJava
Tests run: 2, Failures: 0, Errors: 0, Skipped: 0, Time elapsed: 0.001 sec
Running org.apache.bigtop.itest.TestListUtilsTest
Tests run: 1, Failures: 0, Errors: 0, Skipped: 0, Time elapsed: 0.015 sec
Running org.apache.bigtop.itest.shell.ShellTest
Tests run: 2, Failures: 0, Errors: 0, Skipped: 1, Time elapsed: 0.007 sec
Running org.apache.bigtop.itest.JarContentTest
log4j:WARN No appenders could be found for logger (org.apache.bigtop.itest.JarContent).
log4j:WARN Please initialize the log4j system properly.
Tests run: 6, Failures: 0, Errors: 0, Skipped: 0, Time elapsed: 0.856 sec
Running org.apache.bigtop.itest.TestContractJavaProc
Tests run: 2, Failures: 0, Errors: 0, Skipped: 0, Time elapsed: 0.001 sec
Results :
Tests run: 41, Failures: 0, Errors: 0, Skipped: 5
[JENKINS] Recording test results
log4j:WARN No appenders could be found for logger (org.apache.commons.beanutils.converters.BooleanConverter).
log4j:WARN Please initialize the log4j system properly.
[INFO]
[INFO] --- maven-jar-plugin:2.2:jar (default-jar) @ itest-common ---
[INFO] Building jar: <https://builds.apache.org/job/Bigtop-trunk-iTest/org.apache.bigtop.itest$itest-common/ws/target/itest-common-0.9.0-SNAPSHOT.jar>
[INFO]
[INFO] --- maven-jar-plugin:2.2:test-jar (default) @ itest-common ---
[INFO] Building jar: <https://builds.apache.org/job/Bigtop-trunk-iTest/org.apache.bigtop.itest$itest-common/ws/target/itest-common-0.9.0-SNAPSHOT-tests.jar>
[INFO]
[INFO] --- maven-failsafe-plugin:2.17:verify (default) @ itest-common ---
[INFO] Failsafe report directory: <https://builds.apache.org/job/Bigtop-trunk-iTest/org.apache.bigtop.itest$itest-common/ws/target/failsafe-reports>
[WARNING] File encoding has not been set, using platform encoding ISO-8859-1, i.e. build is platform dependent!
[ERROR] There are test failures.
Please refer to <https://builds.apache.org/job/Bigtop-trunk-iTest/org.apache.bigtop.itest$itest-common/ws/target/failsafe-reports> for the individual test results.
[JENKINS] Recording test results
hudson.AbortException: Test reports were found but none of them are new. Did tests run?
For example, <https://builds.apache.org/job/Bigtop-trunk-iTest/org.apache.bigtop.itest$itest-common/ws/target/failsafe-reports/TEST-org.apache.bigtop.itest.failures.IntegrationTestClusterFailures.xml> is 23 hr old
at hudson.tasks.junit.TestResult.parse(TestResult.java:213)
at hudson.maven.reporters.SurefireArchiver.postExecute(SurefireArchiver.java:148)
at hudson.maven.Maven3Builder$MavenExecutionListener.recordMojoEnded(Maven3Builder.java:634)
at hudson.maven.Maven3Builder$MavenExecutionListener.mojoSucceeded(Maven3Builder.java:615)
at org.apache.maven.lifecycle.internal.DefaultExecutionEventCatapult.fire(DefaultExecutionEventCatapult.java:87)
at org.apache.maven.lifecycle.internal.DefaultExecutionEventCatapult.fire(DefaultExecutionEventCatapult.java:42)
at org.apache.maven.lifecycle.internal.MojoExecutor.execute(MojoExecutor.java:228)
at org.apache.maven.lifecycle.internal.MojoExecutor.execute(MojoExecutor.java:153)
at org.apache.maven.lifecycle.internal.MojoExecutor.execute(MojoExecutor.java:145)
at org.apache.maven.lifecycle.internal.LifecycleModuleBuilder.buildProject(LifecycleModuleBuilder.java:84)
at org.apache.maven.lifecycle.internal.LifecycleModuleBuilder.buildProject(LifecycleModuleBuilder.java:59)
at org.apache.maven.lifecycle.internal.LifecycleStarter.singleThreadedBuild(LifecycleStarter.java:183)
at org.apache.maven.lifecycle.internal.LifecycleStarter.execute(LifecycleStarter.java:161)
at org.apache.maven.DefaultMaven.doExecute(DefaultMaven.java:320)
at org.apache.maven.DefaultMaven.execute(DefaultMaven.java:156)
at org.jvnet.hudson.maven3.launcher.Maven3Launcher.main(Maven3Launcher.java:117)
at sun.reflect.NativeMethodAccessorImpl.invoke0(Native Method)
at sun.reflect.NativeMethodAccessorImpl.invoke(NativeMethodAccessorImpl.java:39)
at sun.reflect.DelegatingMethodAccessorImpl.invoke(DelegatingMethodAccessorImpl.java:25)
at java.lang.reflect.Method.invoke(Method.java:597)
at org.codehaus.plexus.classworlds.launcher.Launcher.launchStandard(Launcher.java:329)
at org.codehaus.plexus.classworlds.launcher.Launcher.launch(Launcher.java:239)
at org.jvnet.hudson.maven3.agent.Maven3Main.launch(Maven3Main.java:178)
at sun.reflect.NativeMethodAccessorImpl.invoke0(Native Method)
at sun.reflect.NativeMethodAccessorImpl.invoke(NativeMethodAccessorImpl.java:39)
at sun.reflect.DelegatingMethodAccessorImpl.invoke(DelegatingMethodAccessorImpl.java:25)
at java.lang.reflect.Method.invoke(Method.java:597)
at hudson.maven.Maven3Builder.call(Maven3Builder.java:136)
at hudson.maven.Maven3Builder.call(Maven3Builder.java:71)
at hudson.remoting.UserRequest.perform(UserRequest.java:118)
at hudson.remoting.UserRequest.perform(UserRequest.java:48)
at hudson.remoting.Request$2.run(Request.java:328)
at hudson.remoting.InterceptingExecutorService$1.call(InterceptingExecutorService.java:72)
at java.util.concurrent.FutureTask$Sync.innerRun(FutureTask.java:303)
at java.util.concurrent.FutureTask.run(FutureTask.java:138)
at java.util.concurrent.ThreadPoolExecutor$Worker.runTask(ThreadPoolExecutor.java:895)
at java.util.concurrent.ThreadPoolExecutor$Worker.run(ThreadPoolExecutor.java:918)
at java.lang.Thread.run(Thread.java:662)
[INFO]
[INFO] --- maven-install-plugin:2.3:install (default-install) @ itest-common ---
[INFO] Installing <https://builds.apache.org/job/Bigtop-trunk-iTest/org.apache.bigtop.itest$itest-common/ws/target/itest-common-0.9.0-SNAPSHOT.jar> to /home/jenkins/jenkins-slave/maven-repositories/0/org/apache/bigtop/itest/itest-common/0.9.0-SNAPSHOT/itest-common-0.9.0-SNAPSHOT.jar
[INFO] Installing <https://builds.apache.org/job/Bigtop-trunk-iTest/org.apache.bigtop.itest$itest-common/ws/pom.xml> to /home/jenkins/jenkins-slave/maven-repositories/0/org/apache/bigtop/itest/itest-common/0.9.0-SNAPSHOT/itest-common-0.9.0-SNAPSHOT.pom
[INFO] Installing <https://builds.apache.org/job/Bigtop-trunk-iTest/org.apache.bigtop.itest$itest-common/ws/target/itest-common-0.9.0-SNAPSHOT-tests.jar> to /home/jenkins/jenkins-slave/maven-repositories/0/org/apache/bigtop/itest/itest-common/0.9.0-SNAPSHOT/itest-common-0.9.0-SNAPSHOT-tests.jar
[INFO]
[INFO] --- maven-deploy-plugin:2.5:deploy (default-deploy) @ itest-common ---
Downloading: https://repository.apache.org/content/repositories/snapshots/org/apache/bigtop/itest/itest-common/0.9.0-SNAPSHOT/maven-metadata.xml
Downloaded: https://repository.apache.org/content/repositories/snapshots/org/apache/bigtop/itest/itest-common/0.9.0-SNAPSHOT/maven-metadata.xml (1005 B at 0.1 KB/sec)
Uploading: https://repository.apache.org/content/repositories/snapshots/org/apache/bigtop/itest/itest-common/0.9.0-SNAPSHOT/itest-common-0.9.0-20150127.140114-191.jar
Uploaded: https://repository.apache.org/content/repositories/snapshots/org/apache/bigtop/itest/itest-common/0.9.0-SNAPSHOT/itest-common-0.9.0-20150127.140114-191.jar (206 KB at 985.8 KB/sec)
Uploading: https://repository.apache.org/content/repositories/snapshots/org/apache/bigtop/itest/itest-common/0.9.0-SNAPSHOT/itest-common-0.9.0-20150127.140114-191.pom
Uploaded: https://repository.apache.org/content/repositories/snapshots/org/apache/bigtop/itest/itest-common/0.9.0-SNAPSHOT/itest-common-0.9.0-20150127.140114-191.pom (6 KB at 33.1 KB/sec)
Downloading: https://repository.apache.org/content/repositories/snapshots/org/apache/bigtop/itest/itest-common/maven-metadata.xml
Downloaded: https://repository.apache.org/content/repositories/snapshots/org/apache/bigtop/itest/itest-common/maven-metadata.xml (466 B at 6.9 KB/sec)
Uploading: https://repository.apache.org/content/repositories/snapshots/org/apache/bigtop/itest/itest-common/0.9.0-SNAPSHOT/maven-metadata.xml
Uploaded: https://repository.apache.org/content/repositories/snapshots/org/apache/bigtop/itest/itest-common/0.9.0-SNAPSHOT/maven-metadata.xml (1005 B at 8.4 KB/sec)
Uploading: https://repository.apache.org/content/repositories/snapshots/org/apache/bigtop/itest/itest-common/maven-metadata.xml
Uploaded: https://repository.apache.org/content/repositories/snapshots/org/apache/bigtop/itest/itest-common/maven-metadata.xml (466 B at 3.3 KB/sec)
Uploading: https://repository.apache.org/content/repositories/snapshots/org/apache/bigtop/itest/itest-common/0.9.0-SNAPSHOT/itest-common-0.9.0-20150127.140114-191-tests.jar
Uploaded: https://repository.apache.org/content/repositories/snapshots/org/apache/bigtop/itest/itest-common/0.9.0-SNAPSHOT/itest-common-0.9.0-20150127.140114-191-tests.jar (70 KB at 392.4 KB/sec)
Uploading: https://repository.apache.org/content/repositories/snapshots/org/apache/bigtop/itest/itest-common/0.9.0-SNAPSHOT/maven-metadata.xml
Uploaded: https://repository.apache.org/content/repositories/snapshots/org/apache/bigtop/itest/itest-common/0.9.0-SNAPSHOT/maven-metadata.xml (1005 B at 2.5 KB/sec)
[INFO] ------------------------------------------------------------------------
[INFO] BUILD SUCCESS
[INFO] ------------------------------------------------------------------------
[INFO] Total time: 33.807s
[INFO] Finished at: Tue Jan 27 14:01:16 UTC 2015
[INFO] Final Memory: 16M/245M
[INFO] ------------------------------------------------------------------------
Waiting for Jenkins to finish collecting data
Build failed in Jenkins: Bigtop-trunk-iTest » iTest: system and integration testing in the cloud #1994
Posted by Apache Jenkins Server <je...@builds.apache.org>.
See <https://builds.apache.org/job/Bigtop-trunk-iTest/org.apache.bigtop.itest$itest-common/1994/>
------------------------------------------
[...truncated 22 lines...]
Downloading: http://repository.codehaus.org/org/codehaus/groovy/groovy-eclipse-batch/2.3.2-01-SNAPSHOT/maven-metadata.xml
Downloading: http://nexus.codehaus.org/snapshots/org/codehaus/groovy/groovy-eclipse-batch/2.3.2-01-SNAPSHOT/maven-metadata.xml
Downloaded: http://nexus.codehaus.org/snapshots/org/codehaus/groovy/groovy-eclipse-batch/2.3.2-01-SNAPSHOT/maven-metadata.xml (2 KB at 4.9 KB/sec)
Downloading: http://repository.codehaus.org/org/codehaus/groovy/groovy-eclipse-batch/2.3.3-01-SNAPSHOT/maven-metadata.xml
Downloading: http://nexus.codehaus.org/snapshots/org/codehaus/groovy/groovy-eclipse-batch/2.3.3-01-SNAPSHOT/maven-metadata.xml
Downloaded: http://nexus.codehaus.org/snapshots/org/codehaus/groovy/groovy-eclipse-batch/2.3.3-01-SNAPSHOT/maven-metadata.xml (2 KB at 5.0 KB/sec)
Downloading: http://repository.codehaus.org/org/codehaus/groovy/groovy-eclipse-batch/2.3.4-01-SNAPSHOT/maven-metadata.xml
Downloading: http://nexus.codehaus.org/snapshots/org/codehaus/groovy/groovy-eclipse-batch/2.3.4-01-SNAPSHOT/maven-metadata.xml
Downloaded: http://nexus.codehaus.org/snapshots/org/codehaus/groovy/groovy-eclipse-batch/2.3.4-01-SNAPSHOT/maven-metadata.xml (378 B at 1.5 KB/sec)
[INFO]
[INFO] ------------------------------------------------------------------------
[INFO] Building iTest: system and integration testing in the cloud 0.9.0-SNAPSHOT
[INFO] ------------------------------------------------------------------------
[INFO]
[INFO] --- groovy-eclipse-compiler:2.8.0-01:add-groovy-build-paths (default-add-groovy-build-paths) @ itest-common ---
[INFO] Adding /src/main/groovy to the list of source folders
[INFO] Adding /src/test/groovy to the list of test source folders
[INFO]
[INFO] --- maven-remote-resources-plugin:1.1:process (default) @ itest-common ---
[INFO] Setting property: classpath.resource.loader.class => 'org.codehaus.plexus.velocity.ContextClassLoaderResourceLoader'.
[INFO] Setting property: velocimacro.messages.on => 'false'.
[INFO] Setting property: resource.loader => 'classpath'.
[INFO] Setting property: resource.manager.logwhenfound => 'false'.
[INFO]
[INFO] --- maven-resources-plugin:2.4:resources (default-resources) @ itest-common ---
[INFO] Using 'UTF-8' encoding to copy filtered resources.
[INFO] skip non existing resourceDirectory <https://builds.apache.org/job/Bigtop-trunk-iTest/org.apache.bigtop.itest$itest-common/ws/src/main/resources>
[INFO] Copying 3 resources
[INFO]
[INFO] --- maven-compiler-plugin:3.1:compile (default-compile) @ itest-common ---
[INFO] Changes detected - recompiling the module!
[INFO] Using Groovy-Eclipse compiler to compile both Java and Groovy files
[INFO]
[INFO] --- maven-resources-plugin:2.4:testResources (default-testResources) @ itest-common ---
[INFO] Using 'UTF-8' encoding to copy filtered resources.
[INFO] skip non existing resourceDirectory <https://builds.apache.org/job/Bigtop-trunk-iTest/org.apache.bigtop.itest$itest-common/ws/src/test/resources>
[INFO] Copying 3 resources
[INFO]
[INFO] --- maven-compiler-plugin:3.1:testCompile (default-testCompile) @ itest-common ---
[INFO] Changes detected - recompiling the module!
[INFO] Using Groovy-Eclipse compiler to compile both Java and Groovy files
[INFO]
[INFO] --- maven-surefire-plugin:2.7:test (default-test) @ itest-common ---
[INFO] Surefire report directory: <https://builds.apache.org/job/Bigtop-trunk-iTest/org.apache.bigtop.itest$itest-common/ws/target/surefire-reports>
-------------------------------------------------------
T E S T S
-------------------------------------------------------
Running org.apache.bigtop.itest.JUnitUtilsTest
Disclaimer: This test expected to show a failure in an embeded testcase
[junit] Running org.apache.bigtop.itest.DummyTestPassTests run: 1, Failures: 0, Errors: 0, Time elapsed: 0.275 secRunning org.apache.bigtop.itest.DummyTestFail
[junit] Tests run: 1, Failures: 1, Errors: 0, Time elapsed: 0.14 secTEST org.apache.bigtop.itest.DummyTestFail FAILED
[junit] Tests FAILED
Disclaimer: This test expected to show an error in an embeded testcase
[junit] Running org.apache.bigtop.itest.DummyTestError
[junit] Tests run: 1, Failures: 0, Errors: 1, Time elapsed: 0.287 sec
[junit] Test org.apache.bigtop.itest.DummyTestError FAILED
[junit] Running org.apache.bigtop.itest.DummyTestPass
[junit] Tests run: 1, Failures: 0, Errors: 0, Time elapsed: 0.274 sec
[junit] Running org.apache.bigtop.itest.DummyTestPass
[junit] Tests run: 1, Failures: 0, Errors: 0, Time elapsed: 0.273 sec
Tests run: 4, Failures: 0, Errors: 0, Skipped: 0, Time elapsed: 4.97 sec
Running org.apache.bigtop.itest.junit.OrderedParameterizedTest
Tests run: 3, Failures: 0, Errors: 0, Skipped: 0, Time elapsed: 0.05 sec
Running org.apache.bigtop.itest.junit.OrderedTest
Tests run: 3, Failures: 0, Errors: 0, Skipped: 0, Time elapsed: 0.008 sec
Running org.apache.bigtop.itest.posix.UGITest
Tests run: 2, Failures: 0, Errors: 0, Skipped: 0, Time elapsed: 0.076 sec
Running org.apache.bigtop.itest.posix.ServiceTest
Status []
Tests run: 2, Failures: 0, Errors: 0, Skipped: 1, Time elapsed: 0.257 sec
Running org.apache.bigtop.itest.posix.AlternativeTest
Tests run: 1, Failures: 0, Errors: 0, Skipped: 0, Time elapsed: 1.714 sec
Running org.apache.bigtop.itest.TestContractGroovy
Tests run: 2, Failures: 0, Errors: 0, Skipped: 0, Time elapsed: 0.046 sec
Running org.apache.bigtop.itest.pmanager.PackageManagerTest
/etc/cron.monthly/.placeholder
/etc/cron.hourly/.placeholder
/etc/default/cron
/etc/cron.weekly/.placeholder
/etc/cron.d/.placeholder
/etc/cron.daily/.placeholder
/etc/pam.d/cron
/etc/init/cron.conf
/etc/crontab
/.
/etc
/etc/cron.monthly
/etc/cron.monthly/.placeholder
/etc/cron.hourly
/etc/cron.hourly/.placeholder
/etc/default
/etc/default/cron
/etc/cron.weekly
/etc/cron.weekly/.placeholder
/etc/cron.d
/etc/cron.d/.placeholder
/etc/cron.daily
/etc/cron.daily/.placeholder
/etc/pam.d
/etc/pam.d/cron
/etc/init
/etc/init/cron.conf
/etc/init.d
/etc/crontab
/usr
/usr/share
/usr/share/bug
/usr/share/bug/cron
/usr/share/bug/cron/script
/usr/share/bug/cron/control
/usr/share/man
/usr/share/man/man1
/usr/share/man/man1/crontab.1.gz
/usr/share/man/man5
/usr/share/man/man5/crontab.5.gz
/usr/share/man/man8
/usr/share/man/man8/cron.8.gz
/usr/share/doc
/usr/share/doc/cron
/usr/share/doc/cron/README
/usr/share/doc/cron/README.anacron
/usr/share/doc/cron/README.Debian
/usr/share/doc/cron/FEATURES
/usr/share/doc/cron/copyright
/usr/share/doc/cron/examples
/usr/share/doc/cron/examples/crontab2english.pl
/usr/share/doc/cron/examples/cron-stats.pl
/usr/share/doc/cron/examples/cron-tasks-review.sh
/usr/share/doc/cron/NEWS.Debian.gz
/usr/share/doc/cron/changelog.Debian.gz
/usr/share/doc/cron/THANKS
/usr/share/doc/cron/TODO.Debian
/usr/sbin
/usr/sbin/cron
/usr/bin
/usr/bin/crontab
/var
/var/spool
/var/spool/cron
/var/spool/cron/crontabs
/etc/init.d/cron
Tests run: 11, Failures: 0, Errors: 0, Skipped: 3, Time elapsed: 3.583 sec
Running org.apache.bigtop.itest.TestContractJava
Tests run: 2, Failures: 0, Errors: 0, Skipped: 0, Time elapsed: 0.001 sec
Running org.apache.bigtop.itest.TestListUtilsTest
Tests run: 1, Failures: 0, Errors: 0, Skipped: 0, Time elapsed: 0.036 sec
Running org.apache.bigtop.itest.shell.ShellTest
Tests run: 2, Failures: 0, Errors: 0, Skipped: 1, Time elapsed: 0.007 sec
Running org.apache.bigtop.itest.JarContentTest
log4j:WARN No appenders could be found for logger (org.apache.bigtop.itest.JarContent).
log4j:WARN Please initialize the log4j system properly.
Tests run: 6, Failures: 0, Errors: 0, Skipped: 0, Time elapsed: 0.798 sec
Running org.apache.bigtop.itest.TestContractJavaProc
Tests run: 2, Failures: 0, Errors: 0, Skipped: 0, Time elapsed: 0.002 sec
Results :
Tests run: 41, Failures: 0, Errors: 0, Skipped: 5
[JENKINS] Recording test results
log4j:WARN No appenders could be found for logger (org.apache.commons.beanutils.converters.BooleanConverter).
log4j:WARN Please initialize the log4j system properly.
[INFO]
[INFO] --- maven-jar-plugin:2.2:jar (default-jar) @ itest-common ---
[INFO] Building jar: <https://builds.apache.org/job/Bigtop-trunk-iTest/org.apache.bigtop.itest$itest-common/ws/target/itest-common-0.9.0-SNAPSHOT.jar>
[INFO]
[INFO] --- maven-jar-plugin:2.2:test-jar (default) @ itest-common ---
[INFO] Building jar: <https://builds.apache.org/job/Bigtop-trunk-iTest/org.apache.bigtop.itest$itest-common/ws/target/itest-common-0.9.0-SNAPSHOT-tests.jar>
[INFO]
[INFO] --- maven-failsafe-plugin:2.17:verify (default) @ itest-common ---
[INFO] Failsafe report directory: <https://builds.apache.org/job/Bigtop-trunk-iTest/org.apache.bigtop.itest$itest-common/ws/target/failsafe-reports>
[WARNING] File encoding has not been set, using platform encoding ISO-8859-1, i.e. build is platform dependent!
[ERROR] There are test failures.
Please refer to <https://builds.apache.org/job/Bigtop-trunk-iTest/org.apache.bigtop.itest$itest-common/ws/target/failsafe-reports> for the individual test results.
[JENKINS] Recording test results
hudson.AbortException: Test reports were found but none of them are new. Did tests run?
For example, <https://builds.apache.org/job/Bigtop-trunk-iTest/org.apache.bigtop.itest$itest-common/ws/target/failsafe-reports/TEST-org.apache.bigtop.itest.failures.IntegrationTestClusterFailures.xml> is 23 hr old
at hudson.tasks.junit.TestResult.parse(TestResult.java:213)
at hudson.maven.reporters.SurefireArchiver.postExecute(SurefireArchiver.java:148)
at hudson.maven.Maven3Builder$MavenExecutionListener.recordMojoEnded(Maven3Builder.java:634)
at hudson.maven.Maven3Builder$MavenExecutionListener.mojoSucceeded(Maven3Builder.java:615)
at org.apache.maven.lifecycle.internal.DefaultExecutionEventCatapult.fire(DefaultExecutionEventCatapult.java:87)
at org.apache.maven.lifecycle.internal.DefaultExecutionEventCatapult.fire(DefaultExecutionEventCatapult.java:42)
at org.apache.maven.lifecycle.internal.MojoExecutor.execute(MojoExecutor.java:228)
at org.apache.maven.lifecycle.internal.MojoExecutor.execute(MojoExecutor.java:153)
at org.apache.maven.lifecycle.internal.MojoExecutor.execute(MojoExecutor.java:145)
at org.apache.maven.lifecycle.internal.LifecycleModuleBuilder.buildProject(LifecycleModuleBuilder.java:84)
at org.apache.maven.lifecycle.internal.LifecycleModuleBuilder.buildProject(LifecycleModuleBuilder.java:59)
at org.apache.maven.lifecycle.internal.LifecycleStarter.singleThreadedBuild(LifecycleStarter.java:183)
at org.apache.maven.lifecycle.internal.LifecycleStarter.execute(LifecycleStarter.java:161)
at org.apache.maven.DefaultMaven.doExecute(DefaultMaven.java:320)
at org.apache.maven.DefaultMaven.execute(DefaultMaven.java:156)
at org.jvnet.hudson.maven3.launcher.Maven3Launcher.main(Maven3Launcher.java:117)
at sun.reflect.NativeMethodAccessorImpl.invoke0(Native Method)
at sun.reflect.NativeMethodAccessorImpl.invoke(NativeMethodAccessorImpl.java:39)
at sun.reflect.DelegatingMethodAccessorImpl.invoke(DelegatingMethodAccessorImpl.java:25)
at java.lang.reflect.Method.invoke(Method.java:597)
at org.codehaus.plexus.classworlds.launcher.Launcher.launchStandard(Launcher.java:329)
at org.codehaus.plexus.classworlds.launcher.Launcher.launch(Launcher.java:239)
at org.jvnet.hudson.maven3.agent.Maven3Main.launch(Maven3Main.java:178)
at sun.reflect.NativeMethodAccessorImpl.invoke0(Native Method)
at sun.reflect.NativeMethodAccessorImpl.invoke(NativeMethodAccessorImpl.java:39)
at sun.reflect.DelegatingMethodAccessorImpl.invoke(DelegatingMethodAccessorImpl.java:25)
at java.lang.reflect.Method.invoke(Method.java:597)
at hudson.maven.Maven3Builder.call(Maven3Builder.java:136)
at hudson.maven.Maven3Builder.call(Maven3Builder.java:71)
at hudson.remoting.UserRequest.perform(UserRequest.java:118)
at hudson.remoting.UserRequest.perform(UserRequest.java:48)
at hudson.remoting.Request$2.run(Request.java:328)
at hudson.remoting.InterceptingExecutorService$1.call(InterceptingExecutorService.java:72)
at java.util.concurrent.FutureTask$Sync.innerRun(FutureTask.java:303)
at java.util.concurrent.FutureTask.run(FutureTask.java:138)
at java.util.concurrent.ThreadPoolExecutor$Worker.runTask(ThreadPoolExecutor.java:895)
at java.util.concurrent.ThreadPoolExecutor$Worker.run(ThreadPoolExecutor.java:918)
at java.lang.Thread.run(Thread.java:662)
[INFO]
[INFO] --- maven-install-plugin:2.3:install (default-install) @ itest-common ---
[INFO] Installing <https://builds.apache.org/job/Bigtop-trunk-iTest/org.apache.bigtop.itest$itest-common/ws/target/itest-common-0.9.0-SNAPSHOT.jar> to /home/jenkins/jenkins-slave/maven-repositories/0/org/apache/bigtop/itest/itest-common/0.9.0-SNAPSHOT/itest-common-0.9.0-SNAPSHOT.jar
[INFO] Installing <https://builds.apache.org/job/Bigtop-trunk-iTest/org.apache.bigtop.itest$itest-common/ws/pom.xml> to /home/jenkins/jenkins-slave/maven-repositories/0/org/apache/bigtop/itest/itest-common/0.9.0-SNAPSHOT/itest-common-0.9.0-SNAPSHOT.pom
[INFO] Installing <https://builds.apache.org/job/Bigtop-trunk-iTest/org.apache.bigtop.itest$itest-common/ws/target/itest-common-0.9.0-SNAPSHOT-tests.jar> to /home/jenkins/jenkins-slave/maven-repositories/0/org/apache/bigtop/itest/itest-common/0.9.0-SNAPSHOT/itest-common-0.9.0-SNAPSHOT-tests.jar
[INFO]
[INFO] --- maven-deploy-plugin:2.5:deploy (default-deploy) @ itest-common ---
Downloading: https://repository.apache.org/content/repositories/snapshots/org/apache/bigtop/itest/itest-common/0.9.0-SNAPSHOT/maven-metadata.xml
Downloaded: https://repository.apache.org/content/repositories/snapshots/org/apache/bigtop/itest/itest-common/0.9.0-SNAPSHOT/maven-metadata.xml (1005 B at 0.5 KB/sec)
Uploading: https://repository.apache.org/content/repositories/snapshots/org/apache/bigtop/itest/itest-common/0.9.0-SNAPSHOT/itest-common-0.9.0-20150127.135857-190.jar
Uploaded: https://repository.apache.org/content/repositories/snapshots/org/apache/bigtop/itest/itest-common/0.9.0-SNAPSHOT/itest-common-0.9.0-20150127.135857-190.jar (206 KB at 1020.1 KB/sec)
Uploading: https://repository.apache.org/content/repositories/snapshots/org/apache/bigtop/itest/itest-common/0.9.0-SNAPSHOT/itest-common-0.9.0-20150127.135857-190.pom
Uploaded: https://repository.apache.org/content/repositories/snapshots/org/apache/bigtop/itest/itest-common/0.9.0-SNAPSHOT/itest-common-0.9.0-20150127.135857-190.pom (6 KB at 31.5 KB/sec)
Downloading: https://repository.apache.org/content/repositories/snapshots/org/apache/bigtop/itest/itest-common/maven-metadata.xml
Downloaded: https://repository.apache.org/content/repositories/snapshots/org/apache/bigtop/itest/itest-common/maven-metadata.xml (466 B at 3.0 KB/sec)
Uploading: https://repository.apache.org/content/repositories/snapshots/org/apache/bigtop/itest/itest-common/0.9.0-SNAPSHOT/maven-metadata.xml
Uploaded: https://repository.apache.org/content/repositories/snapshots/org/apache/bigtop/itest/itest-common/0.9.0-SNAPSHOT/maven-metadata.xml (1005 B at 4.8 KB/sec)
Uploading: https://repository.apache.org/content/repositories/snapshots/org/apache/bigtop/itest/itest-common/maven-metadata.xml
Uploaded: https://repository.apache.org/content/repositories/snapshots/org/apache/bigtop/itest/itest-common/maven-metadata.xml (466 B at 2.6 KB/sec)
Uploading: https://repository.apache.org/content/repositories/snapshots/org/apache/bigtop/itest/itest-common/0.9.0-SNAPSHOT/itest-common-0.9.0-20150127.135857-190-tests.jar
Uploaded: https://repository.apache.org/content/repositories/snapshots/org/apache/bigtop/itest/itest-common/0.9.0-SNAPSHOT/itest-common-0.9.0-20150127.135857-190-tests.jar (70 KB at 369.4 KB/sec)
Uploading: https://repository.apache.org/content/repositories/snapshots/org/apache/bigtop/itest/itest-common/0.9.0-SNAPSHOT/maven-metadata.xml
Uploaded: https://repository.apache.org/content/repositories/snapshots/org/apache/bigtop/itest/itest-common/0.9.0-SNAPSHOT/maven-metadata.xml (1005 B at 7.2 KB/sec)
[INFO] ------------------------------------------------------------------------
[INFO] BUILD SUCCESS
[INFO] ------------------------------------------------------------------------
[INFO] Total time: 39.534s
[INFO] Finished at: Tue Jan 27 13:58:59 UTC 2015
[INFO] Final Memory: 16M/245M
[INFO] ------------------------------------------------------------------------
Waiting for Jenkins to finish collecting data
Build failed in Jenkins: Bigtop-trunk-iTest » iTest: system and integration testing in the cloud #1993
Posted by Apache Jenkins Server <je...@builds.apache.org>.
See <https://builds.apache.org/job/Bigtop-trunk-iTest/org.apache.bigtop.itest$itest-common/1993/>
------------------------------------------
[...truncated 22 lines...]
Downloading: http://repository.codehaus.org/org/codehaus/groovy/groovy-eclipse-batch/2.3.2-01-SNAPSHOT/maven-metadata.xml
Downloading: http://nexus.codehaus.org/snapshots/org/codehaus/groovy/groovy-eclipse-batch/2.3.2-01-SNAPSHOT/maven-metadata.xml
Downloaded: http://nexus.codehaus.org/snapshots/org/codehaus/groovy/groovy-eclipse-batch/2.3.2-01-SNAPSHOT/maven-metadata.xml (2 KB at 4.9 KB/sec)
Downloading: http://repository.codehaus.org/org/codehaus/groovy/groovy-eclipse-batch/2.3.3-01-SNAPSHOT/maven-metadata.xml
Downloading: http://nexus.codehaus.org/snapshots/org/codehaus/groovy/groovy-eclipse-batch/2.3.3-01-SNAPSHOT/maven-metadata.xml
Downloaded: http://nexus.codehaus.org/snapshots/org/codehaus/groovy/groovy-eclipse-batch/2.3.3-01-SNAPSHOT/maven-metadata.xml (2 KB at 4.8 KB/sec)
Downloading: http://nexus.codehaus.org/snapshots/org/codehaus/groovy/groovy-eclipse-batch/2.3.4-01-SNAPSHOT/maven-metadata.xml
Downloading: http://repository.codehaus.org/org/codehaus/groovy/groovy-eclipse-batch/2.3.4-01-SNAPSHOT/maven-metadata.xml
Downloaded: http://nexus.codehaus.org/snapshots/org/codehaus/groovy/groovy-eclipse-batch/2.3.4-01-SNAPSHOT/maven-metadata.xml (378 B at 1.5 KB/sec)
[INFO]
[INFO] ------------------------------------------------------------------------
[INFO] Building iTest: system and integration testing in the cloud 0.9.0-SNAPSHOT
[INFO] ------------------------------------------------------------------------
[INFO]
[INFO] --- groovy-eclipse-compiler:2.8.0-01:add-groovy-build-paths (default-add-groovy-build-paths) @ itest-common ---
[INFO] Adding /src/main/groovy to the list of source folders
[INFO] Adding /src/test/groovy to the list of test source folders
[INFO]
[INFO] --- maven-remote-resources-plugin:1.1:process (default) @ itest-common ---
[INFO] Setting property: classpath.resource.loader.class => 'org.codehaus.plexus.velocity.ContextClassLoaderResourceLoader'.
[INFO] Setting property: velocimacro.messages.on => 'false'.
[INFO] Setting property: resource.loader => 'classpath'.
[INFO] Setting property: resource.manager.logwhenfound => 'false'.
[INFO]
[INFO] --- maven-resources-plugin:2.4:resources (default-resources) @ itest-common ---
[INFO] Using 'UTF-8' encoding to copy filtered resources.
[INFO] skip non existing resourceDirectory <https://builds.apache.org/job/Bigtop-trunk-iTest/org.apache.bigtop.itest$itest-common/ws/src/main/resources>
[INFO] Copying 3 resources
[INFO]
[INFO] --- maven-compiler-plugin:3.1:compile (default-compile) @ itest-common ---
[INFO] Changes detected - recompiling the module!
[INFO] Using Groovy-Eclipse compiler to compile both Java and Groovy files
[INFO]
[INFO] --- maven-resources-plugin:2.4:testResources (default-testResources) @ itest-common ---
[INFO] Using 'UTF-8' encoding to copy filtered resources.
[INFO] skip non existing resourceDirectory <https://builds.apache.org/job/Bigtop-trunk-iTest/org.apache.bigtop.itest$itest-common/ws/src/test/resources>
[INFO] Copying 3 resources
[INFO]
[INFO] --- maven-compiler-plugin:3.1:testCompile (default-testCompile) @ itest-common ---
[INFO] Changes detected - recompiling the module!
[INFO] Using Groovy-Eclipse compiler to compile both Java and Groovy files
[INFO]
[INFO] --- maven-surefire-plugin:2.7:test (default-test) @ itest-common ---
[INFO] Surefire report directory: <https://builds.apache.org/job/Bigtop-trunk-iTest/org.apache.bigtop.itest$itest-common/ws/target/surefire-reports>
-------------------------------------------------------
T E S T S
-------------------------------------------------------
Running org.apache.bigtop.itest.JUnitUtilsTest
Disclaimer: This test expected to show a failure in an embeded testcase
[junit] Running org.apache.bigtop.itest.DummyTestPassTests run: 1, Failures: 0, Errors: 0, Time elapsed: 0.28 secRunning org.apache.bigtop.itest.DummyTestFail
[junit] Tests run: 1, Failures: 1, Errors: 0, Time elapsed: 0.138 secTEST org.apache.bigtop.itest.DummyTestFail FAILED
[junit] Tests FAILED
Disclaimer: This test expected to show an error in an embeded testcase
[junit] Running org.apache.bigtop.itest.DummyTestError
[junit] Tests run: 1, Failures: 0, Errors: 1, Time elapsed: 0.294 sec
[junit] Test org.apache.bigtop.itest.DummyTestError FAILED
[junit] Running org.apache.bigtop.itest.DummyTestPass
[junit] Tests run: 1, Failures: 0, Errors: 0, Time elapsed: 0.277 sec
[junit] Running org.apache.bigtop.itest.DummyTestPass
[junit] Tests run: 1, Failures: 0, Errors: 0, Time elapsed: 0.285 sec
Tests run: 4, Failures: 0, Errors: 0, Skipped: 0, Time elapsed: 5.016 sec
Running org.apache.bigtop.itest.junit.OrderedParameterizedTest
Tests run: 3, Failures: 0, Errors: 0, Skipped: 0, Time elapsed: 0.05 sec
Running org.apache.bigtop.itest.junit.OrderedTest
Tests run: 3, Failures: 0, Errors: 0, Skipped: 0, Time elapsed: 0.008 sec
Running org.apache.bigtop.itest.posix.UGITest
Tests run: 2, Failures: 0, Errors: 0, Skipped: 0, Time elapsed: 0.077 sec
Running org.apache.bigtop.itest.posix.ServiceTest
Status []
Tests run: 2, Failures: 0, Errors: 0, Skipped: 1, Time elapsed: 0.124 sec
Running org.apache.bigtop.itest.posix.AlternativeTest
Tests run: 1, Failures: 0, Errors: 0, Skipped: 0, Time elapsed: 1.306 sec
Running org.apache.bigtop.itest.TestContractGroovy
Tests run: 2, Failures: 0, Errors: 0, Skipped: 0, Time elapsed: 0.011 sec
Running org.apache.bigtop.itest.pmanager.PackageManagerTest
/etc/cron.monthly/.placeholder
/etc/cron.hourly/.placeholder
/etc/default/cron
/etc/cron.weekly/.placeholder
/etc/cron.d/.placeholder
/etc/cron.daily/.placeholder
/etc/pam.d/cron
/etc/init/cron.conf
/etc/crontab
/.
/etc
/etc/cron.monthly
/etc/cron.monthly/.placeholder
/etc/cron.hourly
/etc/cron.hourly/.placeholder
/etc/default
/etc/default/cron
/etc/cron.weekly
/etc/cron.weekly/.placeholder
/etc/cron.d
/etc/cron.d/.placeholder
/etc/cron.daily
/etc/cron.daily/.placeholder
/etc/pam.d
/etc/pam.d/cron
/etc/init
/etc/init/cron.conf
/etc/init.d
/etc/crontab
/usr
/usr/share
/usr/share/bug
/usr/share/bug/cron
/usr/share/bug/cron/script
/usr/share/bug/cron/control
/usr/share/man
/usr/share/man/man1
/usr/share/man/man1/crontab.1.gz
/usr/share/man/man5
/usr/share/man/man5/crontab.5.gz
/usr/share/man/man8
/usr/share/man/man8/cron.8.gz
/usr/share/doc
/usr/share/doc/cron
/usr/share/doc/cron/README
/usr/share/doc/cron/README.anacron
/usr/share/doc/cron/README.Debian
/usr/share/doc/cron/FEATURES
/usr/share/doc/cron/copyright
/usr/share/doc/cron/examples
/usr/share/doc/cron/examples/crontab2english.pl
/usr/share/doc/cron/examples/cron-stats.pl
/usr/share/doc/cron/examples/cron-tasks-review.sh
/usr/share/doc/cron/NEWS.Debian.gz
/usr/share/doc/cron/changelog.Debian.gz
/usr/share/doc/cron/THANKS
/usr/share/doc/cron/TODO.Debian
/usr/sbin
/usr/sbin/cron
/usr/bin
/usr/bin/crontab
/var
/var/spool
/var/spool/cron
/var/spool/cron/crontabs
/etc/init.d/cron
Tests run: 11, Failures: 0, Errors: 0, Skipped: 3, Time elapsed: 1.883 sec
Running org.apache.bigtop.itest.TestContractJava
Tests run: 2, Failures: 0, Errors: 0, Skipped: 0, Time elapsed: 0.001 sec
Running org.apache.bigtop.itest.TestListUtilsTest
Tests run: 1, Failures: 0, Errors: 0, Skipped: 0, Time elapsed: 0.016 sec
Running org.apache.bigtop.itest.shell.ShellTest
Tests run: 2, Failures: 0, Errors: 0, Skipped: 1, Time elapsed: 0.014 sec
Running org.apache.bigtop.itest.JarContentTest
log4j:WARN No appenders could be found for logger (org.apache.bigtop.itest.JarContent).
log4j:WARN Please initialize the log4j system properly.
Tests run: 6, Failures: 0, Errors: 0, Skipped: 0, Time elapsed: 0.809 sec
Running org.apache.bigtop.itest.TestContractJavaProc
Tests run: 2, Failures: 0, Errors: 0, Skipped: 0, Time elapsed: 0.002 sec
Results :
Tests run: 41, Failures: 0, Errors: 0, Skipped: 5
[JENKINS] Recording test results
log4j:WARN No appenders could be found for logger (org.apache.commons.beanutils.converters.BooleanConverter).
log4j:WARN Please initialize the log4j system properly.
[INFO]
[INFO] --- maven-jar-plugin:2.2:jar (default-jar) @ itest-common ---
[INFO] Building jar: <https://builds.apache.org/job/Bigtop-trunk-iTest/org.apache.bigtop.itest$itest-common/ws/target/itest-common-0.9.0-SNAPSHOT.jar>
[INFO]
[INFO] --- maven-jar-plugin:2.2:test-jar (default) @ itest-common ---
[INFO] Building jar: <https://builds.apache.org/job/Bigtop-trunk-iTest/org.apache.bigtop.itest$itest-common/ws/target/itest-common-0.9.0-SNAPSHOT-tests.jar>
[INFO]
[INFO] --- maven-failsafe-plugin:2.17:verify (default) @ itest-common ---
[INFO] Failsafe report directory: <https://builds.apache.org/job/Bigtop-trunk-iTest/org.apache.bigtop.itest$itest-common/ws/target/failsafe-reports>
[WARNING] File encoding has not been set, using platform encoding ISO-8859-1, i.e. build is platform dependent!
[ERROR] There are test failures.
Please refer to <https://builds.apache.org/job/Bigtop-trunk-iTest/org.apache.bigtop.itest$itest-common/ws/target/failsafe-reports> for the individual test results.
[JENKINS] Recording test results
hudson.AbortException: Test reports were found but none of them are new. Did tests run?
For example, <https://builds.apache.org/job/Bigtop-trunk-iTest/org.apache.bigtop.itest$itest-common/ws/target/failsafe-reports/TEST-org.apache.bigtop.itest.failures.IntegrationTestClusterFailures.xml> is 7 hr 13 min old
at hudson.tasks.junit.TestResult.parse(TestResult.java:213)
at hudson.maven.reporters.SurefireArchiver.postExecute(SurefireArchiver.java:148)
at hudson.maven.Maven3Builder$MavenExecutionListener.recordMojoEnded(Maven3Builder.java:634)
at hudson.maven.Maven3Builder$MavenExecutionListener.mojoSucceeded(Maven3Builder.java:615)
at org.apache.maven.lifecycle.internal.DefaultExecutionEventCatapult.fire(DefaultExecutionEventCatapult.java:87)
at org.apache.maven.lifecycle.internal.DefaultExecutionEventCatapult.fire(DefaultExecutionEventCatapult.java:42)
at org.apache.maven.lifecycle.internal.MojoExecutor.execute(MojoExecutor.java:228)
at org.apache.maven.lifecycle.internal.MojoExecutor.execute(MojoExecutor.java:153)
at org.apache.maven.lifecycle.internal.MojoExecutor.execute(MojoExecutor.java:145)
at org.apache.maven.lifecycle.internal.LifecycleModuleBuilder.buildProject(LifecycleModuleBuilder.java:84)
at org.apache.maven.lifecycle.internal.LifecycleModuleBuilder.buildProject(LifecycleModuleBuilder.java:59)
at org.apache.maven.lifecycle.internal.LifecycleStarter.singleThreadedBuild(LifecycleStarter.java:183)
at org.apache.maven.lifecycle.internal.LifecycleStarter.execute(LifecycleStarter.java:161)
at org.apache.maven.DefaultMaven.doExecute(DefaultMaven.java:320)
at org.apache.maven.DefaultMaven.execute(DefaultMaven.java:156)
at org.jvnet.hudson.maven3.launcher.Maven3Launcher.main(Maven3Launcher.java:117)
at sun.reflect.NativeMethodAccessorImpl.invoke0(Native Method)
at sun.reflect.NativeMethodAccessorImpl.invoke(NativeMethodAccessorImpl.java:39)
at sun.reflect.DelegatingMethodAccessorImpl.invoke(DelegatingMethodAccessorImpl.java:25)
at java.lang.reflect.Method.invoke(Method.java:597)
at org.codehaus.plexus.classworlds.launcher.Launcher.launchStandard(Launcher.java:329)
at org.codehaus.plexus.classworlds.launcher.Launcher.launch(Launcher.java:239)
at org.jvnet.hudson.maven3.agent.Maven3Main.launch(Maven3Main.java:178)
at sun.reflect.NativeMethodAccessorImpl.invoke0(Native Method)
at sun.reflect.NativeMethodAccessorImpl.invoke(NativeMethodAccessorImpl.java:39)
at sun.reflect.DelegatingMethodAccessorImpl.invoke(DelegatingMethodAccessorImpl.java:25)
at java.lang.reflect.Method.invoke(Method.java:597)
at hudson.maven.Maven3Builder.call(Maven3Builder.java:136)
at hudson.maven.Maven3Builder.call(Maven3Builder.java:71)
at hudson.remoting.UserRequest.perform(UserRequest.java:118)
at hudson.remoting.UserRequest.perform(UserRequest.java:48)
at hudson.remoting.Request$2.run(Request.java:328)
at hudson.remoting.InterceptingExecutorService$1.call(InterceptingExecutorService.java:72)
at java.util.concurrent.FutureTask$Sync.innerRun(FutureTask.java:303)
at java.util.concurrent.FutureTask.run(FutureTask.java:138)
at java.util.concurrent.ThreadPoolExecutor$Worker.runTask(ThreadPoolExecutor.java:895)
at java.util.concurrent.ThreadPoolExecutor$Worker.run(ThreadPoolExecutor.java:918)
at java.lang.Thread.run(Thread.java:662)
[INFO]
[INFO] --- maven-install-plugin:2.3:install (default-install) @ itest-common ---
[INFO] Installing <https://builds.apache.org/job/Bigtop-trunk-iTest/org.apache.bigtop.itest$itest-common/ws/target/itest-common-0.9.0-SNAPSHOT.jar> to /home/jenkins/jenkins-slave/maven-repositories/1/org/apache/bigtop/itest/itest-common/0.9.0-SNAPSHOT/itest-common-0.9.0-SNAPSHOT.jar
[INFO] Installing <https://builds.apache.org/job/Bigtop-trunk-iTest/org.apache.bigtop.itest$itest-common/ws/pom.xml> to /home/jenkins/jenkins-slave/maven-repositories/1/org/apache/bigtop/itest/itest-common/0.9.0-SNAPSHOT/itest-common-0.9.0-SNAPSHOT.pom
[INFO] Installing <https://builds.apache.org/job/Bigtop-trunk-iTest/org.apache.bigtop.itest$itest-common/ws/target/itest-common-0.9.0-SNAPSHOT-tests.jar> to /home/jenkins/jenkins-slave/maven-repositories/1/org/apache/bigtop/itest/itest-common/0.9.0-SNAPSHOT/itest-common-0.9.0-SNAPSHOT-tests.jar
[INFO]
[INFO] --- maven-deploy-plugin:2.5:deploy (default-deploy) @ itest-common ---
Downloading: https://repository.apache.org/content/repositories/snapshots/org/apache/bigtop/itest/itest-common/0.9.0-SNAPSHOT/maven-metadata.xml
Downloaded: https://repository.apache.org/content/repositories/snapshots/org/apache/bigtop/itest/itest-common/0.9.0-SNAPSHOT/maven-metadata.xml (1005 B at 2.0 KB/sec)
Uploading: https://repository.apache.org/content/repositories/snapshots/org/apache/bigtop/itest/itest-common/0.9.0-SNAPSHOT/itest-common-0.9.0-20150126.214611-189.jar
Uploaded: https://repository.apache.org/content/repositories/snapshots/org/apache/bigtop/itest/itest-common/0.9.0-SNAPSHOT/itest-common-0.9.0-20150126.214611-189.jar (206 KB at 891.5 KB/sec)
Uploading: https://repository.apache.org/content/repositories/snapshots/org/apache/bigtop/itest/itest-common/0.9.0-SNAPSHOT/itest-common-0.9.0-20150126.214611-189.pom
Uploaded: https://repository.apache.org/content/repositories/snapshots/org/apache/bigtop/itest/itest-common/0.9.0-SNAPSHOT/itest-common-0.9.0-20150126.214611-189.pom (6 KB at 31.1 KB/sec)
Downloading: https://repository.apache.org/content/repositories/snapshots/org/apache/bigtop/itest/itest-common/maven-metadata.xml
Downloaded: https://repository.apache.org/content/repositories/snapshots/org/apache/bigtop/itest/itest-common/maven-metadata.xml (466 B at 4.3 KB/sec)
Uploading: https://repository.apache.org/content/repositories/snapshots/org/apache/bigtop/itest/itest-common/0.9.0-SNAPSHOT/maven-metadata.xml
Uploaded: https://repository.apache.org/content/repositories/snapshots/org/apache/bigtop/itest/itest-common/0.9.0-SNAPSHOT/maven-metadata.xml (1005 B at 7.6 KB/sec)
Uploading: https://repository.apache.org/content/repositories/snapshots/org/apache/bigtop/itest/itest-common/maven-metadata.xml
Uploaded: https://repository.apache.org/content/repositories/snapshots/org/apache/bigtop/itest/itest-common/maven-metadata.xml (466 B at 1.9 KB/sec)
Uploading: https://repository.apache.org/content/repositories/snapshots/org/apache/bigtop/itest/itest-common/0.9.0-SNAPSHOT/itest-common-0.9.0-20150126.214611-189-tests.jar
Uploaded: https://repository.apache.org/content/repositories/snapshots/org/apache/bigtop/itest/itest-common/0.9.0-SNAPSHOT/itest-common-0.9.0-20150126.214611-189-tests.jar (70 KB at 385.8 KB/sec)
Uploading: https://repository.apache.org/content/repositories/snapshots/org/apache/bigtop/itest/itest-common/0.9.0-SNAPSHOT/maven-metadata.xml
Uploaded: https://repository.apache.org/content/repositories/snapshots/org/apache/bigtop/itest/itest-common/0.9.0-SNAPSHOT/maven-metadata.xml (1005 B at 6.3 KB/sec)
[INFO] ------------------------------------------------------------------------
[INFO] BUILD SUCCESS
[INFO] ------------------------------------------------------------------------
[INFO] Total time: 28.842s
[INFO] Finished at: Mon Jan 26 21:46:13 UTC 2015
[INFO] Final Memory: 16M/245M
[INFO] ------------------------------------------------------------------------
Waiting for Jenkins to finish collecting data
Build failed in Jenkins: Bigtop-trunk-iTest » iTest: system and integration testing in the cloud #1992
Posted by Apache Jenkins Server <je...@builds.apache.org>.
See <https://builds.apache.org/job/Bigtop-trunk-iTest/org.apache.bigtop.itest$itest-common/1992/>
------------------------------------------
maven3-agent.jar already up to date
maven3-interceptor.jar already up to date
maven3-interceptor-commons.jar already up to date
<===[JENKINS REMOTING CAPACITY]===> channel started
Executing Maven: -B -f <https://builds.apache.org/job/Bigtop-trunk-iTest/org.apache.bigtop.itest$itest-common/ws/pom.xml> -Dmaven.repo.local=/home/jenkins/jenkins-slave/maven-repositories/1 deploy
[INFO] Scanning for projects...
[INFO]
[INFO] ------------------------------------------------------------------------
[INFO] Building iTest: system and integration testing in the cloud 0.9.0-SNAPSHOT
[INFO] ------------------------------------------------------------------------
[INFO]
[INFO] --- groovy-eclipse-compiler:2.8.0-01:add-groovy-build-paths (default-add-groovy-build-paths) @ itest-common ---
[INFO] Adding /src/main/groovy to the list of source folders
[INFO] Adding /src/test/groovy to the list of test source folders
[INFO]
[INFO] --- maven-remote-resources-plugin:1.1:process (default) @ itest-common ---
[INFO] Setting property: classpath.resource.loader.class => 'org.codehaus.plexus.velocity.ContextClassLoaderResourceLoader'.
[INFO] Setting property: velocimacro.messages.on => 'false'.
[INFO] Setting property: resource.loader => 'classpath'.
[INFO] Setting property: resource.manager.logwhenfound => 'false'.
[INFO]
[INFO] --- maven-resources-plugin:2.4:resources (default-resources) @ itest-common ---
[INFO] Using 'UTF-8' encoding to copy filtered resources.
[INFO] skip non existing resourceDirectory <https://builds.apache.org/job/Bigtop-trunk-iTest/org.apache.bigtop.itest$itest-common/ws/src/main/resources>
[INFO] Copying 3 resources
[INFO]
[INFO] --- maven-compiler-plugin:3.1:compile (default-compile) @ itest-common ---
[INFO] Changes detected - recompiling the module!
[INFO] Using Groovy-Eclipse compiler to compile both Java and Groovy files
[INFO]
[INFO] --- maven-resources-plugin:2.4:testResources (default-testResources) @ itest-common ---
[INFO] Using 'UTF-8' encoding to copy filtered resources.
[INFO] skip non existing resourceDirectory <https://builds.apache.org/job/Bigtop-trunk-iTest/org.apache.bigtop.itest$itest-common/ws/src/test/resources>
[INFO] Copying 3 resources
[INFO]
[INFO] --- maven-compiler-plugin:3.1:testCompile (default-testCompile) @ itest-common ---
[INFO] Changes detected - recompiling the module!
[INFO] Using Groovy-Eclipse compiler to compile both Java and Groovy files
[INFO]
[INFO] --- maven-surefire-plugin:2.7:test (default-test) @ itest-common ---
[INFO] Surefire report directory: <https://builds.apache.org/job/Bigtop-trunk-iTest/org.apache.bigtop.itest$itest-common/ws/target/surefire-reports>
-------------------------------------------------------
T E S T S
-------------------------------------------------------
Running org.apache.bigtop.itest.junit.OrderedParameterizedTest
Tests run: 3, Failures: 0, Errors: 0, Skipped: 0, Time elapsed: 0.471 sec
Running org.apache.bigtop.itest.junit.OrderedTest
Tests run: 3, Failures: 0, Errors: 0, Skipped: 0, Time elapsed: 0.008 sec
Running org.apache.bigtop.itest.TestContractJavaProc
Tests run: 2, Failures: 0, Errors: 0, Skipped: 0, Time elapsed: 0.006 sec
Running org.apache.bigtop.itest.pmanager.PackageManagerTest
/etc/cron.monthly/.placeholder
/etc/cron.hourly/.placeholder
/etc/default/cron
/etc/cron.weekly/.placeholder
/etc/cron.d/.placeholder
/etc/cron.daily/.placeholder
/etc/pam.d/cron
/etc/init/cron.conf
/etc/crontab
/.
/etc
/etc/cron.monthly
/etc/cron.monthly/.placeholder
/etc/cron.hourly
/etc/cron.hourly/.placeholder
/etc/default
/etc/default/cron
/etc/cron.weekly
/etc/cron.weekly/.placeholder
/etc/cron.d
/etc/cron.d/.placeholder
/etc/cron.daily
/etc/cron.daily/.placeholder
/etc/pam.d
/etc/pam.d/cron
/etc/init
/etc/init/cron.conf
/etc/init.d
/etc/crontab
/usr
/usr/share
/usr/share/bug
/usr/share/bug/cron
/usr/share/bug/cron/script
/usr/share/bug/cron/control
/usr/share/man
/usr/share/man/man1
/usr/share/man/man1/crontab.1.gz
/usr/share/man/man5
/usr/share/man/man5/crontab.5.gz
/usr/share/man/man8
/usr/share/man/man8/cron.8.gz
/usr/share/doc
/usr/share/doc/cron
/usr/share/doc/cron/README
/usr/share/doc/cron/README.anacron
/usr/share/doc/cron/README.Debian
/usr/share/doc/cron/FEATURES
/usr/share/doc/cron/copyright
/usr/share/doc/cron/examples
/usr/share/doc/cron/examples/crontab2english.pl
/usr/share/doc/cron/examples/cron-stats.pl
/usr/share/doc/cron/examples/cron-tasks-review.sh
/usr/share/doc/cron/NEWS.Debian.gz
/usr/share/doc/cron/changelog.Debian.gz
/usr/share/doc/cron/THANKS
/usr/share/doc/cron/TODO.Debian
/usr/sbin
/usr/sbin/cron
/usr/bin
/usr/bin/crontab
/var
/var/spool
/var/spool/cron
/var/spool/cron/crontabs
/etc/init.d/cron
Tests run: 11, Failures: 0, Errors: 0, Skipped: 3, Time elapsed: 2.003 sec
Running org.apache.bigtop.itest.JUnitUtilsTest
Disclaimer: This test expected to show a failure in an embeded testcase
[junit] Running org.apache.bigtop.itest.DummyTestPassTests run: 1, Failures: 0, Errors: 0, Time elapsed: 0.277 secRunning org.apache.bigtop.itest.DummyTestFail
[junit] Tests run: 1, Failures: 1, Errors: 0, Time elapsed: 0.142 secTEST org.apache.bigtop.itest.DummyTestFail FAILED
[junit] Tests FAILED
Disclaimer: This test expected to show an error in an embeded testcase
[junit] Running org.apache.bigtop.itest.DummyTestError
[junit] Tests run: 1, Failures: 0, Errors: 1, Time elapsed: 0.291 sec
[junit] Test org.apache.bigtop.itest.DummyTestError FAILED
[junit] Running org.apache.bigtop.itest.DummyTestPass
[junit] Tests run: 1, Failures: 0, Errors: 0, Time elapsed: 0.283 sec
[junit] Running org.apache.bigtop.itest.DummyTestPass
[junit] Tests run: 1, Failures: 0, Errors: 0, Time elapsed: 0.274 sec
Tests run: 4, Failures: 0, Errors: 0, Skipped: 0, Time elapsed: 4.489 sec
Running org.apache.bigtop.itest.TestListUtilsTest
Tests run: 1, Failures: 0, Errors: 0, Skipped: 0, Time elapsed: 0.02 sec
Running org.apache.bigtop.itest.JarContentTest
log4j:WARN No appenders could be found for logger (org.apache.bigtop.itest.JarContent).
log4j:WARN Please initialize the log4j system properly.
Tests run: 6, Failures: 0, Errors: 0, Skipped: 0, Time elapsed: 0.812 sec
Running org.apache.bigtop.itest.TestContractJava
Tests run: 2, Failures: 0, Errors: 0, Skipped: 0, Time elapsed: 0.002 sec
Running org.apache.bigtop.itest.shell.ShellTest
Tests run: 2, Failures: 0, Errors: 0, Skipped: 1, Time elapsed: 0.01 sec
Running org.apache.bigtop.itest.posix.UGITest
Tests run: 2, Failures: 0, Errors: 0, Skipped: 0, Time elapsed: 0.038 sec
Running org.apache.bigtop.itest.posix.ServiceTest
Status []
Tests run: 2, Failures: 0, Errors: 0, Skipped: 1, Time elapsed: 0.032 sec
Running org.apache.bigtop.itest.posix.AlternativeTest
Tests run: 1, Failures: 0, Errors: 0, Skipped: 0, Time elapsed: 0.738 sec
Running org.apache.bigtop.itest.TestContractGroovy
Tests run: 2, Failures: 0, Errors: 0, Skipped: 0, Time elapsed: 0.009 sec
Results :
Tests run: 41, Failures: 0, Errors: 0, Skipped: 5
[JENKINS] Recording test results
log4j:WARN No appenders could be found for logger (org.apache.commons.beanutils.converters.BooleanConverter).
log4j:WARN Please initialize the log4j system properly.
[INFO]
[INFO] --- maven-jar-plugin:2.2:jar (default-jar) @ itest-common ---
[INFO] Building jar: <https://builds.apache.org/job/Bigtop-trunk-iTest/org.apache.bigtop.itest$itest-common/ws/target/itest-common-0.9.0-SNAPSHOT.jar>
[INFO]
[INFO] --- maven-jar-plugin:2.2:test-jar (default) @ itest-common ---
[INFO] Building jar: <https://builds.apache.org/job/Bigtop-trunk-iTest/org.apache.bigtop.itest$itest-common/ws/target/itest-common-0.9.0-SNAPSHOT-tests.jar>
[INFO]
[INFO] --- maven-failsafe-plugin:2.17:verify (default) @ itest-common ---
[INFO] Failsafe report directory: <https://builds.apache.org/job/Bigtop-trunk-iTest/org.apache.bigtop.itest$itest-common/ws/target/failsafe-reports>
[WARNING] File encoding has not been set, using platform encoding ISO-8859-1, i.e. build is platform dependent!
[JENKINS] Recording test results
[INFO] ------------------------------------------------------------------------
[INFO] BUILD FAILURE
[INFO] ------------------------------------------------------------------------
[INFO] Total time: 23.940s
[INFO] Finished at: Mon Jan 26 20:24:04 UTC 2015
[INFO] Final Memory: 14M/244M
[INFO] ------------------------------------------------------------------------
Waiting for Jenkins to finish collecting data
[ERROR] Failed to execute goal org.apache.maven.plugins:maven-failsafe-plugin:2.17:verify (default) on project itest-common: <https://builds.apache.org/job/Bigtop-trunk-iTest/org.apache.bigtop.itest$itest-common/ws/target/failsafe-reports/failsafe-summary.xml> (No such file or directory) -> [Help 1]
[ERROR]
[ERROR] To see the full stack trace of the errors, re-run Maven with the -e switch.
[ERROR] Re-run Maven using the -X switch to enable full debug logging.
[ERROR]
[ERROR] For more information about the errors and possible solutions, please read the following articles:
[ERROR] [Help 1] http://cwiki.apache.org/confluence/display/MAVEN/MojoExecutionException
Build failed in Jenkins: Bigtop-trunk-iTest » iTest: system and integration testing in the cloud #1991
Posted by Apache Jenkins Server <je...@builds.apache.org>.
See <https://builds.apache.org/job/Bigtop-trunk-iTest/org.apache.bigtop.itest$itest-common/1991/changes>
Changes:
[cos] BIGTOP-1618. iTest integration tests need only to be bound to verify goal
------------------------------------------
[...truncated 21 lines...]
Downloaded: http://nexus.codehaus.org/snapshots/org/codehaus/groovy/groovy-eclipse-batch/2.3.1-01-SNAPSHOT/maven-metadata.xml (2 KB at 4.2 KB/sec)
Downloading: http://repository.codehaus.org/org/codehaus/groovy/groovy-eclipse-batch/2.3.2-01-SNAPSHOT/maven-metadata.xml
Downloading: http://nexus.codehaus.org/snapshots/org/codehaus/groovy/groovy-eclipse-batch/2.3.2-01-SNAPSHOT/maven-metadata.xml
Downloaded: http://nexus.codehaus.org/snapshots/org/codehaus/groovy/groovy-eclipse-batch/2.3.2-01-SNAPSHOT/maven-metadata.xml (2 KB at 5.0 KB/sec)
Downloading: http://repository.codehaus.org/org/codehaus/groovy/groovy-eclipse-batch/2.3.3-01-SNAPSHOT/maven-metadata.xml
Downloading: http://nexus.codehaus.org/snapshots/org/codehaus/groovy/groovy-eclipse-batch/2.3.3-01-SNAPSHOT/maven-metadata.xml
Downloaded: http://nexus.codehaus.org/snapshots/org/codehaus/groovy/groovy-eclipse-batch/2.3.3-01-SNAPSHOT/maven-metadata.xml (2 KB at 5.0 KB/sec)
Downloading: http://repository.codehaus.org/org/codehaus/groovy/groovy-eclipse-batch/2.3.4-01-SNAPSHOT/maven-metadata.xml
Downloading: http://nexus.codehaus.org/snapshots/org/codehaus/groovy/groovy-eclipse-batch/2.3.4-01-SNAPSHOT/maven-metadata.xml
Downloaded: http://nexus.codehaus.org/snapshots/org/codehaus/groovy/groovy-eclipse-batch/2.3.4-01-SNAPSHOT/maven-metadata.xml (378 B at 1.5 KB/sec)
[INFO]
[INFO] ------------------------------------------------------------------------
[INFO] Building iTest: system and integration testing in the cloud 0.9.0-SNAPSHOT
[INFO] ------------------------------------------------------------------------
[INFO]
[INFO] --- groovy-eclipse-compiler:2.8.0-01:add-groovy-build-paths (default-add-groovy-build-paths) @ itest-common ---
[INFO] Adding /src/main/groovy to the list of source folders
[INFO] Adding /src/test/groovy to the list of test source folders
[INFO]
[INFO] --- maven-remote-resources-plugin:1.1:process (default) @ itest-common ---
[INFO] Setting property: classpath.resource.loader.class => 'org.codehaus.plexus.velocity.ContextClassLoaderResourceLoader'.
[INFO] Setting property: velocimacro.messages.on => 'false'.
[INFO] Setting property: resource.loader => 'classpath'.
[INFO] Setting property: resource.manager.logwhenfound => 'false'.
[INFO]
[INFO] --- maven-resources-plugin:2.4:resources (default-resources) @ itest-common ---
[INFO] Using 'UTF-8' encoding to copy filtered resources.
[INFO] skip non existing resourceDirectory <https://builds.apache.org/job/Bigtop-trunk-iTest/org.apache.bigtop.itest$itest-common/ws/src/main/resources>
[INFO] Copying 3 resources
[INFO]
[INFO] --- maven-compiler-plugin:3.1:compile (default-compile) @ itest-common ---
[INFO] Changes detected - recompiling the module!
[INFO] Using Groovy-Eclipse compiler to compile both Java and Groovy files
[INFO]
[INFO] --- maven-resources-plugin:2.4:testResources (default-testResources) @ itest-common ---
[INFO] Using 'UTF-8' encoding to copy filtered resources.
[INFO] skip non existing resourceDirectory <https://builds.apache.org/job/Bigtop-trunk-iTest/org.apache.bigtop.itest$itest-common/ws/src/test/resources>
[INFO] Copying 3 resources
[INFO]
[INFO] --- maven-compiler-plugin:3.1:testCompile (default-testCompile) @ itest-common ---
[INFO] Changes detected - recompiling the module!
[INFO] Using Groovy-Eclipse compiler to compile both Java and Groovy files
[INFO]
[INFO] --- maven-surefire-plugin:2.7:test (default-test) @ itest-common ---
[INFO] Surefire report directory: <https://builds.apache.org/job/Bigtop-trunk-iTest/org.apache.bigtop.itest$itest-common/ws/target/surefire-reports>
-------------------------------------------------------
T E S T S
-------------------------------------------------------
Running org.apache.bigtop.itest.junit.OrderedParameterizedTest
Tests run: 3, Failures: 0, Errors: 0, Skipped: 0, Time elapsed: 0.447 sec
Running org.apache.bigtop.itest.junit.OrderedTest
Tests run: 3, Failures: 0, Errors: 0, Skipped: 0, Time elapsed: 0.008 sec
Running org.apache.bigtop.itest.TestContractJavaProc
Tests run: 2, Failures: 0, Errors: 0, Skipped: 0, Time elapsed: 0.006 sec
Running org.apache.bigtop.itest.pmanager.PackageManagerTest
/etc/cron.monthly/.placeholder
/etc/cron.hourly/.placeholder
/etc/default/cron
/etc/cron.weekly/.placeholder
/etc/cron.d/.placeholder
/etc/cron.daily/.placeholder
/etc/pam.d/cron
/etc/init/cron.conf
/etc/crontab
/.
/etc
/etc/cron.monthly
/etc/cron.monthly/.placeholder
/etc/cron.hourly
/etc/cron.hourly/.placeholder
/etc/default
/etc/default/cron
/etc/cron.weekly
/etc/cron.weekly/.placeholder
/etc/cron.d
/etc/cron.d/.placeholder
/etc/cron.daily
/etc/cron.daily/.placeholder
/etc/pam.d
/etc/pam.d/cron
/etc/init
/etc/init/cron.conf
/etc/init.d
/etc/crontab
/usr
/usr/share
/usr/share/bug
/usr/share/bug/cron
/usr/share/bug/cron/script
/usr/share/bug/cron/control
/usr/share/man
/usr/share/man/man1
/usr/share/man/man1/crontab.1.gz
/usr/share/man/man5
/usr/share/man/man5/crontab.5.gz
/usr/share/man/man8
/usr/share/man/man8/cron.8.gz
/usr/share/doc
/usr/share/doc/cron
/usr/share/doc/cron/README
/usr/share/doc/cron/README.anacron
/usr/share/doc/cron/README.Debian
/usr/share/doc/cron/FEATURES
/usr/share/doc/cron/copyright
/usr/share/doc/cron/examples
/usr/share/doc/cron/examples/crontab2english.pl
/usr/share/doc/cron/examples/cron-stats.pl
/usr/share/doc/cron/examples/cron-tasks-review.sh
/usr/share/doc/cron/NEWS.Debian.gz
/usr/share/doc/cron/changelog.Debian.gz
/usr/share/doc/cron/THANKS
/usr/share/doc/cron/TODO.Debian
/usr/sbin
/usr/sbin/cron
/usr/bin
/usr/bin/crontab
/var
/var/spool
/var/spool/cron
/var/spool/cron/crontabs
/etc/init.d/cron
Tests run: 11, Failures: 0, Errors: 0, Skipped: 3, Time elapsed: 4.057 sec
Running org.apache.bigtop.itest.JUnitUtilsTest
Disclaimer: This test expected to show a failure in an embeded testcase
[junit] Running org.apache.bigtop.itest.DummyTestPassTests run: 1, Failures: 0, Errors: 0, Time elapsed: 0.278 secRunning org.apache.bigtop.itest.DummyTestFailTests run: 1, Failures: 1, Errors: 0, Time elapsed: 0.132 secTEST org.apache.bigtop.itest.DummyTestFail FAILED
[junit] Tests FAILED
Disclaimer: This test expected to show an error in an embeded testcase
[junit] Running org.apache.bigtop.itest.DummyTestError
[junit] Tests run: 1, Failures: 0, Errors: 1, Time elapsed: 0.27 sec
[junit] Test org.apache.bigtop.itest.DummyTestError FAILED
[junit] Running org.apache.bigtop.itest.DummyTestPass
[junit] Tests run: 1, Failures: 0, Errors: 0, Time elapsed: 0.256 sec
[junit] Running org.apache.bigtop.itest.DummyTestPass
[junit] Tests run: 1, Failures: 0, Errors: 0, Time elapsed: 0.264 sec
Tests run: 4, Failures: 0, Errors: 0, Skipped: 0, Time elapsed: 4.396 sec
Running org.apache.bigtop.itest.TestListUtilsTest
Tests run: 1, Failures: 0, Errors: 0, Skipped: 0, Time elapsed: 0.02 sec
Running org.apache.bigtop.itest.JarContentTest
log4j:WARN No appenders could be found for logger (org.apache.bigtop.itest.JarContent).
log4j:WARN Please initialize the log4j system properly.
Tests run: 6, Failures: 0, Errors: 0, Skipped: 0, Time elapsed: 0.92 sec
Running org.apache.bigtop.itest.TestContractJava
Tests run: 2, Failures: 0, Errors: 0, Skipped: 0, Time elapsed: 0.002 sec
Running org.apache.bigtop.itest.shell.ShellTest
Tests run: 2, Failures: 0, Errors: 0, Skipped: 1, Time elapsed: 0.009 sec
Running org.apache.bigtop.itest.posix.UGITest
Tests run: 2, Failures: 0, Errors: 0, Skipped: 0, Time elapsed: 0.035 sec
Running org.apache.bigtop.itest.posix.ServiceTest
Status []
Tests run: 2, Failures: 0, Errors: 0, Skipped: 1, Time elapsed: 0.107 sec
Running org.apache.bigtop.itest.posix.AlternativeTest
Tests run: 1, Failures: 0, Errors: 0, Skipped: 0, Time elapsed: 1.839 sec
Running org.apache.bigtop.itest.TestContractGroovy
Tests run: 2, Failures: 0, Errors: 0, Skipped: 0, Time elapsed: 0.009 sec
Results :
Tests run: 41, Failures: 0, Errors: 0, Skipped: 5
[JENKINS] Recording test results
log4j:WARN No appenders could be found for logger (org.apache.commons.beanutils.converters.BooleanConverter).
log4j:WARN Please initialize the log4j system properly.
[INFO]
[INFO] --- maven-jar-plugin:2.2:jar (default-jar) @ itest-common ---
[INFO] Building jar: <https://builds.apache.org/job/Bigtop-trunk-iTest/org.apache.bigtop.itest$itest-common/ws/target/itest-common-0.9.0-SNAPSHOT.jar>
[INFO]
[INFO] --- maven-jar-plugin:2.2:test-jar (default) @ itest-common ---
[INFO] Building jar: <https://builds.apache.org/job/Bigtop-trunk-iTest/org.apache.bigtop.itest$itest-common/ws/target/itest-common-0.9.0-SNAPSHOT-tests.jar>
[INFO]
[INFO] --- maven-failsafe-plugin:2.17:verify (default) @ itest-common ---
[INFO] Failsafe report directory: <https://builds.apache.org/job/Bigtop-trunk-iTest/org.apache.bigtop.itest$itest-common/ws/target/failsafe-reports>
[WARNING] File encoding has not been set, using platform encoding ISO-8859-1, i.e. build is platform dependent!
[ERROR] There are test failures.
Please refer to <https://builds.apache.org/job/Bigtop-trunk-iTest/org.apache.bigtop.itest$itest-common/ws/target/failsafe-reports> for the individual test results.
[JENKINS] Recording test results
hudson.AbortException: Test reports were found but none of them are new. Did tests run?
For example, <https://builds.apache.org/job/Bigtop-trunk-iTest/org.apache.bigtop.itest$itest-common/ws/target/failsafe-reports/TEST-org.apache.bigtop.itest.failures.IntegrationTestClusterFailures.xml> is 10 days old
at hudson.tasks.junit.TestResult.parse(TestResult.java:213)
at hudson.maven.reporters.SurefireArchiver.postExecute(SurefireArchiver.java:148)
at hudson.maven.Maven3Builder$MavenExecutionListener.recordMojoEnded(Maven3Builder.java:634)
at hudson.maven.Maven3Builder$MavenExecutionListener.mojoSucceeded(Maven3Builder.java:615)
at org.apache.maven.lifecycle.internal.DefaultExecutionEventCatapult.fire(DefaultExecutionEventCatapult.java:87)
at org.apache.maven.lifecycle.internal.DefaultExecutionEventCatapult.fire(DefaultExecutionEventCatapult.java:42)
at org.apache.maven.lifecycle.internal.MojoExecutor.execute(MojoExecutor.java:228)
at org.apache.maven.lifecycle.internal.MojoExecutor.execute(MojoExecutor.java:153)
at org.apache.maven.lifecycle.internal.MojoExecutor.execute(MojoExecutor.java:145)
at org.apache.maven.lifecycle.internal.LifecycleModuleBuilder.buildProject(LifecycleModuleBuilder.java:84)
at org.apache.maven.lifecycle.internal.LifecycleModuleBuilder.buildProject(LifecycleModuleBuilder.java:59)
at org.apache.maven.lifecycle.internal.LifecycleStarter.singleThreadedBuild(LifecycleStarter.java:183)
at org.apache.maven.lifecycle.internal.LifecycleStarter.execute(LifecycleStarter.java:161)
at org.apache.maven.DefaultMaven.doExecute(DefaultMaven.java:320)
at org.apache.maven.DefaultMaven.execute(DefaultMaven.java:156)
at org.jvnet.hudson.maven3.launcher.Maven3Launcher.main(Maven3Launcher.java:117)
at sun.reflect.NativeMethodAccessorImpl.invoke0(Native Method)
at sun.reflect.NativeMethodAccessorImpl.invoke(NativeMethodAccessorImpl.java:39)
at sun.reflect.DelegatingMethodAccessorImpl.invoke(DelegatingMethodAccessorImpl.java:25)
at java.lang.reflect.Method.invoke(Method.java:597)
at org.codehaus.plexus.classworlds.launcher.Launcher.launchStandard(Launcher.java:329)
at org.codehaus.plexus.classworlds.launcher.Launcher.launch(Launcher.java:239)
at org.jvnet.hudson.maven3.agent.Maven3Main.launch(Maven3Main.java:178)
at sun.reflect.NativeMethodAccessorImpl.invoke0(Native Method)
at sun.reflect.NativeMethodAccessorImpl.invoke(NativeMethodAccessorImpl.java:39)
at sun.reflect.DelegatingMethodAccessorImpl.invoke(DelegatingMethodAccessorImpl.java:25)
at java.lang.reflect.Method.invoke(Method.java:597)
at hudson.maven.Maven3Builder.call(Maven3Builder.java:136)
at hudson.maven.Maven3Builder.call(Maven3Builder.java:71)
at hudson.remoting.UserRequest.perform(UserRequest.java:118)
at hudson.remoting.UserRequest.perform(UserRequest.java:48)
at hudson.remoting.Request$2.run(Request.java:328)
at hudson.remoting.InterceptingExecutorService$1.call(InterceptingExecutorService.java:72)
at java.util.concurrent.FutureTask$Sync.innerRun(FutureTask.java:303)
at java.util.concurrent.FutureTask.run(FutureTask.java:138)
at java.util.concurrent.ThreadPoolExecutor$Worker.runTask(ThreadPoolExecutor.java:895)
at java.util.concurrent.ThreadPoolExecutor$Worker.run(ThreadPoolExecutor.java:918)
at java.lang.Thread.run(Thread.java:662)
[INFO]
[INFO] --- maven-install-plugin:2.3:install (default-install) @ itest-common ---
[INFO] Installing <https://builds.apache.org/job/Bigtop-trunk-iTest/org.apache.bigtop.itest$itest-common/ws/target/itest-common-0.9.0-SNAPSHOT.jar> to /home/jenkins/jenkins-slave/maven-repositories/0/org/apache/bigtop/itest/itest-common/0.9.0-SNAPSHOT/itest-common-0.9.0-SNAPSHOT.jar
[INFO] Installing <https://builds.apache.org/job/Bigtop-trunk-iTest/org.apache.bigtop.itest$itest-common/ws/pom.xml> to /home/jenkins/jenkins-slave/maven-repositories/0/org/apache/bigtop/itest/itest-common/0.9.0-SNAPSHOT/itest-common-0.9.0-SNAPSHOT.pom
[INFO] Installing <https://builds.apache.org/job/Bigtop-trunk-iTest/org.apache.bigtop.itest$itest-common/ws/target/itest-common-0.9.0-SNAPSHOT-tests.jar> to /home/jenkins/jenkins-slave/maven-repositories/0/org/apache/bigtop/itest/itest-common/0.9.0-SNAPSHOT/itest-common-0.9.0-SNAPSHOT-tests.jar
[INFO]
[INFO] --- maven-deploy-plugin:2.5:deploy (default-deploy) @ itest-common ---
Downloading: https://repository.apache.org/content/repositories/snapshots/org/apache/bigtop/itest/itest-common/0.9.0-SNAPSHOT/maven-metadata.xml
Downloaded: https://repository.apache.org/content/repositories/snapshots/org/apache/bigtop/itest/itest-common/0.9.0-SNAPSHOT/maven-metadata.xml (1005 B at 1.3 KB/sec)
Uploading: https://repository.apache.org/content/repositories/snapshots/org/apache/bigtop/itest/itest-common/0.9.0-SNAPSHOT/itest-common-0.9.0-20150126.194651-188.jar
Uploaded: https://repository.apache.org/content/repositories/snapshots/org/apache/bigtop/itest/itest-common/0.9.0-SNAPSHOT/itest-common-0.9.0-20150126.194651-188.jar (206 KB at 1185.2 KB/sec)
Uploading: https://repository.apache.org/content/repositories/snapshots/org/apache/bigtop/itest/itest-common/0.9.0-SNAPSHOT/itest-common-0.9.0-20150126.194651-188.pom
Uploaded: https://repository.apache.org/content/repositories/snapshots/org/apache/bigtop/itest/itest-common/0.9.0-SNAPSHOT/itest-common-0.9.0-20150126.194651-188.pom (6 KB at 32.9 KB/sec)
Downloading: https://repository.apache.org/content/repositories/snapshots/org/apache/bigtop/itest/itest-common/maven-metadata.xml
Downloaded: https://repository.apache.org/content/repositories/snapshots/org/apache/bigtop/itest/itest-common/maven-metadata.xml (466 B at 5.7 KB/sec)
Uploading: https://repository.apache.org/content/repositories/snapshots/org/apache/bigtop/itest/itest-common/0.9.0-SNAPSHOT/maven-metadata.xml
Uploaded: https://repository.apache.org/content/repositories/snapshots/org/apache/bigtop/itest/itest-common/0.9.0-SNAPSHOT/maven-metadata.xml (1005 B at 6.5 KB/sec)
Uploading: https://repository.apache.org/content/repositories/snapshots/org/apache/bigtop/itest/itest-common/maven-metadata.xml
Uploaded: https://repository.apache.org/content/repositories/snapshots/org/apache/bigtop/itest/itest-common/maven-metadata.xml (466 B at 2.6 KB/sec)
Uploading: https://repository.apache.org/content/repositories/snapshots/org/apache/bigtop/itest/itest-common/0.9.0-SNAPSHOT/itest-common-0.9.0-20150126.194651-188-tests.jar
Uploaded: https://repository.apache.org/content/repositories/snapshots/org/apache/bigtop/itest/itest-common/0.9.0-SNAPSHOT/itest-common-0.9.0-20150126.194651-188-tests.jar (70 KB at 104.4 KB/sec)
Uploading: https://repository.apache.org/content/repositories/snapshots/org/apache/bigtop/itest/itest-common/0.9.0-SNAPSHOT/maven-metadata.xml
Uploaded: https://repository.apache.org/content/repositories/snapshots/org/apache/bigtop/itest/itest-common/0.9.0-SNAPSHOT/maven-metadata.xml (1005 B at 3.5 KB/sec)
[INFO] ------------------------------------------------------------------------
[INFO] BUILD SUCCESS
[INFO] ------------------------------------------------------------------------
[INFO] Total time: 33.313s
[INFO] Finished at: Mon Jan 26 19:46:53 UTC 2015
[INFO] Final Memory: 17M/246M
[INFO] ------------------------------------------------------------------------
Waiting for Jenkins to finish collecting data
Jenkins build is still unstable: Bigtop-trunk-iTest » iTest: system and integration testing in the cloud #1990
Posted by Apache Jenkins Server <je...@builds.apache.org>.
See <https://builds.apache.org/job/Bigtop-trunk-iTest/org.apache.bigtop.itest$itest-common/1990/>
Jenkins build is still unstable: Bigtop-trunk-iTest » iTest: system and integration testing in the cloud #1989
Posted by Apache Jenkins Server <je...@builds.apache.org>.
See <https://builds.apache.org/job/Bigtop-trunk-iTest/org.apache.bigtop.itest$itest-common/1989/>
Jenkins build is still unstable: Bigtop-trunk-iTest » iTest: system and integration testing in the cloud #1988
Posted by Apache Jenkins Server <je...@builds.apache.org>.
See <https://builds.apache.org/job/Bigtop-trunk-iTest/org.apache.bigtop.itest$itest-common/1988/>
Jenkins build is still unstable: Bigtop-trunk-iTest » iTest: system and integration testing in the cloud #1987
Posted by Apache Jenkins Server <je...@builds.apache.org>.
See <https://builds.apache.org/job/Bigtop-trunk-iTest/org.apache.bigtop.itest$itest-common/1987/>
Jenkins build is still unstable: Bigtop-trunk-iTest » iTest: system and integration testing in the cloud #1986
Posted by Apache Jenkins Server <je...@builds.apache.org>.
See <https://builds.apache.org/job/Bigtop-trunk-iTest/org.apache.bigtop.itest$itest-common/1986/>
Jenkins build is still unstable: Bigtop-trunk-iTest » iTest: system and integration testing in the cloud #1985
Posted by Apache Jenkins Server <je...@builds.apache.org>.
See <https://builds.apache.org/job/Bigtop-trunk-iTest/org.apache.bigtop.itest$itest-common/1985/>
Jenkins build is still unstable: Bigtop-trunk-iTest » iTest: system and integration testing in the cloud #1984
Posted by Apache Jenkins Server <je...@builds.apache.org>.
See <https://builds.apache.org/job/Bigtop-trunk-iTest/org.apache.bigtop.itest$itest-common/1984/>