You are viewing a plain text version of this content. The canonical link for it is here.
Posted to builds@beam.apache.org by Apache Jenkins Server <je...@builds.apache.org> on 2022/02/04 08:28:03 UTC
Build failed in Jenkins: beam_PostCommit_Python37 #4844
See <https://ci-beam.apache.org/job/beam_PostCommit_Python37/4844/display/redirect?page=changes>
Changes:
[Kiley Sok] Allow Java 17 to be used in SDK
[Kiley Sok] add testing support
[Kiley Sok] Add more testing support for java 17
[Kiley Sok] workaround for jamm
[Kiley Sok] Add Jenkins test for Java 17
[Kiley Sok] Fix jvm hex and skip errorprone
[Kiley Sok] Fix display data for anonymous classes
[Kiley Sok] fix jpms tests
[Kiley Sok] skip zetasql
[Kiley Sok] spotless
[Kiley Sok] spotless
[Kiley Sok] Fix trigger
[Kiley Sok] skip checker framework
[Kiley Sok] fix app name
[Kiley Sok] remove duplicate property check
[Heejong Lee] [BEAM-13813] Add support for URL artifact to extractStagingToPath
[avilovpavel6] Remove Python SQL Test example from catalog
[noreply] [BEAM-13024] Unify PipelineOptions behavior (#16719)
[noreply] Update sdks/go/pkg/beam/artifact/materialize_test.go
[noreply] Merge pull request #16605 from [BEAM-13634][Playground] Create a
[noreply] Merge pull request #16593 from [BEAM-13725][Playground] Add graph to the
[noreply] Merge pull request #16699 from [BEAM-13789][Playground] Change logic of
------------------------------------------
[...truncated 38.13 MB...]
apache_beam/io/gcp/bigquery.py:2138
apache_beam/io/gcp/bigquery.py:2138
apache_beam/io/gcp/bigquery.py:2138
apache_beam/io/gcp/bigquery.py:2138
apache_beam/io/gcp/bigquery.py:2138
apache_beam/io/gcp/bigquery.py:2138
apache_beam/io/gcp/bigquery.py:2138
<https://ci-beam.apache.org/job/beam_PostCommit_Python37/ws/src/sdks/python/apache_beam/io/gcp/bigquery.py>:2138: BeamDeprecationWarning: options is deprecated since First stable release. References to <pipeline>.options will not be supported
is_streaming_pipeline = p.options.view_as(StandardOptions).streaming
apache_beam/io/gcp/bigquery.py:2144
apache_beam/io/gcp/bigquery.py:2144
apache_beam/io/gcp/bigquery.py:2144
apache_beam/io/gcp/bigquery.py:2144
apache_beam/io/gcp/bigquery.py:2144
apache_beam/io/gcp/bigquery.py:2144
apache_beam/io/gcp/bigquery.py:2144
apache_beam/io/gcp/bigquery.py:2144
apache_beam/io/gcp/bigquery.py:2144
apache_beam/io/gcp/bigquery.py:2144
apache_beam/io/gcp/bigquery.py:2144
apache_beam/io/gcp/bigquery.py:2144
apache_beam/io/gcp/bigquery.py:2144
apache_beam/io/gcp/bigquery.py:2144
apache_beam/io/gcp/bigquery.py:2144
apache_beam/io/gcp/bigquery.py:2144
apache_beam/io/gcp/bigquery.py:2144
apache_beam/io/gcp/bigquery.py:2144
apache_beam/io/gcp/bigquery.py:2144
apache_beam/io/gcp/bigquery.py:2144
apache_beam/io/gcp/bigquery.py:2144
apache_beam/io/gcp/bigquery.py:2144
apache_beam/io/gcp/bigquery.py:2144
apache_beam/io/gcp/bigquery.py:2144
<https://ci-beam.apache.org/job/beam_PostCommit_Python37/ws/src/sdks/python/apache_beam/io/gcp/bigquery.py>:2144: BeamDeprecationWarning: options is deprecated since First stable release. References to <pipeline>.options will not be supported
experiments = p.options.view_as(DebugOptions).experiments or []
apache_beam/io/gcp/bigquery_file_loads.py:1128
apache_beam/io/gcp/bigquery_file_loads.py:1128
apache_beam/io/gcp/bigquery_file_loads.py:1128
apache_beam/io/gcp/bigquery_file_loads.py:1128
apache_beam/io/gcp/bigquery_file_loads.py:1128
apache_beam/io/gcp/bigquery_file_loads.py:1128
apache_beam/io/gcp/bigquery_file_loads.py:1128
apache_beam/io/gcp/bigquery_file_loads.py:1128
apache_beam/io/gcp/bigquery_file_loads.py:1128
apache_beam/io/gcp/bigquery_file_loads.py:1128
apache_beam/io/gcp/bigquery_file_loads.py:1128
apache_beam/io/gcp/bigquery_file_loads.py:1128
apache_beam/io/gcp/bigquery_file_loads.py:1128
apache_beam/io/gcp/bigquery_file_loads.py:1128
apache_beam/io/gcp/bigquery_file_loads.py:1128
apache_beam/io/gcp/bigquery_file_loads.py:1128
apache_beam/io/gcp/bigquery_file_loads.py:1128
<https://ci-beam.apache.org/job/beam_PostCommit_Python37/ws/src/sdks/python/apache_beam/io/gcp/bigquery_file_loads.py>:1128: BeamDeprecationWarning: options is deprecated since First stable release. References to <pipeline>.options will not be supported
temp_location = p.options.view_as(GoogleCloudOptions).temp_location
apache_beam/io/gcp/bigquery_file_loads.py:1130
apache_beam/io/gcp/bigquery_file_loads.py:1130
apache_beam/io/gcp/bigquery_file_loads.py:1130
apache_beam/io/gcp/bigquery_file_loads.py:1130
apache_beam/io/gcp/bigquery_file_loads.py:1130
apache_beam/io/gcp/bigquery_file_loads.py:1130
apache_beam/io/gcp/bigquery_file_loads.py:1130
apache_beam/io/gcp/bigquery_file_loads.py:1130
apache_beam/io/gcp/bigquery_file_loads.py:1130
apache_beam/io/gcp/bigquery_file_loads.py:1130
apache_beam/io/gcp/bigquery_file_loads.py:1130
apache_beam/io/gcp/bigquery_file_loads.py:1130
apache_beam/io/gcp/bigquery_file_loads.py:1130
apache_beam/io/gcp/bigquery_file_loads.py:1130
apache_beam/io/gcp/bigquery_file_loads.py:1130
apache_beam/io/gcp/bigquery_file_loads.py:1130
apache_beam/io/gcp/bigquery_file_loads.py:1130
<https://ci-beam.apache.org/job/beam_PostCommit_Python37/ws/src/sdks/python/apache_beam/io/gcp/bigquery_file_loads.py>:1130: BeamDeprecationWarning: options is deprecated since First stable release. References to <pipeline>.options will not be supported
p.options.view_as(GoogleCloudOptions).job_name or 'AUTOMATIC_JOB_NAME')
apache_beam/io/gcp/bigquery.py:2437
apache_beam/io/gcp/bigquery.py:2437
apache_beam/io/gcp/bigquery.py:2437
apache_beam/io/gcp/bigquery.py:2437
apache_beam/io/gcp/bigquery.py:2437
apache_beam/io/gcp/bigquery.py:2437
apache_beam/io/gcp/bigquery.py:2437
apache_beam/io/gcp/bigquery.py:2437
apache_beam/io/gcp/bigquery.py:2437
apache_beam/io/gcp/bigquery.py:2437
apache_beam/io/gcp/bigquery.py:2437
apache_beam/io/gcp/bigquery.py:2437
apache_beam/io/gcp/bigquery.py:2437
apache_beam/io/gcp/bigquery.py:2437
<https://ci-beam.apache.org/job/beam_PostCommit_Python37/ws/src/sdks/python/apache_beam/io/gcp/bigquery.py>:2437: BeamDeprecationWarning: options is deprecated since First stable release. References to <pipeline>.options will not be supported
temp_location = pcoll.pipeline.options.view_as(
apache_beam/io/gcp/bigquery.py:2439
apache_beam/io/gcp/bigquery.py:2439
apache_beam/io/gcp/bigquery.py:2439
apache_beam/io/gcp/bigquery.py:2439
apache_beam/io/gcp/bigquery.py:2439
apache_beam/io/gcp/bigquery.py:2439
apache_beam/io/gcp/bigquery.py:2439
apache_beam/io/gcp/bigquery.py:2439
apache_beam/io/gcp/bigquery.py:2439
apache_beam/io/gcp/bigquery.py:2439
apache_beam/io/gcp/bigquery.py:2439
apache_beam/io/gcp/bigquery.py:2439
apache_beam/io/gcp/bigquery.py:2439
apache_beam/io/gcp/bigquery.py:2439
<https://ci-beam.apache.org/job/beam_PostCommit_Python37/ws/src/sdks/python/apache_beam/io/gcp/bigquery.py>:2439: BeamDeprecationWarning: options is deprecated since First stable release. References to <pipeline>.options will not be supported
job_name = pcoll.pipeline.options.view_as(GoogleCloudOptions).job_name
apache_beam/io/gcp/bigquery.py:2470
apache_beam/io/gcp/bigquery.py:2470
apache_beam/io/gcp/bigquery.py:2470
apache_beam/io/gcp/bigquery.py:2470
apache_beam/io/gcp/bigquery.py:2470
apache_beam/io/gcp/bigquery.py:2470
apache_beam/io/gcp/bigquery.py:2470
apache_beam/io/gcp/bigquery.py:2470
apache_beam/io/gcp/bigquery.py:2470
apache_beam/io/gcp/bigquery.py:2470
apache_beam/io/gcp/bigquery.py:2470
apache_beam/io/gcp/bigquery.py:2470
apache_beam/io/gcp/bigquery.py:2470
apache_beam/io/gcp/bigquery.py:2470
<https://ci-beam.apache.org/job/beam_PostCommit_Python37/ws/src/sdks/python/apache_beam/io/gcp/bigquery.py>:2470: BeamDeprecationWarning: options is deprecated since First stable release. References to <pipeline>.options will not be supported
| _PassThroughThenCleanup(files_to_remove_pcoll))
apache_beam/examples/dataframe/flight_delays.py:45
<https://ci-beam.apache.org/job/beam_PostCommit_Python37/ws/src/sdks/python/apache_beam/examples/dataframe/flight_delays.py>:45: FutureWarning: Dropping of nuisance columns in DataFrame reductions (with 'numeric_only=None') is deprecated; in a future version this will raise TypeError. Select only valid columns before calling the reduction.
return airline_df[at_top_airports].mean()
apache_beam/dataframe/io.py:632
apache_beam/dataframe/io.py:632
apache_beam/dataframe/io.py:632
<https://ci-beam.apache.org/job/beam_PostCommit_Python37/ws/src/sdks/python/apache_beam/dataframe/io.py>:632: FutureWarning: WriteToFiles is experimental.
sink=lambda _: _WriteToPandasFileSink(
apache_beam/io/fileio.py:550
apache_beam/io/fileio.py:550
apache_beam/io/fileio.py:550
<https://ci-beam.apache.org/job/beam_PostCommit_Python37/ws/src/sdks/python/apache_beam/io/fileio.py>:550: BeamDeprecationWarning: options is deprecated since First stable release. References to <pipeline>.options will not be supported
p.options.view_as(GoogleCloudOptions).temp_location or
apache_beam/io/gcp/bigquery.py:2134
apache_beam/io/gcp/bigquery.py:2134
apache_beam/io/gcp/bigquery.py:2134
apache_beam/io/gcp/bigquery.py:2134
apache_beam/io/gcp/bigquery.py:2134
apache_beam/io/gcp/bigquery.py:2134
apache_beam/io/gcp/bigquery.py:2134
apache_beam/io/gcp/bigquery.py:2134
apache_beam/io/gcp/bigquery.py:2134
apache_beam/io/gcp/bigquery.py:2134
apache_beam/io/gcp/bigquery.py:2134
apache_beam/io/gcp/bigquery.py:2134
<https://ci-beam.apache.org/job/beam_PostCommit_Python37/ws/src/sdks/python/apache_beam/io/gcp/bigquery.py>:2134: BeamDeprecationWarning: options is deprecated since First stable release. References to <pipeline>.options will not be supported
self.table_reference.projectId = pcoll.pipeline.options.view_as(
apache_beam/io/gcp/tests/utils.py:100
<https://ci-beam.apache.org/job/beam_PostCommit_Python37/ws/src/sdks/python/apache_beam/io/gcp/tests/utils.py>:100: PendingDeprecationWarning: Client.dataset is deprecated and will be removed in a future version. Use a string like 'my_project.my_dataset' or a cloud.google.bigquery.DatasetReference object, instead.
table_ref = client.dataset(dataset_id).table(table_id)
apache_beam/io/gcp/bigquery_test.py:1181
<https://ci-beam.apache.org/job/beam_PostCommit_Python37/ws/src/sdks/python/apache_beam/io/gcp/bigquery_test.py>:1181: BeamDeprecationWarning: options is deprecated since First stable release. References to <pipeline>.options will not be supported
streaming = self.test_pipeline.options.view_as(StandardOptions).streaming
apache_beam/io/gcp/bigquery_read_it_test.py:167
<https://ci-beam.apache.org/job/beam_PostCommit_Python37/ws/src/sdks/python/apache_beam/io/gcp/bigquery_read_it_test.py>:167: BeamDeprecationWarning: BigQuerySource is deprecated since 2.25.0. Use ReadFromBigQuery instead.
beam.io.BigQuerySource(query=self.query, use_standard_sql=True)))
apache_beam/ml/gcp/cloud_dlp_it_test.py:77
<https://ci-beam.apache.org/job/beam_PostCommit_Python37/ws/src/sdks/python/apache_beam/ml/gcp/cloud_dlp_it_test.py>:77: FutureWarning: MaskDetectedDetails is experimental.
inspection_config=INSPECT_CONFIG))
apache_beam/io/gcp/big_query_query_to_table_pipeline.py:84
apache_beam/io/gcp/big_query_query_to_table_pipeline.py:84
<https://ci-beam.apache.org/job/beam_PostCommit_Python37/ws/src/sdks/python/apache_beam/io/gcp/big_query_query_to_table_pipeline.py>:84: BeamDeprecationWarning: BigQuerySource is deprecated since 2.25.0. Use ReadFromBigQuery instead.
kms_key=kms_key))
apache_beam/runners/dataflow/ptransform_overrides.py:323
apache_beam/runners/dataflow/ptransform_overrides.py:323
<https://ci-beam.apache.org/job/beam_PostCommit_Python37/ws/src/sdks/python/apache_beam/runners/dataflow/ptransform_overrides.py>:323: BeamDeprecationWarning: BigQuerySink is deprecated since 2.11.0. Use WriteToBigQuery instead.
kms_key=self.kms_key))
apache_beam/io/gcp/bigquery_read_it_test.py:556
<https://ci-beam.apache.org/job/beam_PostCommit_Python37/ws/src/sdks/python/apache_beam/io/gcp/bigquery_read_it_test.py>:556: BeamDeprecationWarning: BigQuerySource is deprecated since 2.25.0. Use ReadFromBigQuery instead.
beam.io.BigQuerySource(query=self.query, use_standard_sql=True)))
apache_beam/ml/gcp/cloud_dlp_it_test.py:87
<https://ci-beam.apache.org/job/beam_PostCommit_Python37/ws/src/sdks/python/apache_beam/ml/gcp/cloud_dlp_it_test.py>:87: FutureWarning: InspectForDetails is experimental.
| beam.ParDo(extract_inspection_results).with_outputs(
apache_beam/io/gcp/bigquery_read_it_test.py:670
<https://ci-beam.apache.org/job/beam_PostCommit_Python37/ws/src/sdks/python/apache_beam/io/gcp/bigquery_read_it_test.py>:670: FutureWarning: ReadAllFromBigQuery is experimental.
| beam.io.ReadAllFromBigQuery())
apache_beam/io/gcp/bigquery.py:2611
<https://ci-beam.apache.org/job/beam_PostCommit_Python37/ws/src/sdks/python/apache_beam/io/gcp/bigquery.py>:2611: BeamDeprecationWarning: options is deprecated since First stable release. References to <pipeline>.options will not be supported
job_name = pcoll.pipeline.options.view_as(GoogleCloudOptions).job_name
apache_beam/io/gcp/bigquery.py:2612
<https://ci-beam.apache.org/job/beam_PostCommit_Python37/ws/src/sdks/python/apache_beam/io/gcp/bigquery.py>:2612: BeamDeprecationWarning: options is deprecated since First stable release. References to <pipeline>.options will not be supported
project = pcoll.pipeline.options.view_as(GoogleCloudOptions).project
apache_beam/io/gcp/bigquery.py:2625
<https://ci-beam.apache.org/job/beam_PostCommit_Python37/ws/src/sdks/python/apache_beam/io/gcp/bigquery.py>:2625: BeamDeprecationWarning: options is deprecated since First stable release. References to <pipeline>.options will not be supported
options=pcoll.pipeline.options,
-- Docs: https://docs.pytest.org/en/latest/warnings.html
- generated xml file: <https://ci-beam.apache.org/job/beam_PostCommit_Python37/ws/src/sdks/python/pytest_postCommitIT-df-py37.xml> -
[31m[1m======= 2 failed, 57 passed, 9 skipped, 172 warnings in 6361.95 seconds ========[0m
> Task :sdks:python:test-suites:dataflow:py37:postCommitIT FAILED
> Task :sdks:python:test-suites:dataflow:py37:spannerioIT
FAILURE: Build failed with an exception.
* Where:
Script '<https://ci-beam.apache.org/job/beam_PostCommit_Python37/ws/src/sdks/python/test-suites/dataflow/common.gradle'> line: 120
* What went wrong:
Execution failed for task ':sdks:python:test-suites:dataflow:py37:postCommitIT'.
> Process 'command 'sh'' finished with non-zero exit value 1
* Try:
> Run with --stacktrace option to get the stack trace.
> Run with --info or --debug option to get more log output.
> Run with --scan to get full insights.
* Get more help at https://help.gradle.org
Deprecated Gradle features were used in this build, making it incompatible with Gradle 8.0.
You can use '--warning-mode all' to show the individual deprecation warnings and determine if they come from your own scripts or plugins.
See https://docs.gradle.org/7.3.2/userguide/command_line_interface.html#sec:command_line_warnings
Execution optimizations have been disabled for 1 invalid unit(s) of work during this build to ensure correctness.
Please consult deprecation warnings for more details.
BUILD FAILED in 2h 27m 26s
222 actionable tasks: 167 executed, 49 from cache, 6 up-to-date
Publishing build scan...
https://gradle.com/s/nxkazjahlzp7a
Build step 'Invoke Gradle script' changed build result to FAILURE
Build step 'Invoke Gradle script' marked build as failure
---------------------------------------------------------------------
To unsubscribe, e-mail: builds-unsubscribe@beam.apache.org
For additional commands, e-mail: builds-help@beam.apache.org
Jenkins build is back to normal : beam_PostCommit_Python37 #4847
Posted by Apache Jenkins Server <je...@builds.apache.org>.
See <https://ci-beam.apache.org/job/beam_PostCommit_Python37/4847/display/redirect?page=changes>
---------------------------------------------------------------------
To unsubscribe, e-mail: builds-unsubscribe@beam.apache.org
For additional commands, e-mail: builds-help@beam.apache.org
Build failed in Jenkins: beam_PostCommit_Python37 #4846
Posted by Apache Jenkins Server <je...@builds.apache.org>.
See <https://ci-beam.apache.org/job/beam_PostCommit_Python37/4846/display/redirect?page=changes>
Changes:
[mmack] [BEAM-13663] Remove unused duplicate option for AWS client configuration
[mmack] [BEAM-13203] Deprecate SnsIO.writeAsync for AWS Sdk v2 due to risk of
[noreply] [BEAM-13828] Fix stale bot (#16734)
------------------------------------------
[...truncated 48.30 MB...]
apache_beam/io/gcp/bigquery.py:2439
apache_beam/io/gcp/bigquery.py:2439
apache_beam/io/gcp/bigquery.py:2439
apache_beam/io/gcp/bigquery.py:2439
apache_beam/io/gcp/bigquery.py:2439
apache_beam/io/gcp/bigquery.py:2439
apache_beam/io/gcp/bigquery.py:2439
apache_beam/io/gcp/bigquery.py:2439
apache_beam/io/gcp/bigquery.py:2439
apache_beam/io/gcp/bigquery.py:2439
apache_beam/io/gcp/bigquery.py:2439
<https://ci-beam.apache.org/job/beam_PostCommit_Python37/ws/src/sdks/python/apache_beam/io/gcp/bigquery.py>:2439: BeamDeprecationWarning: options is deprecated since First stable release. References to <pipeline>.options will not be supported
job_name = pcoll.pipeline.options.view_as(GoogleCloudOptions).job_name
apache_beam/io/gcp/bigquery.py:2470
apache_beam/io/gcp/bigquery.py:2470
apache_beam/io/gcp/bigquery.py:2470
apache_beam/io/gcp/bigquery.py:2470
apache_beam/io/gcp/bigquery.py:2470
apache_beam/io/gcp/bigquery.py:2470
apache_beam/io/gcp/bigquery.py:2470
apache_beam/io/gcp/bigquery.py:2470
apache_beam/io/gcp/bigquery.py:2470
apache_beam/io/gcp/bigquery.py:2470
apache_beam/io/gcp/bigquery.py:2470
apache_beam/io/gcp/bigquery.py:2470
apache_beam/io/gcp/bigquery.py:2470
apache_beam/io/gcp/bigquery.py:2470
<https://ci-beam.apache.org/job/beam_PostCommit_Python37/ws/src/sdks/python/apache_beam/io/gcp/bigquery.py>:2470: BeamDeprecationWarning: options is deprecated since First stable release. References to <pipeline>.options will not be supported
| _PassThroughThenCleanup(files_to_remove_pcoll))
apache_beam/examples/dataframe/flight_delays.py:45
<https://ci-beam.apache.org/job/beam_PostCommit_Python37/ws/src/sdks/python/apache_beam/examples/dataframe/flight_delays.py>:45: FutureWarning: Dropping of nuisance columns in DataFrame reductions (with 'numeric_only=None') is deprecated; in a future version this will raise TypeError. Select only valid columns before calling the reduction.
return airline_df[at_top_airports].mean()
apache_beam/dataframe/io.py:632
apache_beam/dataframe/io.py:632
apache_beam/dataframe/io.py:632
<https://ci-beam.apache.org/job/beam_PostCommit_Python37/ws/src/sdks/python/apache_beam/dataframe/io.py>:632: FutureWarning: WriteToFiles is experimental.
sink=lambda _: _WriteToPandasFileSink(
apache_beam/io/fileio.py:550
apache_beam/io/fileio.py:550
apache_beam/io/fileio.py:550
<https://ci-beam.apache.org/job/beam_PostCommit_Python37/ws/src/sdks/python/apache_beam/io/fileio.py>:550: BeamDeprecationWarning: options is deprecated since First stable release. References to <pipeline>.options will not be supported
p.options.view_as(GoogleCloudOptions).temp_location or
apache_beam/io/gcp/bigquery.py:2134
apache_beam/io/gcp/bigquery.py:2134
apache_beam/io/gcp/bigquery.py:2134
apache_beam/io/gcp/bigquery.py:2134
apache_beam/io/gcp/bigquery.py:2134
apache_beam/io/gcp/bigquery.py:2134
apache_beam/io/gcp/bigquery.py:2134
apache_beam/io/gcp/bigquery.py:2134
apache_beam/io/gcp/bigquery.py:2134
apache_beam/io/gcp/bigquery.py:2134
apache_beam/io/gcp/bigquery.py:2134
apache_beam/io/gcp/bigquery.py:2134
<https://ci-beam.apache.org/job/beam_PostCommit_Python37/ws/src/sdks/python/apache_beam/io/gcp/bigquery.py>:2134: BeamDeprecationWarning: options is deprecated since First stable release. References to <pipeline>.options will not be supported
self.table_reference.projectId = pcoll.pipeline.options.view_as(
apache_beam/io/gcp/tests/utils.py:100
<https://ci-beam.apache.org/job/beam_PostCommit_Python37/ws/src/sdks/python/apache_beam/io/gcp/tests/utils.py>:100: PendingDeprecationWarning: Client.dataset is deprecated and will be removed in a future version. Use a string like 'my_project.my_dataset' or a cloud.google.bigquery.DatasetReference object, instead.
table_ref = client.dataset(dataset_id).table(table_id)
apache_beam/io/gcp/bigquery_test.py:1181
<https://ci-beam.apache.org/job/beam_PostCommit_Python37/ws/src/sdks/python/apache_beam/io/gcp/bigquery_test.py>:1181: BeamDeprecationWarning: options is deprecated since First stable release. References to <pipeline>.options will not be supported
streaming = self.test_pipeline.options.view_as(StandardOptions).streaming
apache_beam/io/gcp/bigquery_read_it_test.py:167
<https://ci-beam.apache.org/job/beam_PostCommit_Python37/ws/src/sdks/python/apache_beam/io/gcp/bigquery_read_it_test.py>:167: BeamDeprecationWarning: BigQuerySource is deprecated since 2.25.0. Use ReadFromBigQuery instead.
beam.io.BigQuerySource(query=self.query, use_standard_sql=True)))
apache_beam/io/gcp/big_query_query_to_table_pipeline.py:84
apache_beam/io/gcp/big_query_query_to_table_pipeline.py:84
<https://ci-beam.apache.org/job/beam_PostCommit_Python37/ws/src/sdks/python/apache_beam/io/gcp/big_query_query_to_table_pipeline.py>:84: BeamDeprecationWarning: BigQuerySource is deprecated since 2.25.0. Use ReadFromBigQuery instead.
kms_key=kms_key))
apache_beam/runners/dataflow/ptransform_overrides.py:323
apache_beam/runners/dataflow/ptransform_overrides.py:323
<https://ci-beam.apache.org/job/beam_PostCommit_Python37/ws/src/sdks/python/apache_beam/runners/dataflow/ptransform_overrides.py>:323: BeamDeprecationWarning: BigQuerySink is deprecated since 2.11.0. Use WriteToBigQuery instead.
kms_key=self.kms_key))
apache_beam/io/gcp/bigquery_read_it_test.py:556
<https://ci-beam.apache.org/job/beam_PostCommit_Python37/ws/src/sdks/python/apache_beam/io/gcp/bigquery_read_it_test.py>:556: BeamDeprecationWarning: BigQuerySource is deprecated since 2.25.0. Use ReadFromBigQuery instead.
beam.io.BigQuerySource(query=self.query, use_standard_sql=True)))
apache_beam/ml/gcp/cloud_dlp_it_test.py:77
<https://ci-beam.apache.org/job/beam_PostCommit_Python37/ws/src/sdks/python/apache_beam/ml/gcp/cloud_dlp_it_test.py>:77: FutureWarning: MaskDetectedDetails is experimental.
inspection_config=INSPECT_CONFIG))
apache_beam/io/gcp/bigquery_read_it_test.py:670
<https://ci-beam.apache.org/job/beam_PostCommit_Python37/ws/src/sdks/python/apache_beam/io/gcp/bigquery_read_it_test.py>:670: FutureWarning: ReadAllFromBigQuery is experimental.
| beam.io.ReadAllFromBigQuery())
apache_beam/io/gcp/bigquery.py:2611
<https://ci-beam.apache.org/job/beam_PostCommit_Python37/ws/src/sdks/python/apache_beam/io/gcp/bigquery.py>:2611: BeamDeprecationWarning: options is deprecated since First stable release. References to <pipeline>.options will not be supported
job_name = pcoll.pipeline.options.view_as(GoogleCloudOptions).job_name
apache_beam/io/gcp/bigquery.py:2612
<https://ci-beam.apache.org/job/beam_PostCommit_Python37/ws/src/sdks/python/apache_beam/io/gcp/bigquery.py>:2612: BeamDeprecationWarning: options is deprecated since First stable release. References to <pipeline>.options will not be supported
project = pcoll.pipeline.options.view_as(GoogleCloudOptions).project
apache_beam/io/gcp/bigquery.py:2625
<https://ci-beam.apache.org/job/beam_PostCommit_Python37/ws/src/sdks/python/apache_beam/io/gcp/bigquery.py>:2625: BeamDeprecationWarning: options is deprecated since First stable release. References to <pipeline>.options will not be supported
options=pcoll.pipeline.options,
apache_beam/ml/gcp/cloud_dlp_it_test.py:87
<https://ci-beam.apache.org/job/beam_PostCommit_Python37/ws/src/sdks/python/apache_beam/ml/gcp/cloud_dlp_it_test.py>:87: FutureWarning: InspectForDetails is experimental.
| beam.ParDo(extract_inspection_results).with_outputs(
-- Docs: https://docs.pytest.org/en/latest/warnings.html
- generated xml file: <https://ci-beam.apache.org/job/beam_PostCommit_Python37/ws/src/sdks/python/pytest_postCommitIT-df-py37.xml> -
[31m[1m======= 2 failed, 57 passed, 9 skipped, 170 warnings in 5957.18 seconds ========[0m
> Task :sdks:python:test-suites:dataflow:py37:postCommitIT FAILED
> Task :sdks:python:test-suites:dataflow:py37:spannerioIT
>>> RUNNING integration tests with pipeline options: --runner=TestDataflowRunner --project=apache-beam-testing --region=us-central1 --staging_location=gs://temp-storage-for-end-to-end-tests/staging-it --temp_location=gs://temp-storage-for-end-to-end-tests/temp-it --output=gs://temp-storage-for-end-to-end-tests/py-it-cloud/output --sdk_location=<https://ci-beam.apache.org/job/beam_PostCommit_Python37/ws/src/sdks/python/build/apache-beam.tar.gz> --requirements_file=postcommit_requirements.txt --num_workers=1 --sleep_secs=20 --dataflow_worker_jar=<https://ci-beam.apache.org/job/beam_PostCommit_Python37/ws/src/runners/google-cloud-dataflow-java/worker/build/libs/beam-runners-google-cloud-dataflow-java-fn-api-worker-2.37.0-SNAPSHOT.jar> --kms_key_name=projects/apache-beam-testing/locations/global/keyRings/beam-it/cryptoKeys/test --dataflow_kms_key=projects/apache-beam-testing/locations/global/keyRings/beam-it/cryptoKeys/test
>>> pytest options: --capture=no --timeout=4500 --color=yes --log-cli-level=INFO --numprocesses=8 --dist=loadfile
>>> collect markers: -m=spannerio_it
[1m============================= test session starts ==============================[0m
platform linux -- Python 3.7.12, pytest-4.6.11, py-1.11.0, pluggy-0.13.1
rootdir: <https://ci-beam.apache.org/job/beam_PostCommit_Python37/ws/src/sdks/python,> inifile: pytest.ini
plugins: xdist-1.34.0, timeout-1.4.2, forked-1.4.0, requests-mock-1.9.3
timeout: 4500.0s
timeout method: signal
timeout func_only: False
gw0 I / gw1 I / gw2 I / gw3 I / gw4 I / gw5 I / gw6 I / gw7 I
[1m[gw0] Python 3.7.12 (default, Jan 15 2022, 18:42:10) -- [GCC 9.3.0]
[0m[1m[gw1] Python 3.7.12 (default, Jan 15 2022, 18:42:10) -- [GCC 9.3.0]
[0m[1m[gw3] Python 3.7.12 (default, Jan 15 2022, 18:42:10) -- [GCC 9.3.0]
[0m[1m[gw4] Python 3.7.12 (default, Jan 15 2022, 18:42:10) -- [GCC 9.3.0]
[0m[1m[gw2] Python 3.7.12 (default, Jan 15 2022, 18:42:10) -- [GCC 9.3.0]
[0m[1m[gw5] Python 3.7.12 (default, Jan 15 2022, 18:42:10) -- [GCC 9.3.0]
[0m[1m[gw6] Python 3.7.12 (default, Jan 15 2022, 18:42:10) -- [GCC 9.3.0]
[0m[1m[gw7] Python 3.7.12 (default, Jan 15 2022, 18:42:10) -- [GCC 9.3.0]
[0mgw0 [15] / gw1 [15] / gw2 [15] / gw3 [15] / gw4 [15] / gw5 [15] / gw6 [15] / gw7 [15]
scheduling tests via LoadFileScheduling
apache_beam/io/gcp/experimental/spannerio_read_it_test.py::SpannerReadIntegrationTest::test_read_via_sql
apache_beam/io/gcp/experimental/spannerio_write_it_test.py::SpannerWriteIntegrationTest::test_metrics_error_call
[gw1] [33mSKIPPED[0m apache_beam/io/gcp/experimental/spannerio_write_it_test.py::SpannerWriteIntegrationTest::test_metrics_error_call
apache_beam/io/gcp/experimental/spannerio_write_it_test.py::SpannerWriteIntegrationTest::test_metrics_ok_call
[gw1] [33mSKIPPED[0m apache_beam/io/gcp/experimental/spannerio_write_it_test.py::SpannerWriteIntegrationTest::test_metrics_ok_call
apache_beam/io/gcp/experimental/spannerio_write_it_test.py::SpannerWriteIntegrationTest::test_spanner_error
[gw0] [32mPASSED[0m apache_beam/io/gcp/experimental/spannerio_read_it_test.py::SpannerReadIntegrationTest::test_read_via_sql
apache_beam/io/gcp/experimental/spannerio_read_it_test.py::SpannerReadIntegrationTest::test_read_via_table
[gw1] [32mPASSED[0m apache_beam/io/gcp/experimental/spannerio_write_it_test.py::SpannerWriteIntegrationTest::test_spanner_error
apache_beam/io/gcp/experimental/spannerio_write_it_test.py::SpannerWriteIntegrationTest::test_spanner_update
[gw0] [32mPASSED[0m apache_beam/io/gcp/experimental/spannerio_read_it_test.py::SpannerReadIntegrationTest::test_read_via_table
apache_beam/io/gcp/experimental/spannerio_read_it_test.py::SpannerReadIntegrationTest::test_sql_metrics_error_call
[gw0] [33mSKIPPED[0m apache_beam/io/gcp/experimental/spannerio_read_it_test.py::SpannerReadIntegrationTest::test_sql_metrics_error_call
apache_beam/io/gcp/experimental/spannerio_read_it_test.py::SpannerReadIntegrationTest::test_sql_metrics_ok_call
[gw0] [33mSKIPPED[0m apache_beam/io/gcp/experimental/spannerio_read_it_test.py::SpannerReadIntegrationTest::test_sql_metrics_ok_call
apache_beam/io/gcp/experimental/spannerio_read_it_test.py::SpannerReadIntegrationTest::test_table_metrics_error_call
[gw0] [33mSKIPPED[0m apache_beam/io/gcp/experimental/spannerio_read_it_test.py::SpannerReadIntegrationTest::test_table_metrics_error_call
apache_beam/io/gcp/experimental/spannerio_read_it_test.py::SpannerReadIntegrationTest::test_table_metrics_ok_call
[gw0] [33mSKIPPED[0m apache_beam/io/gcp/experimental/spannerio_read_it_test.py::SpannerReadIntegrationTest::test_table_metrics_ok_call
apache_beam/io/gcp/experimental/spannerio_read_it_test.py::SpannerReadIntegrationTest::test_transaction_sql_metrics_error_call
[gw0] [33mSKIPPED[0m apache_beam/io/gcp/experimental/spannerio_read_it_test.py::SpannerReadIntegrationTest::test_transaction_sql_metrics_error_call
apache_beam/io/gcp/experimental/spannerio_read_it_test.py::SpannerReadIntegrationTest::test_transaction_sql_metrics_ok_call
[gw0] [33mSKIPPED[0m apache_beam/io/gcp/experimental/spannerio_read_it_test.py::SpannerReadIntegrationTest::test_transaction_sql_metrics_ok_call
apache_beam/io/gcp/experimental/spannerio_read_it_test.py::SpannerReadIntegrationTest::test_transaction_table_metrics_error_call
[gw0] [33mSKIPPED[0m apache_beam/io/gcp/experimental/spannerio_read_it_test.py::SpannerReadIntegrationTest::test_transaction_table_metrics_error_call
apache_beam/io/gcp/experimental/spannerio_read_it_test.py::SpannerReadIntegrationTest::test_transaction_table_metrics_ok_call
[gw0] [33mSKIPPED[0m apache_beam/io/gcp/experimental/spannerio_read_it_test.py::SpannerReadIntegrationTest::test_transaction_table_metrics_ok_call
[gw1] [32mPASSED[0m apache_beam/io/gcp/experimental/spannerio_write_it_test.py::SpannerWriteIntegrationTest::test_spanner_update
apache_beam/io/gcp/experimental/spannerio_write_it_test.py::SpannerWriteIntegrationTest::test_write_batches
[gw1] [32mPASSED[0m apache_beam/io/gcp/experimental/spannerio_write_it_test.py::SpannerWriteIntegrationTest::test_write_batches
[33m=============================== warnings summary ===============================[0m
apache_beam/io/gcp/experimental/spannerio_read_it_test.py:128
<https://ci-beam.apache.org/job/beam_PostCommit_Python37/ws/src/sdks/python/apache_beam/io/gcp/experimental/spannerio_read_it_test.py>:128: FutureWarning: ReadFromSpanner is experimental. No backwards-compatibility guarantees.
sql="select * from Users")
apache_beam/io/gcp/experimental/spannerio_write_it_test.py:190
<https://ci-beam.apache.org/job/beam_PostCommit_Python37/ws/src/sdks/python/apache_beam/io/gcp/experimental/spannerio_write_it_test.py>:190: FutureWarning: WriteToSpanner is experimental. No backwards-compatibility guarantees.
database_id=self.TEST_DATABASE))
apache_beam/io/gcp/experimental/spannerio_read_it_test.py:117
<https://ci-beam.apache.org/job/beam_PostCommit_Python37/ws/src/sdks/python/apache_beam/io/gcp/experimental/spannerio_read_it_test.py>:117: FutureWarning: ReadFromSpanner is experimental. No backwards-compatibility guarantees.
columns=["UserId", "Key"])
apache_beam/io/gcp/experimental/spannerio_write_it_test.py:171
<https://ci-beam.apache.org/job/beam_PostCommit_Python37/ws/src/sdks/python/apache_beam/io/gcp/experimental/spannerio_write_it_test.py>:171: FutureWarning: WriteToSpanner is experimental. No backwards-compatibility guarantees.
database_id=self.TEST_DATABASE))
apache_beam/io/gcp/experimental/spannerio_write_it_test.py:135
<https://ci-beam.apache.org/job/beam_PostCommit_Python37/ws/src/sdks/python/apache_beam/io/gcp/experimental/spannerio_write_it_test.py>:135: FutureWarning: WriteToSpanner is experimental. No backwards-compatibility guarantees.
max_batch_size_bytes=250))
-- Docs: https://docs.pytest.org/en/latest/warnings.html
- generated xml file: <https://ci-beam.apache.org/job/beam_PostCommit_Python37/ws/src/sdks/python/pytest_postCommitIT-df-py37.xml> -
[33m[1m============= 5 passed, 10 skipped, 5 warnings in 1700.65 seconds ==============[0m
FAILURE: Build completed with 2 failures.
1: Task failed with an exception.
-----------
* Where:
Script '<https://ci-beam.apache.org/job/beam_PostCommit_Python37/ws/src/sdks/python/test-suites/direct/common.gradle'> line: 182
* What went wrong:
Execution failed for task ':sdks:python:test-suites:direct:py37:hdfsIntegrationTest'.
> Process 'command 'sh'' finished with non-zero exit value 1
* Try:
> Run with --stacktrace option to get the stack trace.
> Run with --info or --debug option to get more log output.
> Run with --scan to get full insights.
==============================================================================
2: Task failed with an exception.
-----------
* Where:
Script '<https://ci-beam.apache.org/job/beam_PostCommit_Python37/ws/src/sdks/python/test-suites/dataflow/common.gradle'> line: 120
* What went wrong:
Execution failed for task ':sdks:python:test-suites:dataflow:py37:postCommitIT'.
> Process 'command 'sh'' finished with non-zero exit value 1
* Try:
> Run with --stacktrace option to get the stack trace.
> Run with --info or --debug option to get more log output.
> Run with --scan to get full insights.
==============================================================================
* Get more help at https://help.gradle.org
Deprecated Gradle features were used in this build, making it incompatible with Gradle 8.0.
You can use '--warning-mode all' to show the individual deprecation warnings and determine if they come from your own scripts or plugins.
See https://docs.gradle.org/7.3.2/userguide/command_line_interface.html#sec:command_line_warnings
Execution optimizations have been disabled for 1 invalid unit(s) of work during this build to ensure correctness.
Please consult deprecation warnings for more details.
BUILD FAILED in 2h 10m 52s
222 actionable tasks: 152 executed, 64 from cache, 6 up-to-date
Publishing build scan...
https://gradle.com/s/pcaht6zhrcuie
Build step 'Invoke Gradle script' changed build result to FAILURE
Build step 'Invoke Gradle script' marked build as failure
---------------------------------------------------------------------
To unsubscribe, e-mail: builds-unsubscribe@beam.apache.org
For additional commands, e-mail: builds-help@beam.apache.org
Build failed in Jenkins: beam_PostCommit_Python37 #4845
Posted by Apache Jenkins Server <je...@builds.apache.org>.
See <https://ci-beam.apache.org/job/beam_PostCommit_Python37/4845/display/redirect?page=changes>
Changes:
[alexander.chermenin] Fixed CSS for Case study page
------------------------------------------
[...truncated 27.89 MB...]
INFO:apache_beam.runners.worker.data_plane:Creating client data channel for localhost:39841
INFO:apache_beam.utils.subprocess_server:b'22/02/04 12:21:12 INFO org.apache.beam.runners.fnexecution.data.GrpcDataService: Beam Fn Data client connected.'
INFO:apache_beam.utils.subprocess_server:b'22/02/04 12:21:12 INFO org.apache.beam.runners.fnexecution.control.FnApiControlClientPoolService: getProcessBundleDescriptor request with id 1-3'
INFO:apache_beam.utils.subprocess_server:b'22/02/04 12:21:12 WARN software.amazon.awssdk.regions.internal.util.EC2MetadataUtils: Unable to retrieve the requested metadata.'
INFO:apache_beam.utils.subprocess_server:b'22/02/04 12:21:12 WARN software.amazon.awssdk.regions.internal.util.EC2MetadataUtils: Unable to retrieve the requested metadata.'
INFO:apache_beam.utils.subprocess_server:b'22/02/04 12:21:12 WARN software.amazon.awssdk.regions.internal.util.EC2MetadataUtils: Unable to retrieve the requested metadata.'
INFO:apache_beam.utils.subprocess_server:b'22/02/04 12:21:12 WARN software.amazon.awssdk.regions.internal.util.EC2MetadataUtils: Unable to retrieve the requested metadata.'
INFO:apache_beam.utils.subprocess_server:b'22/02/04 12:21:12 INFO org.apache.beam.runners.fnexecution.control.FnApiControlClientPoolService: getProcessBundleDescriptor request with id 1-4'
INFO:apache_beam.utils.subprocess_server:b'22/02/04 12:21:12 INFO org.apache.beam.runners.fnexecution.control.FnApiControlClientPoolService: getProcessBundleDescriptor request with id 1-5'
INFO:apache_beam.utils.subprocess_server:b'22/02/04 12:21:12 WARN software.amazon.awssdk.regions.internal.util.EC2MetadataUtils: Unable to retrieve the requested metadata.'
INFO:apache_beam.utils.subprocess_server:b'22/02/04 12:21:12 WARN software.amazon.awssdk.regions.internal.util.EC2MetadataUtils: Unable to retrieve the requested metadata.'
INFO:apache_beam.utils.subprocess_server:b'22/02/04 12:21:12 WARN software.amazon.awssdk.regions.internal.util.EC2MetadataUtils: Unable to retrieve the requested metadata.'
INFO:apache_beam.utils.subprocess_server:b'22/02/04 12:21:12 WARN software.amazon.awssdk.regions.internal.util.EC2MetadataUtils: Unable to retrieve the requested metadata.'
INFO:apache_beam.utils.subprocess_server:b'22/02/04 12:21:12 INFO org.apache.beam.runners.fnexecution.control.FnApiControlClientPoolService: getProcessBundleDescriptor request with id 1-6'
INFO:apache_beam.utils.subprocess_server:b'22/02/04 12:21:12 INFO org.apache.beam.runners.fnexecution.control.FnApiControlClientPoolService: getProcessBundleDescriptor request with id 1-8'
INFO:apache_beam.utils.subprocess_server:b'22/02/04 12:21:12 INFO org.apache.beam.runners.fnexecution.control.FnApiControlClientPoolService: getProcessBundleDescriptor request with id 1-7'
INFO:apache_beam.utils.subprocess_server:b'22/02/04 12:21:12 INFO org.apache.beam.runners.fnexecution.control.FnApiControlClientPoolService: getProcessBundleDescriptor request with id 1-9'
INFO:apache_beam.utils.subprocess_server:b'22/02/04 12:21:12 INFO org.apache.beam.runners.fnexecution.control.FnApiControlClientPoolService: getProcessBundleDescriptor request with id 1-10'
INFO:apache_beam.utils.subprocess_server:b'22/02/04 12:21:13 INFO org.apache.beam.runners.fnexecution.control.FnApiControlClientPoolService: getProcessBundleDescriptor request with id 1-11'
INFO:apache_beam.utils.subprocess_server:b'22/02/04 12:21:13 INFO org.apache.beam.runners.fnexecution.control.FnApiControlClientPoolService: getProcessBundleDescriptor request with id 1-12'
INFO:apache_beam.utils.subprocess_server:b'22/02/04 12:21:13 INFO org.apache.beam.runners.fnexecution.control.FnApiControlClientPoolService: getProcessBundleDescriptor request with id 1-13'
INFO:apache_beam.utils.subprocess_server:b'22/02/04 12:21:13 WARN software.amazon.awssdk.regions.internal.util.EC2MetadataUtils: Unable to retrieve the requested metadata.'
INFO:apache_beam.utils.subprocess_server:b'22/02/04 12:21:13 WARN software.amazon.awssdk.regions.internal.util.EC2MetadataUtils: Unable to retrieve the requested metadata.'
INFO:apache_beam.utils.subprocess_server:b'22/02/04 12:21:13 WARN software.amazon.awssdk.regions.internal.util.EC2MetadataUtils: Unable to retrieve the requested metadata.'
INFO:apache_beam.utils.subprocess_server:b'22/02/04 12:21:13 WARN software.amazon.awssdk.regions.internal.util.EC2MetadataUtils: Unable to retrieve the requested metadata.'
INFO:apache_beam.utils.subprocess_server:b'22/02/04 12:21:13 INFO org.apache.beam.runners.fnexecution.control.FnApiControlClientPoolService: getProcessBundleDescriptor request with id 1-14'
INFO:apache_beam.utils.subprocess_server:b'22/02/04 12:21:13 WARN software.amazon.awssdk.regions.internal.util.EC2MetadataUtils: Unable to retrieve the requested metadata.'
INFO:apache_beam.utils.subprocess_server:b'22/02/04 12:21:13 WARN software.amazon.awssdk.regions.internal.util.EC2MetadataUtils: Unable to retrieve the requested metadata.'
INFO:apache_beam.utils.subprocess_server:b'22/02/04 12:21:13 WARN software.amazon.awssdk.regions.internal.util.EC2MetadataUtils: Unable to retrieve the requested metadata.'
INFO:apache_beam.utils.subprocess_server:b'22/02/04 12:21:13 WARN software.amazon.awssdk.regions.internal.util.EC2MetadataUtils: Unable to retrieve the requested metadata.'
INFO:apache_beam.utils.subprocess_server:b'22/02/04 12:21:13 INFO org.apache.beam.runners.fnexecution.control.FnApiControlClientPoolService: getProcessBundleDescriptor request with id 1-15'
INFO:apache_beam.utils.subprocess_server:b'22/02/04 12:21:13 INFO org.apache.beam.runners.spark.SparkPipelineRunner: Job BeamApp-jenkins-0204122107-10aaa08d_77ef5ea0-fd3e-4b34-8c3f-e3246291a0d6: Pipeline translated successfully. Computing outputs'
INFO:apache_beam.utils.subprocess_server:b'22/02/04 12:21:13 WARN software.amazon.awssdk.regions.internal.util.EC2MetadataUtils: Unable to retrieve the requested metadata.'
INFO:apache_beam.utils.subprocess_server:b'22/02/04 12:21:13 WARN software.amazon.awssdk.regions.internal.util.EC2MetadataUtils: Unable to retrieve the requested metadata.'
INFO:apache_beam.utils.subprocess_server:b'22/02/04 12:21:13 WARN software.amazon.awssdk.regions.internal.util.EC2MetadataUtils: Unable to retrieve the requested metadata.'
INFO:apache_beam.utils.subprocess_server:b'22/02/04 12:21:13 WARN software.amazon.awssdk.regions.internal.util.EC2MetadataUtils: Unable to retrieve the requested metadata.'
INFO:apache_beam.utils.subprocess_server:b'22/02/04 12:21:13 INFO org.apache.beam.runners.fnexecution.control.FnApiControlClientPoolService: getProcessBundleDescriptor request with id 1-16'
INFO:apache_beam.io.filebasedsink:Starting finalize_write threads with num_shards: 4 (skipped: 0), batches: 4, num_threads: 4
INFO:apache_beam.io.filebasedsink:Renamed 4 shards in 0.10 seconds.
INFO:apache_beam.utils.subprocess_server:b'22/02/04 12:21:13 INFO org.apache.beam.runners.spark.SparkPipelineRunner: Job BeamApp-jenkins-0204122107-10aaa08d_77ef5ea0-fd3e-4b34-8c3f-e3246291a0d6 finished.'
INFO:apache_beam.runners.portability.portable_runner:Job state changed to DONE
ERROR:apache_beam.runners.worker.data_plane:Failed to read inputs in the data plane.
Traceback (most recent call last):
File "<https://ci-beam.apache.org/job/beam_PostCommit_Python37/ws/src/sdks/python/apache_beam/runners/worker/data_plane.py",> line 634, in _read_inputs
for elements in elements_iterator:
File "<https://ci-beam.apache.org/job/beam_PostCommit_Python37/ws/src/build/gradleenv/2022703441/lib/python3.7/site-packages/grpc/_channel.py",> line 426, in __next__
return self._next()
File "<https://ci-beam.apache.org/job/beam_PostCommit_Python37/ws/src/build/gradleenv/2022703441/lib/python3.7/site-packages/grpc/_channel.py",> line 826, in _next
raise self
grpc._channel._MultiThreadedRendezvous: <_MultiThreadedRendezvous of RPC that terminated with:
status = StatusCode.UNAVAILABLE
details = "Connection reset by peer"
debug_error_string = "{"created":"@1643977274.270869756","description":"Error received from peer ipv6:[::1]:39841","file":"src/core/lib/surface/call.cc","file_line":1074,"grpc_message":"Connection reset by peer","grpc_status":14}"
>
Exception in thread read_grpc_client_inputs:
Traceback (most recent call last):
File "/usr/lib/python3.7/threading.py", line 926, in _bootstrap_inner
self.run()
File "/usr/lib/python3.7/threading.py", line 870, in run
self._target(*self._args, **self._kwargs)
File "<https://ci-beam.apache.org/job/beam_PostCommit_Python37/ws/src/sdks/python/apache_beam/runners/worker/data_plane.py",> line 651, in <lambda>
target=lambda: self._read_inputs(elements_iterator),
File "<https://ci-beam.apache.org/job/beam_PostCommit_Python37/ws/src/sdks/python/apache_beam/runners/worker/data_plane.py",> line 634, in _read_inputs
for elements in elements_iterator:
File "<https://ci-beam.apache.org/job/beam_PostCommit_Python37/ws/src/build/gradleenv/2022703441/lib/python3.7/site-packages/grpc/_channel.py",> line 426, in __next__
return self._next()
File "<https://ci-beam.apache.org/job/beam_PostCommit_Python37/ws/src/build/gradleenv/2022703441/lib/python3.7/site-packages/grpc/_channel.py",> line 826, in _next
raise self
grpc._channel._MultiThreadedRendezvous: <_MultiThreadedRendezvous of RPC that terminated with:
status = StatusCode.UNAVAILABLE
details = "Connection reset by peer"
debug_error_string = "{"created":"@1643977274.270869756","description":"Error received from peer ipv6:[::1]:39841","file":"src/core/lib/surface/call.cc","file_line":1074,"grpc_message":"Connection reset by peer","grpc_status":14}"
>
Exception in thread read_state:
Traceback (most recent call last):
File "/usr/lib/python3.7/threading.py", line 926, in _bootstrap_inner
self.run()
File "/usr/lib/python3.7/threading.py", line 870, in run
self._target(*self._args, **self._kwargs)
File "<https://ci-beam.apache.org/job/beam_PostCommit_Python37/ws/src/sdks/python/apache_beam/runners/worker/sdk_worker.py",> line 957, in pull_responses
for response in responses:
File "<https://ci-beam.apache.org/job/beam_PostCommit_Python37/ws/src/build/gradleenv/2022703441/lib/python3.7/site-packages/grpc/_channel.py",> line 426, in __next__
return self._next()
File "<https://ci-beam.apache.org/job/beam_PostCommit_Python37/ws/src/build/gradleenv/2022703441/lib/python3.7/site-packages/grpc/_channel.py",> line 826, in _next
raise self
grpc._channel._MultiThreadedRendezvous: <_MultiThreadedRendezvous of RPC that terminated with:
status = StatusCode.UNAVAILABLE
details = "Socket closed"
debug_error_string = "{"created":"@1643977274.270972333","description":"Error received from peer ipv6:[::1]:44169","file":"src/core/lib/surface/call.cc","file_line":1074,"grpc_message":"Socket closed","grpc_status":14}"
>
Exception in thread run_worker_1-1:
Traceback (most recent call last):
File "/usr/lib/python3.7/threading.py", line 926, in _bootstrap_inner
self.run()
File "/usr/lib/python3.7/threading.py", line 870, in run
self._target(*self._args, **self._kwargs)
File "<https://ci-beam.apache.org/job/beam_PostCommit_Python37/ws/src/sdks/python/apache_beam/runners/worker/sdk_worker.py",> line 234, in run
for work_request in self._control_stub.Control(get_responses()):
File "<https://ci-beam.apache.org/job/beam_PostCommit_Python37/ws/src/build/gradleenv/2022703441/lib/python3.7/site-packages/grpc/_channel.py",> line 426, in __next__
return self._next()
File "<https://ci-beam.apache.org/job/beam_PostCommit_Python37/ws/src/build/gradleenv/2022703441/lib/python3.7/site-packages/grpc/_channel.py",> line 826, in _next
raise self
grpc._channel._MultiThreadedRendezvous: <_MultiThreadedRendezvous of RPC that terminated with:
status = StatusCode.UNAVAILABLE
details = "Connection reset by peer"
debug_error_string = "{"created":"@1643977274.270841989","description":"Error received from peer ipv6:[::1]:42267","file":"src/core/lib/surface/call.cc","file_line":1074,"grpc_message":"Connection reset by peer","grpc_status":14}"
>
> Task :sdks:python:test-suites:portable:py37:postCommitPy37
> Task :sdks:python:test-suites:portable:py37:xlangSpannerIOIT
Exception in thread read_grpc_client_inputs:
Traceback (most recent call last):
File "/usr/lib/python3.7/threading.py", line 926, in _bootstrap_inner
self.run()
File "/usr/lib/python3.7/threading.py", line 870, in run
self._target(*self._args, **self._kwargs)
File "<https://ci-beam.apache.org/job/beam_PostCommit_Python37/ws/src/sdks/python/apache_beam/runners/worker/data_plane.py",> line 651, in <lambda>
target=lambda: self._read_inputs(elements_iterator),
File "<https://ci-beam.apache.org/job/beam_PostCommit_Python37/ws/src/sdks/python/apache_beam/runners/worker/data_plane.py",> line 634, in _read_inputs
for elements in elements_iterator:
File "<https://ci-beam.apache.org/job/beam_PostCommit_Python37/ws/src/build/gradleenv/2022703441/lib/python3.7/site-packages/grpc/_channel.py",> line 426, in __next__
return self._next()
File "<https://ci-beam.apache.org/job/beam_PostCommit_Python37/ws/src/build/gradleenv/2022703441/lib/python3.7/site-packages/grpc/_channel.py",> line 826, in _next
raise self
grpc._channel._MultiThreadedRendezvous: <_MultiThreadedRendezvous of RPC that terminated with:
status = StatusCode.CANCELLED
details = "Multiplexer hanging up"
debug_error_string = "{"created":"@1643977615.254464288","description":"Error received from peer ipv6:[::1]:37833","file":"src/core/lib/surface/call.cc","file_line":1074,"grpc_message":"Multiplexer hanging up","grpc_status":1}"
>
> Task :sdks:python:test-suites:dataflow:py37:postCommitIT FAILED
> Task :sdks:python:test-suites:dataflow:py37:spannerioIT
>>> RUNNING integration tests with pipeline options: --runner=TestDataflowRunner --project=apache-beam-testing --region=us-central1 --staging_location=gs://temp-storage-for-end-to-end-tests/staging-it --temp_location=gs://temp-storage-for-end-to-end-tests/temp-it --output=gs://temp-storage-for-end-to-end-tests/py-it-cloud/output --sdk_location=<https://ci-beam.apache.org/job/beam_PostCommit_Python37/ws/src/sdks/python/build/apache-beam.tar.gz> --requirements_file=postcommit_requirements.txt --num_workers=1 --sleep_secs=20 --dataflow_worker_jar=<https://ci-beam.apache.org/job/beam_PostCommit_Python37/ws/src/runners/google-cloud-dataflow-java/worker/build/libs/beam-runners-google-cloud-dataflow-java-fn-api-worker-2.37.0-SNAPSHOT.jar> --kms_key_name=projects/apache-beam-testing/locations/global/keyRings/beam-it/cryptoKeys/test --dataflow_kms_key=projects/apache-beam-testing/locations/global/keyRings/beam-it/cryptoKeys/test
>>> pytest options: --capture=no --timeout=4500 --color=yes --log-cli-level=INFO --numprocesses=8 --dist=loadfile
>>> collect markers: -m=spannerio_it
[1m============================= test session starts ==============================[0m
platform linux -- Python 3.7.12, pytest-4.6.11, py-1.11.0, pluggy-0.13.1
rootdir: <https://ci-beam.apache.org/job/beam_PostCommit_Python37/ws/src/sdks/python,> inifile: pytest.ini
plugins: xdist-1.34.0, timeout-1.4.2, forked-1.4.0, requests-mock-1.9.3
timeout: 4500.0s
timeout method: signal
timeout func_only: False
gw0 I / gw1 I / gw2 I / gw3 I / gw4 I / gw5 I / gw6 I / gw7 I
[1m[gw0] Python 3.7.12 (default, Jan 15 2022, 18:42:10) -- [GCC 9.3.0]
[0m[1m[gw1] Python 3.7.12 (default, Jan 15 2022, 18:42:10) -- [GCC 9.3.0]
[0m[1m[gw2] Python 3.7.12 (default, Jan 15 2022, 18:42:10) -- [GCC 9.3.0]
[0m[1m[gw3] Python 3.7.12 (default, Jan 15 2022, 18:42:10) -- [GCC 9.3.0]
[0m[1m[gw4] Python 3.7.12 (default, Jan 15 2022, 18:42:10) -- [GCC 9.3.0]
[0m[1m[gw5] Python 3.7.12 (default, Jan 15 2022, 18:42:10) -- [GCC 9.3.0]
[0m[1m[gw6] Python 3.7.12 (default, Jan 15 2022, 18:42:10) -- [GCC 9.3.0]
[0m[1m[gw7] Python 3.7.12 (default, Jan 15 2022, 18:42:10) -- [GCC 9.3.0]
[0mgw0 [15] / gw1 [15] / gw2 [15] / gw3 [15] / gw4 [15] / gw5 [15] / gw6 [15] / gw7 [15]
scheduling tests via LoadFileScheduling
apache_beam/io/gcp/experimental/spannerio_read_it_test.py::SpannerReadIntegrationTest::test_read_via_sql
apache_beam/io/gcp/experimental/spannerio_write_it_test.py::SpannerWriteIntegrationTest::test_metrics_error_call
[gw1] [33mSKIPPED[0m apache_beam/io/gcp/experimental/spannerio_write_it_test.py::SpannerWriteIntegrationTest::test_metrics_error_call
apache_beam/io/gcp/experimental/spannerio_write_it_test.py::SpannerWriteIntegrationTest::test_metrics_ok_call
[gw1] [33mSKIPPED[0m apache_beam/io/gcp/experimental/spannerio_write_it_test.py::SpannerWriteIntegrationTest::test_metrics_ok_call
apache_beam/io/gcp/experimental/spannerio_write_it_test.py::SpannerWriteIntegrationTest::test_spanner_error
[gw0] [32mPASSED[0m apache_beam/io/gcp/experimental/spannerio_read_it_test.py::SpannerReadIntegrationTest::test_read_via_sql
apache_beam/io/gcp/experimental/spannerio_read_it_test.py::SpannerReadIntegrationTest::test_read_via_table
[gw1] [32mPASSED[0m apache_beam/io/gcp/experimental/spannerio_write_it_test.py::SpannerWriteIntegrationTest::test_spanner_error
apache_beam/io/gcp/experimental/spannerio_write_it_test.py::SpannerWriteIntegrationTest::test_spanner_update
[gw0] [32mPASSED[0m apache_beam/io/gcp/experimental/spannerio_read_it_test.py::SpannerReadIntegrationTest::test_read_via_table
apache_beam/io/gcp/experimental/spannerio_read_it_test.py::SpannerReadIntegrationTest::test_sql_metrics_error_call
[gw0] [33mSKIPPED[0m apache_beam/io/gcp/experimental/spannerio_read_it_test.py::SpannerReadIntegrationTest::test_sql_metrics_error_call
apache_beam/io/gcp/experimental/spannerio_read_it_test.py::SpannerReadIntegrationTest::test_sql_metrics_ok_call
[gw0] [33mSKIPPED[0m apache_beam/io/gcp/experimental/spannerio_read_it_test.py::SpannerReadIntegrationTest::test_sql_metrics_ok_call
apache_beam/io/gcp/experimental/spannerio_read_it_test.py::SpannerReadIntegrationTest::test_table_metrics_error_call
[gw0] [33mSKIPPED[0m apache_beam/io/gcp/experimental/spannerio_read_it_test.py::SpannerReadIntegrationTest::test_table_metrics_error_call
apache_beam/io/gcp/experimental/spannerio_read_it_test.py::SpannerReadIntegrationTest::test_table_metrics_ok_call
[gw0] [33mSKIPPED[0m apache_beam/io/gcp/experimental/spannerio_read_it_test.py::SpannerReadIntegrationTest::test_table_metrics_ok_call
apache_beam/io/gcp/experimental/spannerio_read_it_test.py::SpannerReadIntegrationTest::test_transaction_sql_metrics_error_call
[gw0] [33mSKIPPED[0m apache_beam/io/gcp/experimental/spannerio_read_it_test.py::SpannerReadIntegrationTest::test_transaction_sql_metrics_error_call
apache_beam/io/gcp/experimental/spannerio_read_it_test.py::SpannerReadIntegrationTest::test_transaction_sql_metrics_ok_call
[gw0] [33mSKIPPED[0m apache_beam/io/gcp/experimental/spannerio_read_it_test.py::SpannerReadIntegrationTest::test_transaction_sql_metrics_ok_call
apache_beam/io/gcp/experimental/spannerio_read_it_test.py::SpannerReadIntegrationTest::test_transaction_table_metrics_error_call
[gw0] [33mSKIPPED[0m apache_beam/io/gcp/experimental/spannerio_read_it_test.py::SpannerReadIntegrationTest::test_transaction_table_metrics_error_call
apache_beam/io/gcp/experimental/spannerio_read_it_test.py::SpannerReadIntegrationTest::test_transaction_table_metrics_ok_call
[gw0] [33mSKIPPED[0m apache_beam/io/gcp/experimental/spannerio_read_it_test.py::SpannerReadIntegrationTest::test_transaction_table_metrics_ok_call
[gw1] [32mPASSED[0m apache_beam/io/gcp/experimental/spannerio_write_it_test.py::SpannerWriteIntegrationTest::test_spanner_update
apache_beam/io/gcp/experimental/spannerio_write_it_test.py::SpannerWriteIntegrationTest::test_write_batches
[gw1] [32mPASSED[0m apache_beam/io/gcp/experimental/spannerio_write_it_test.py::SpannerWriteIntegrationTest::test_write_batches
[33m=============================== warnings summary ===============================[0m
apache_beam/io/gcp/experimental/spannerio_read_it_test.py:128
<https://ci-beam.apache.org/job/beam_PostCommit_Python37/ws/src/sdks/python/apache_beam/io/gcp/experimental/spannerio_read_it_test.py>:128: FutureWarning: ReadFromSpanner is experimental. No backwards-compatibility guarantees.
sql="select * from Users")
apache_beam/io/gcp/experimental/spannerio_write_it_test.py:190
<https://ci-beam.apache.org/job/beam_PostCommit_Python37/ws/src/sdks/python/apache_beam/io/gcp/experimental/spannerio_write_it_test.py>:190: FutureWarning: WriteToSpanner is experimental. No backwards-compatibility guarantees.
database_id=self.TEST_DATABASE))
apache_beam/io/gcp/experimental/spannerio_read_it_test.py:117
<https://ci-beam.apache.org/job/beam_PostCommit_Python37/ws/src/sdks/python/apache_beam/io/gcp/experimental/spannerio_read_it_test.py>:117: FutureWarning: ReadFromSpanner is experimental. No backwards-compatibility guarantees.
columns=["UserId", "Key"])
apache_beam/io/gcp/experimental/spannerio_write_it_test.py:171
<https://ci-beam.apache.org/job/beam_PostCommit_Python37/ws/src/sdks/python/apache_beam/io/gcp/experimental/spannerio_write_it_test.py>:171: FutureWarning: WriteToSpanner is experimental. No backwards-compatibility guarantees.
database_id=self.TEST_DATABASE))
apache_beam/io/gcp/experimental/spannerio_write_it_test.py:135
<https://ci-beam.apache.org/job/beam_PostCommit_Python37/ws/src/sdks/python/apache_beam/io/gcp/experimental/spannerio_write_it_test.py>:135: FutureWarning: WriteToSpanner is experimental. No backwards-compatibility guarantees.
max_batch_size_bytes=250))
-- Docs: https://docs.pytest.org/en/latest/warnings.html
- generated xml file: <https://ci-beam.apache.org/job/beam_PostCommit_Python37/ws/src/sdks/python/pytest_postCommitIT-df-py37.xml> -
[33m[1m============= 5 passed, 10 skipped, 5 warnings in 1705.71 seconds ==============[0m
FAILURE: Build failed with an exception.
* Where:
Script '<https://ci-beam.apache.org/job/beam_PostCommit_Python37/ws/src/sdks/python/test-suites/dataflow/common.gradle'> line: 120
* What went wrong:
Execution failed for task ':sdks:python:test-suites:dataflow:py37:postCommitIT'.
> Process 'command 'sh'' finished with non-zero exit value 1
* Try:
> Run with --stacktrace option to get the stack trace.
> Run with --info or --debug option to get more log output.
> Run with --scan to get full insights.
* Get more help at https://help.gradle.org
Deprecated Gradle features were used in this build, making it incompatible with Gradle 8.0.
You can use '--warning-mode all' to show the individual deprecation warnings and determine if they come from your own scripts or plugins.
See https://docs.gradle.org/7.3.2/userguide/command_line_interface.html#sec:command_line_warnings
Execution optimizations have been disabled for 1 invalid unit(s) of work during this build to ensure correctness.
Please consult deprecation warnings for more details.
BUILD FAILED in 2h 16m 5s
222 actionable tasks: 152 executed, 64 from cache, 6 up-to-date
Publishing build scan...
https://gradle.com/s/ugj5g4acykxgg
Build step 'Invoke Gradle script' changed build result to FAILURE
Build step 'Invoke Gradle script' marked build as failure
---------------------------------------------------------------------
To unsubscribe, e-mail: builds-unsubscribe@beam.apache.org
For additional commands, e-mail: builds-help@beam.apache.org