You are viewing a plain text version of this content. The canonical link for it is here.
Posted to dev@zookeeper.apache.org by Apache Jenkins Server <je...@builds.apache.org> on 2016/06/27 11:47:34 UTC
Failed: ZOOKEEPER-2170 PreCommit Build #3250
Jira: https://issues.apache.org/jira/browse/ZOOKEEPER-2170
Build: https://builds.apache.org/job/PreCommit-ZOOKEEPER-Build/3250/
###################################################################################
########################## LAST 60 LINES OF THE CONSOLE ###########################
[...truncated 22733 lines...]
[exec] Please justify why no new tests are needed for this patch.
[exec] Also please list what manual steps were performed to verify this patch.
[exec]
[exec] +1 javadoc. The javadoc tool did not generate any warning messages.
[exec]
[exec] +1 javac. The applied patch does not increase the total number of javac compiler warnings.
[exec]
[exec] +1 findbugs. The patch does not introduce any new Findbugs (version 2.0.3) warnings.
[exec]
[exec] +1 release audit. The applied patch does not increase the total number of release audit warnings.
[exec]
[exec] -1 core tests. The patch failed core unit tests.
[exec]
[exec] +1 contrib tests. The patch passed contrib unit tests.
[exec]
[exec] Test results: https://builds.apache.org/job/PreCommit-ZOOKEEPER-Build/3250//testReport/
[exec] Findbugs warnings: https://builds.apache.org/job/PreCommit-ZOOKEEPER-Build/3250//artifact/trunk/build/test/findbugs/newPatchFindbugsWarnings.html
[exec] Console output: https://builds.apache.org/job/PreCommit-ZOOKEEPER-Build/3250//console
[exec]
[exec] This message is automatically generated.
[exec]
[exec]
[exec] ======================================================================
[exec] ======================================================================
[exec] Adding comment to Jira.
[exec] ======================================================================
[exec] ======================================================================
[exec]
[exec]
[exec] Comment added.
[exec] fb626a00b3f56d96c359113be7ea0477d889ef07 logged out
[exec]
[exec]
[exec] ======================================================================
[exec] ======================================================================
[exec] Finished build.
[exec] ======================================================================
[exec] ======================================================================
[exec]
[exec]
BUILD FAILED
/home/jenkins/jenkins-slave/workspace/PreCommit-ZOOKEEPER-Build/trunk/build.xml:1605: exec returned: 2
Total time: 15 minutes 5 seconds
Build step 'Execute shell' marked build as failure
Archiving artifacts
Setting LATEST1_7_HOME=/home/jenkins/jenkins-slave/tools/hudson.model.JDK/latest1.7
Compressed 552.89 KB of artifacts by 40.5% relative to #3249
Recording test results
Setting LATEST1_7_HOME=/home/jenkins/jenkins-slave/tools/hudson.model.JDK/latest1.7
Setting LATEST1_7_HOME=/home/jenkins/jenkins-slave/tools/hudson.model.JDK/latest1.7
[description-setter] Description set: ZOOKEEPER-2170
Email was triggered for: Failure - Any
Sending email for trigger: Failure - Any
Setting LATEST1_7_HOME=/home/jenkins/jenkins-slave/tools/hudson.model.JDK/latest1.7
Setting LATEST1_7_HOME=/home/jenkins/jenkins-slave/tools/hudson.model.JDK/latest1.7
Setting LATEST1_7_HOME=/home/jenkins/jenkins-slave/tools/hudson.model.JDK/latest1.7
Setting LATEST1_7_HOME=/home/jenkins/jenkins-slave/tools/hudson.model.JDK/latest1.7
###################################################################################
############################## FAILED TESTS (if any) ##############################
4 tests failed.
FAILED: org.apache.zookeeper.server.quorum.QuorumPeerMainTest.testInconsistentPeerType
Error Message:
null
Stack Trace:
java.lang.NullPointerException
at org.apache.zookeeper.server.quorum.QuorumPeerMainTest.testInconsistentPeerType(QuorumPeerMainTest.java:475)
at org.apache.zookeeper.JUnit4ZKTestRunner$LoggedInvokeMethod.evaluate(JUnit4ZKTestRunner.java:79)
FAILED: org.apache.zookeeper.server.quorum.QuorumPeerMainTest.testQuorumDefaults
Error Message:
null
Stack Trace:
java.lang.NullPointerException
at org.apache.zookeeper.server.quorum.QuorumPeerMainTest.testQuorumDefaults(QuorumPeerMainTest.java:618)
at org.apache.zookeeper.JUnit4ZKTestRunner$LoggedInvokeMethod.evaluate(JUnit4ZKTestRunner.java:79)
FAILED: org.apache.zookeeper.server.quorum.QuorumPeerMainTest.testBadPeerAddressInQuorum
Error Message:
null
Stack Trace:
java.lang.NullPointerException
at org.apache.zookeeper.server.quorum.QuorumPeerMainTest.testBadPeerAddressInQuorum(QuorumPeerMainTest.java:416)
at org.apache.zookeeper.JUnit4ZKTestRunner$LoggedInvokeMethod.evaluate(JUnit4ZKTestRunner.java:79)
FAILED: org.apache.zookeeper.test.ReadOnlyModeTest.testSeekForRwServer
Error Message:
null
Stack Trace:
java.lang.NullPointerException
at org.apache.zookeeper.test.ReadOnlyModeTest.testSeekForRwServer(ReadOnlyModeTest.java:254)
at org.apache.zookeeper.JUnit4ZKTestRunner$LoggedInvokeMethod.evaluate(JUnit4ZKTestRunner.java:79)
at java.util.concurrent.FutureTask.run(FutureTask.java:262)
at java.lang.Thread.run(Thread.java:745)
Success: ZOOKEEPER-2170 PreCommit Build #3252
Posted by Apache Jenkins Server <je...@builds.apache.org>.
Jira: https://issues.apache.org/jira/browse/ZOOKEEPER-2170
Build: https://builds.apache.org/job/PreCommit-ZOOKEEPER-Build/3252/
###################################################################################
########################## LAST 60 LINES OF THE CONSOLE ###########################
[...truncated 441171 lines...]
[exec] http://issues.apache.org/jira/secure/attachment/12813671/ZOOKEEPER-2170-005.patch
[exec] against trunk revision 1750025.
[exec]
[exec] +1 @author. The patch does not contain any @author tags.
[exec]
[exec] +1 tests included. The patch appears to include 4 new or modified tests.
[exec]
[exec] +1 javadoc. The javadoc tool did not generate any warning messages.
[exec]
[exec] +1 javac. The applied patch does not increase the total number of javac compiler warnings.
[exec]
[exec] +1 findbugs. The patch does not introduce any new Findbugs (version 2.0.3) warnings.
[exec]
[exec] +1 release audit. The applied patch does not increase the total number of release audit warnings.
[exec]
[exec] +1 core tests. The patch passed core unit tests.
[exec]
[exec] +1 contrib tests. The patch passed contrib unit tests.
[exec]
[exec] Test results: https://builds.apache.org/job/PreCommit-ZOOKEEPER-Build/3252//testReport/
[exec] Findbugs warnings: https://builds.apache.org/job/PreCommit-ZOOKEEPER-Build/3252//artifact/trunk/build/test/findbugs/newPatchFindbugsWarnings.html
[exec] Console output: https://builds.apache.org/job/PreCommit-ZOOKEEPER-Build/3252//console
[exec]
[exec] This message is automatically generated.
[exec]
[exec]
[exec] ======================================================================
[exec] ======================================================================
[exec] Adding comment to Jira.
[exec] ======================================================================
[exec] ======================================================================
[exec]
[exec]
[exec] Comment added.
[exec] c0af53d62fd1b57638fce1d8e0c6b37a8d610d7e logged out
[exec]
[exec]
[exec] ======================================================================
[exec] ======================================================================
[exec] Finished build.
[exec] ======================================================================
[exec] ======================================================================
[exec]
[exec]
BUILD SUCCESSFUL
Total time: 21 minutes 15 seconds
Archiving artifacts
Setting LATEST1_7_HOME=/home/jenkins/jenkins-slave/tools/hudson.model.JDK/latest1.7
Recording test results
Setting LATEST1_7_HOME=/home/jenkins/jenkins-slave/tools/hudson.model.JDK/latest1.7
Setting LATEST1_7_HOME=/home/jenkins/jenkins-slave/tools/hudson.model.JDK/latest1.7
[description-setter] Description set: ZOOKEEPER-2170
Email was triggered for: Success
Sending email for trigger: Success
Setting LATEST1_7_HOME=/home/jenkins/jenkins-slave/tools/hudson.model.JDK/latest1.7
Setting LATEST1_7_HOME=/home/jenkins/jenkins-slave/tools/hudson.model.JDK/latest1.7
Setting LATEST1_7_HOME=/home/jenkins/jenkins-slave/tools/hudson.model.JDK/latest1.7
Setting LATEST1_7_HOME=/home/jenkins/jenkins-slave/tools/hudson.model.JDK/latest1.7
###################################################################################
############################## FAILED TESTS (if any) ##############################
All tests passed
Failed: ZOOKEEPER-2170 PreCommit Build #3251
Posted by Apache Jenkins Server <je...@builds.apache.org>.
Jira: https://issues.apache.org/jira/browse/ZOOKEEPER-2170
Build: https://builds.apache.org/job/PreCommit-ZOOKEEPER-Build/3251/
###################################################################################
########################## LAST 60 LINES OF THE CONSOLE ###########################
[...truncated 23323 lines...]
[exec] Please justify why no new tests are needed for this patch.
[exec] Also please list what manual steps were performed to verify this patch.
[exec]
[exec] +1 javadoc. The javadoc tool did not generate any warning messages.
[exec]
[exec] +1 javac. The applied patch does not increase the total number of javac compiler warnings.
[exec]
[exec] +1 findbugs. The patch does not introduce any new Findbugs (version 2.0.3) warnings.
[exec]
[exec] +1 release audit. The applied patch does not increase the total number of release audit warnings.
[exec]
[exec] -1 core tests. The patch failed core unit tests.
[exec]
[exec] +1 contrib tests. The patch passed contrib unit tests.
[exec]
[exec] Test results: https://builds.apache.org/job/PreCommit-ZOOKEEPER-Build/3251//testReport/
[exec] Findbugs warnings: https://builds.apache.org/job/PreCommit-ZOOKEEPER-Build/3251//artifact/trunk/build/test/findbugs/newPatchFindbugsWarnings.html
[exec] Console output: https://builds.apache.org/job/PreCommit-ZOOKEEPER-Build/3251//console
[exec]
[exec] This message is automatically generated.
[exec]
[exec]
[exec] ======================================================================
[exec] ======================================================================
[exec] Adding comment to Jira.
[exec] ======================================================================
[exec] ======================================================================
[exec]
[exec]
[exec] Comment added.
[exec] 51e36a02b433a3998b3930bbb0774c31e0a219b9 logged out
[exec]
[exec]
[exec] ======================================================================
[exec] ======================================================================
[exec] Finished build.
[exec] ======================================================================
[exec] ======================================================================
[exec]
[exec]
BUILD FAILED
/home/jenkins/jenkins-slave/workspace/PreCommit-ZOOKEEPER-Build/trunk/build.xml:1605: exec returned: 2
Total time: 13 minutes 0 seconds
Build step 'Execute shell' marked build as failure
Archiving artifacts
Setting LATEST1_7_HOME=/home/jenkins/jenkins-slave/tools/hudson.model.JDK/latest1.7
Compressed 552.76 KB of artifacts by 40.5% relative to #3249
Recording test results
Setting LATEST1_7_HOME=/home/jenkins/jenkins-slave/tools/hudson.model.JDK/latest1.7
Setting LATEST1_7_HOME=/home/jenkins/jenkins-slave/tools/hudson.model.JDK/latest1.7
[description-setter] Description set: ZOOKEEPER-2170
Email was triggered for: Failure - Any
Sending email for trigger: Failure - Any
Setting LATEST1_7_HOME=/home/jenkins/jenkins-slave/tools/hudson.model.JDK/latest1.7
Setting LATEST1_7_HOME=/home/jenkins/jenkins-slave/tools/hudson.model.JDK/latest1.7
Setting LATEST1_7_HOME=/home/jenkins/jenkins-slave/tools/hudson.model.JDK/latest1.7
Setting LATEST1_7_HOME=/home/jenkins/jenkins-slave/tools/hudson.model.JDK/latest1.7
###################################################################################
############################## FAILED TESTS (if any) ##############################
4 tests failed.
FAILED: org.apache.zookeeper.server.quorum.QuorumPeerMainTest.testInconsistentPeerType
Error Message:
null
Stack Trace:
java.lang.NullPointerException
at org.apache.zookeeper.server.quorum.QuorumPeerMainTest.testInconsistentPeerType(QuorumPeerMainTest.java:475)
at org.apache.zookeeper.JUnit4ZKTestRunner$LoggedInvokeMethod.evaluate(JUnit4ZKTestRunner.java:79)
FAILED: org.apache.zookeeper.server.quorum.QuorumPeerMainTest.testQuorumDefaults
Error Message:
null
Stack Trace:
java.lang.NullPointerException
at org.apache.zookeeper.server.quorum.QuorumPeerMainTest.testQuorumDefaults(QuorumPeerMainTest.java:618)
at org.apache.zookeeper.JUnit4ZKTestRunner$LoggedInvokeMethod.evaluate(JUnit4ZKTestRunner.java:79)
FAILED: org.apache.zookeeper.server.quorum.QuorumPeerMainTest.testBadPeerAddressInQuorum
Error Message:
null
Stack Trace:
java.lang.NullPointerException
at org.apache.zookeeper.server.quorum.QuorumPeerMainTest.testBadPeerAddressInQuorum(QuorumPeerMainTest.java:416)
at org.apache.zookeeper.JUnit4ZKTestRunner$LoggedInvokeMethod.evaluate(JUnit4ZKTestRunner.java:79)
FAILED: org.apache.zookeeper.test.ReadOnlyModeTest.testSeekForRwServer
Error Message:
null
Stack Trace:
java.lang.NullPointerException
at org.apache.zookeeper.test.ReadOnlyModeTest.testSeekForRwServer(ReadOnlyModeTest.java:254)
at org.apache.zookeeper.JUnit4ZKTestRunner$LoggedInvokeMethod.evaluate(JUnit4ZKTestRunner.java:79)
at java.util.concurrent.FutureTask.run(FutureTask.java:262)
at java.lang.Thread.run(Thread.java:745)