You are viewing a plain text version of this content. The canonical link for it is here.
Posted to commits@shindig.apache.org by Apache Jenkins Server <je...@builds.apache.org> on 2013/07/17 03:50:38 UTC

Build failed in Jenkins: Shindig Trunk (JDK 1.6) #155

See <https://builds.apache.org/job/Shindig%20Trunk%20(JDK%201.6)/155/>

------------------------------------------
[...truncated 14141 lines...]

Jul 17, 2013 1:50:31 AM com.gargoylesoftware.htmlunit.NicelyResynchronizingAjaxController processSynchron
INFO: Re-synchronized call to http://localhost:9003/rpc?st=canonical%3Ajohn.doe%3Atest%3Adomain%3AappUrl%3A1%3Adefault%3A1374029431

Tests run: 31, Failures: 0, Errors: 0, Skipped: 7, Time elapsed: 26.835 sec
Jul 17, 2013 1:50:01 AM org.mortbay.log.Slf4jLog info
INFO: Logging to org.slf4j.impl.JDK14LoggerAdapter(org.mortbay.log) via org.mortbay.log.Slf4jLog
Jul 17, 2013 1:50:02 AM org.mortbay.log.Slf4jLog info
INFO: jetty-6.1.26
Jul 17, 2013 1:50:03 AM org.apache.shindig.gadgets.features.FeatureRegistry register
INFO: Resources from res:features/features.txt are loading.
Jul 17, 2013 1:50:03 AM org.apache.shindig.common.xml.XmlUtil static block
INFO: The XML processor being used does not support secure parsing.
Jul 17, 2013 1:50:03 AM org.apache.shindig.common.xml.XmlUtil static block
INFO: Document builders are being reused.
Jul 17, 2013 1:50:04 AM org.apache.shindig.config.JsonContainerConfigLoader loadContainers
INFO: Resources from containers/default/container.js are loading.
Jul 17, 2013 1:50:04 AM org.apache.shindig.config.JsonContainerConfigLoader loadResources
INFO: Container configuration containers/default/container.js is being read.
Jul 17, 2013 1:50:04 AM org.apache.shindig.auth.BasicSecurityTokenCodec containersChanged
WARNING: Token TTL for container "default" was 0 and will be ignored.
Jul 17, 2013 1:50:04 AM org.apache.shindig.auth.BasicSecurityTokenCodec containersChanged
WARNING: Token TTL for container "accel" was 0 and will be ignored.
Jul 17, 2013 1:50:04 AM org.apache.shindig.gadgets.oauth2.logger.FilteredLogger log
INFO: Using random key for OAuth2 client-side state encryption
Jul 17, 2013 1:50:04 AM org.apache.shindig.gadgets.oauth2.logger.FilteredLogger log
INFO: OAuth2CrypterProvider constructor
Jul 17, 2013 1:50:04 AM org.apache.shindig.gadgets.oauth.OAuthModule$OAuthCrypterProvider <init>
INFO: Using random key for OAuth client-side state encryption
Jul 17, 2013 1:50:04 AM org.apache.shindig.gadgets.oauth.OAuthModule OAuthCrypterProvider constructor
INFO: A random key for OAuth client-side state encryption is being used.
Jul 17, 2013 1:50:04 AM org.apache.shindig.gadgets.oauth.OAuthModule loadDefaultKey
WARNING: The OAuth signing key did not load correctly. To create a key: 
 1. Run the following command: 
 openssl req -newkey rsa:1024 -days 365 -nodes -x509 -keyout testkey.pem \
 -out testkey.pem -subj /CN=mytestkey
 openssl pkcs8 -in testkey.pem -out oauthkey.pem -topk8 -nocrypt -outform PEM

. 2. Edit the shindig.properties file by adding these lines: 
shindig.signing.key-file =<path-to-oauthkey.pem>
 shindig.signing.key-name =mykey
.
Jul 17, 2013 1:50:04 AM org.apache.shindig.auth.BasicSecurityTokenCodec containersChanged
WARNING: Token TTL for container "default" was 0 and will be ignored.
Jul 17, 2013 1:50:04 AM org.apache.shindig.auth.BasicSecurityTokenCodec containersChanged
WARNING: Token TTL for container "accel" was 0 and will be ignored.
Jul 17, 2013 1:50:04 AM org.mortbay.log.Slf4jLog info
INFO: Started SocketConnector@0.0.0.0:9003
Jul 17, 2013 1:50:28 AM org.apache.shindig.protocol.ApiServlet responseItemFromException
INFO: A response error is being returned because a protocol exception occurred.
org.apache.shindig.protocol.ProtocolException: User 'john.doe' does not have enough privileges to update person 'canonical'
	at org.apache.shindig.social.sample.spi.JsonDbOpensocialService.updatePerson(JsonDbOpensocialService.java:420)
	at org.apache.shindig.social.opensocial.service.PersonHandler.update(PersonHandler.java:150)
	at sun.reflect.NativeMethodAccessorImpl.invoke0(Native Method)
	at sun.reflect.NativeMethodAccessorImpl.invoke(NativeMethodAccessorImpl.java:39)
	at sun.reflect.DelegatingMethodAccessorImpl.invoke(DelegatingMethodAccessorImpl.java:25)
	at java.lang.reflect.Method.invoke(Method.java:597)
	at org.apache.shindig.protocol.DefaultHandlerRegistry$MethodCaller.call(DefaultHandlerRegistry.java:483)
	at org.apache.shindig.protocol.DefaultHandlerRegistry$RpcInvocationHandler.execute(DefaultHandlerRegistry.java:302)
	at org.apache.shindig.protocol.DefaultHandlerRegistry$RpcInvocationWrapper.execute(DefaultHandlerRegistry.java:326)
	at org.apache.shindig.protocol.JsonRpcServlet.dispatchBatch(JsonRpcServlet.java:187)
	at org.apache.shindig.protocol.JsonRpcServlet.service(JsonRpcServlet.java:133)
	at javax.servlet.http.HttpServlet.service(HttpServlet.java:820)
	at org.apache.shindig.server.endtoend.EndToEndServer$ForceErrorServlet.service(EndToEndServer.java:208)
	at org.mortbay.jetty.servlet.ServletHolder.handle(ServletHolder.java:511)
	at org.mortbay.jetty.servlet.ServletHandler$CachedChain.doFilter(ServletHandler.java:1221)
	at org.apache.shindig.auth.AuthenticationServletFilter.callChain(AuthenticationServletFilter.java:186)
	at org.apache.shindig.auth.AuthenticationServletFilter.doFilter(AuthenticationServletFilter.java:97)
	at org.mortbay.jetty.servlet.ServletHandler$CachedChain.doFilter(ServletHandler.java:1212)
	at org.mortbay.jetty.servlet.ServletHandler.handle(ServletHandler.java:399)
	at org.mortbay.jetty.servlet.SessionHandler.handle(SessionHandler.java:182)
	at org.mortbay.jetty.handler.ContextHandler.handle(ContextHandler.java:766)
	at org.mortbay.jetty.handler.HandlerCollection.handle(HandlerCollection.java:114)
	at org.mortbay.jetty.handler.HandlerWrapper.handle(HandlerWrapper.java:152)
	at org.mortbay.jetty.Server.handle(Server.java:326)
	at org.mortbay.jetty.HttpConnection.handleRequest(HttpConnection.java:542)
	at org.mortbay.jetty.HttpConnection$RequestHandler.content(HttpConnection.java:945)
	at org.mortbay.jetty.HttpParser.parseNext(HttpParser.java:756)
	at org.mortbay.jetty.HttpParser.parseAvailable(HttpParser.java:218)
	at org.mortbay.jetty.HttpConnection.handle(HttpConnection.java:404)
	at org.mortbay.jetty.bio.SocketConnector$Connection.run(SocketConnector.java:228)
	at org.mortbay.thread.QueuedThreadPool$PoolThread.run(QueuedThreadPool.java:582)
Jul 17, 2013 1:50:28 AM org.apache.shindig.protocol.ApiServlet responseItemFromException
INFO: A response error is being returned because a protocol exception occurred.
org.apache.shindig.protocol.ProtocolException: Person 'not.a.real.id' not found
	at org.apache.shindig.social.sample.spi.JsonDbOpensocialService.getPerson(JsonDbOpensocialService.java:405)
	at org.apache.shindig.social.opensocial.service.PersonHandler.get(PersonHandler.java:105)
	at sun.reflect.NativeMethodAccessorImpl.invoke0(Native Method)
	at sun.reflect.NativeMethodAccessorImpl.invoke(NativeMethodAccessorImpl.java:39)
	at sun.reflect.DelegatingMethodAccessorImpl.invoke(DelegatingMethodAccessorImpl.java:25)
	at java.lang.reflect.Method.invoke(Method.java:597)
	at org.apache.shindig.protocol.DefaultHandlerRegistry$MethodCaller.call(DefaultHandlerRegistry.java:483)
	at org.apache.shindig.protocol.DefaultHandlerRegistry$RpcInvocationHandler.execute(DefaultHandlerRegistry.java:302)
	at org.apache.shindig.protocol.DefaultHandlerRegistry$RpcInvocationWrapper.execute(DefaultHandlerRegistry.java:326)
	at org.apache.shindig.protocol.JsonRpcServlet.dispatchBatch(JsonRpcServlet.java:187)
	at org.apache.shindig.protocol.JsonRpcServlet.service(JsonRpcServlet.java:133)
	at javax.servlet.http.HttpServlet.service(HttpServlet.java:820)
	at org.apache.shindig.server.endtoend.EndToEndServer$ForceErrorServlet.service(EndToEndServer.java:208)
	at org.mortbay.jetty.servlet.ServletHolder.handle(ServletHolder.java:511)
	at org.mortbay.jetty.servlet.ServletHandler$CachedChain.doFilter(ServletHandler.java:1221)
	at org.apache.shindig.auth.AuthenticationServletFilter.callChain(AuthenticationServletFilter.java:186)
	at org.apache.shindig.auth.AuthenticationServletFilter.doFilter(AuthenticationServletFilter.java:97)
	at org.mortbay.jetty.servlet.ServletHandler$CachedChain.doFilter(ServletHandler.java:1212)
	at org.mortbay.jetty.servlet.ServletHandler.handle(ServletHandler.java:399)
	at org.mortbay.jetty.servlet.SessionHandler.handle(SessionHandler.java:182)
	at org.mortbay.jetty.handler.ContextHandler.handle(ContextHandler.java:766)
	at org.mortbay.jetty.handler.HandlerCollection.handle(HandlerCollection.java:114)
	at org.mortbay.jetty.handler.HandlerWrapper.handle(HandlerWrapper.java:152)
	at org.mortbay.jetty.Server.handle(Server.java:326)
	at org.mortbay.jetty.HttpConnection.handleRequest(HttpConnection.java:542)
	at org.mortbay.jetty.HttpConnection$RequestHandler.content(HttpConnection.java:945)
	at org.mortbay.jetty.HttpParser.parseNext(HttpParser.java:756)
	at org.mortbay.jetty.HttpParser.parseAvailable(HttpParser.java:218)
	at org.mortbay.jetty.HttpConnection.handle(HttpConnection.java:404)
	at org.mortbay.jetty.bio.SocketConnector$Connection.run(SocketConnector.java:228)
	at org.mortbay.thread.QueuedThreadPool$PoolThread.run(QueuedThreadPool.java:582)
Jul 17, 2013 1:50:29 AM org.apache.shindig.protocol.ApiServlet responseItemFromException
INFO: A response error is being returned because a protocol exception occurred.
org.apache.shindig.protocol.ProtocolException: Person 'not.a.real.id' not found
	at org.apache.shindig.social.sample.spi.JsonDbOpensocialService.getPerson(JsonDbOpensocialService.java:405)
	at org.apache.shindig.social.opensocial.service.PersonHandler.get(PersonHandler.java:105)
	at sun.reflect.GeneratedMethodAccessor115.invoke(Unknown Source)
	at sun.reflect.DelegatingMethodAccessorImpl.invoke(DelegatingMethodAccessorImpl.java:25)
	at java.lang.reflect.Method.invoke(Method.java:597)
	at org.apache.shindig.protocol.DefaultHandlerRegistry$MethodCaller.call(DefaultHandlerRegistry.java:483)
	at org.apache.shindig.protocol.DefaultHandlerRegistry$RpcInvocationHandler.execute(DefaultHandlerRegistry.java:302)
	at org.apache.shindig.protocol.DefaultHandlerRegistry$RpcInvocationWrapper.execute(DefaultHandlerRegistry.java:326)
	at org.apache.shindig.protocol.JsonRpcServlet.dispatchBatch(JsonRpcServlet.java:187)
	at org.apache.shindig.protocol.JsonRpcServlet.service(JsonRpcServlet.java:133)
	at javax.servlet.http.HttpServlet.service(HttpServlet.java:820)
	at org.apache.shindig.server.endtoend.EndToEndServer$ForceErrorServlet.service(EndToEndServer.java:208)
	at org.mortbay.jetty.servlet.ServletHolder.handle(ServletHolder.java:511)
	at org.mortbay.jetty.servlet.ServletHandler$CachedChain.doFilter(ServletHandler.java:1221)
	at org.apache.shindig.auth.AuthenticationServletFilter.callChain(AuthenticationServletFilter.java:186)
	at org.apache.shindig.auth.AuthenticationServletFilter.doFilter(AuthenticationServletFilter.java:97)
	at org.mortbay.jetty.servlet.ServletHandler$CachedChain.doFilter(ServletHandler.java:1212)
	at org.mortbay.jetty.servlet.ServletHandler.handle(ServletHandler.java:399)
	at org.mortbay.jetty.servlet.SessionHandler.handle(SessionHandler.java:182)
	at org.mortbay.jetty.handler.ContextHandler.handle(ContextHandler.java:766)
	at org.mortbay.jetty.handler.HandlerCollection.handle(HandlerCollection.java:114)
	at org.mortbay.jetty.handler.HandlerWrapper.handle(HandlerWrapper.java:152)
	at org.mortbay.jetty.Server.handle(Server.java:326)
	at org.mortbay.jetty.HttpConnection.handleRequest(HttpConnection.java:542)
	at org.mortbay.jetty.HttpConnection$RequestHandler.content(HttpConnection.java:945)
	at org.mortbay.jetty.HttpParser.parseNext(HttpParser.java:756)
	at org.mortbay.jetty.HttpParser.parseAvailable(HttpParser.java:218)
	at org.mortbay.jetty.HttpConnection.handle(HttpConnection.java:404)
	at org.mortbay.jetty.bio.SocketConnector$Connection.run(SocketConnector.java:228)
	at org.mortbay.thread.QueuedThreadPool$PoolThread.run(QueuedThreadPool.java:582)
Jul 17, 2013 1:50:31 AM org.apache.shindig.gadgets.servlet.CajaContentRewriter rewrite
INFO: The gadget at T+64 msec: start LegacyNamespaceFixupStage
T+69 msec: start ResolveUriStage
T+72 msec: start PrecajoleRewriteStage
T+72 msec: start RewriteHtmlStage
T+136 msec: start RewriteFlashStage
T+137 msec: start SanitizeHtmlStage
T+139 msec: start InlineCssImportsStage
T+139 msec: start ValidateCssStage
T+145 msec: start RewriteCssStage
T+145 msec: start HtmlToBundleStage
T+179 msec: start PipelineFetchStage
T+179 msec: start OptimizeJavascriptStage
T+186 msec: start ValidateJavascriptStage
unknown:///unknown:0+0: Top level variable declarations incompatiable with Caja.  Please rewrite as window[ 'x' ] = ...
unknown:///unknown:0+0: "with" blocks are not allowed
T+286 msec: start PipelineStoreStage
T+286 msec: start ConsolidateCodeStage
T+288 msec: start CheckForErrorsStage
T+288 msec: compiler done
 cannot be cajoled.
Jul 17, 2013 1:50:31 AM org.mortbay.log.Slf4jLog info
INFO: Stopped SocketConnector@0.0.0.0:9003

Results :

Tests run: 31, Failures: 0, Errors: 0, Skipped: 7

[JENKINS] Recording test results
[INFO] [cobertura:cobertura {execution: default-cli}]
[INFO] Not executing cobertura:report as the cobertura data file (<https://builds.apache.org/job/Shindig%20Trunk%20(JDK%201.6)/ws/java/server/target/cobertura/cobertura.ser)> could not be found
[INFO] 
[INFO] 
[INFO] ------------------------------------------------------------------------
[INFO] Reactor Summary:
[INFO] ------------------------------------------------------------------------
[INFO] Apache Shindig Project ................................ SUCCESS [25.665s]
[INFO] Apache Shindig Features ............................... SUCCESS [51.320s]
[INFO] Apache Shindig Common Code ............................ SUCCESS [35.610s]
[INFO] Apache Shindig Gadget Renderer ........................ SUCCESS [1:33.449s]
[INFO] Apache Shindig Social API ............................. SUCCESS [35.354s]
[INFO] Apache Shindig Sample Container ....................... SUCCESS [12.428s]
[INFO] Apache Shindig Sample Web App Maven Archetype ......... SUCCESS [8.308s]
[INFO] Apache Shindig Web App Resources ...................... SUCCESS [8.850s]
[INFO] Apache Shindig Extra Modules .......................... SUCCESS [14.637s]
[INFO] Apache Shindig Web App Dependencies ................... SUCCESS [5.534s]
[INFO] Apache Shindig Web App ................................ SUCCESS [3:47.175s]
[INFO] ------------------------------------------------------------------------
[INFO] ------------------------------------------------------------------------
[INFO] BUILD SUCCESSFUL
[INFO] ------------------------------------------------------------------------
[INFO] Total time: 8 minutes 53 seconds
[INFO] Finished at: Wed Jul 17 01:50:36 UTC 2013
[INFO] Final Memory: 89M/327M
[INFO] ------------------------------------------------------------------------
channel stopped
Maven RedeployPublisher use remote ubuntu1 maven settings from : /home/jenkins/.m2/settings.xml
[INFO] Deployment in https://repository.apache.org/content/repositories/snapshots (id=,uniqueVersion=true)
Deploying the main artifact sample-maven-archetype-2.5.1-SNAPSHOT.jar
Downloading: https://repository.apache.org/content/repositories/snapshots/org/apache/shindig/sample-maven-archetype/2.5.1-SNAPSHOT/maven-metadata.xml
Downloaded: https://repository.apache.org/content/repositories/snapshots/org/apache/shindig/sample-maven-archetype/2.5.1-SNAPSHOT/maven-metadata.xml (2 KB at 8.4 KB/sec)
Uploading: https://repository.apache.org/content/repositories/snapshots/org/apache/shindig/sample-maven-archetype/2.5.1-SNAPSHOT/sample-maven-archetype-2.5.1-20130717.015038-2.jar
Uploading: https://repository.apache.org/content/repositories/snapshots/org/apache/shindig/sample-maven-archetype/2.5.1-SNAPSHOT/sample-maven-archetype-2.5.1-20130717.015038-2.pom
ERROR: Failed to deploy artifacts: Could not transfer artifact org.apache.shindig:sample-maven-archetype:jar:2.5.1-20130717.015038-2 from/to  (https://repository.apache.org/content/repositories/snapshots): Failed to transfer file: https://repository.apache.org/content/repositories/snapshots/org/apache/shindig/sample-maven-archetype/2.5.1-SNAPSHOT/sample-maven-archetype-2.5.1-20130717.015038-2.jar. Return code is: 401, ReasonPhrase:Unauthorized.
org.apache.maven.artifact.deployer.ArtifactDeploymentException: Failed to deploy artifacts: Could not transfer artifact org.apache.shindig:sample-maven-archetype:jar:2.5.1-20130717.015038-2 from/to  (https://repository.apache.org/content/repositories/snapshots): Failed to transfer file: https://repository.apache.org/content/repositories/snapshots/org/apache/shindig/sample-maven-archetype/2.5.1-SNAPSHOT/sample-maven-archetype-2.5.1-20130717.015038-2.jar. Return code is: 401, ReasonPhrase:Unauthorized.
	at org.apache.maven.artifact.deployer.DefaultArtifactDeployer.deploy(DefaultArtifactDeployer.java:141)
	at hudson.maven.reporters.MavenArtifactRecord.deploy(MavenArtifactRecord.java:190)
	at hudson.maven.RedeployPublisher.perform(RedeployPublisher.java:176)
	at hudson.tasks.BuildStepMonitor$1.perform(BuildStepMonitor.java:19)
	at hudson.model.AbstractBuild$AbstractBuildExecution.perform(AbstractBuild.java:810)
	at hudson.model.AbstractBuild$AbstractBuildExecution.performAllBuildSteps(AbstractBuild.java:785)
	at hudson.maven.MavenModuleSetBuild$MavenModuleSetBuildExecution.post2(MavenModuleSetBuild.java:946)
	at hudson.model.AbstractBuild$AbstractBuildExecution.post(AbstractBuild.java:732)
	at hudson.model.Run.execute(Run.java:1593)
	at hudson.maven.MavenModuleSetBuild.run(MavenModuleSetBuild.java:477)
	at hudson.model.ResourceController.execute(ResourceController.java:88)
	at hudson.model.Executor.run(Executor.java:236)
Caused by: org.sonatype.aether.deployment.DeploymentException: Failed to deploy artifacts: Could not transfer artifact org.apache.shindig:sample-maven-archetype:jar:2.5.1-20130717.015038-2 from/to  (https://repository.apache.org/content/repositories/snapshots): Failed to transfer file: https://repository.apache.org/content/repositories/snapshots/org/apache/shindig/sample-maven-archetype/2.5.1-SNAPSHOT/sample-maven-archetype-2.5.1-20130717.015038-2.jar. Return code is: 401, ReasonPhrase:Unauthorized.
	at org.sonatype.aether.impl.internal.DefaultDeployer.deploy(DefaultDeployer.java:280)
	at org.sonatype.aether.impl.internal.DefaultDeployer.deploy(DefaultDeployer.java:211)
	at org.sonatype.aether.impl.internal.DefaultRepositorySystem.deploy(DefaultRepositorySystem.java:443)
	at org.apache.maven.artifact.deployer.DefaultArtifactDeployer.deploy(DefaultArtifactDeployer.java:137)
	... 11 more
Caused by: org.sonatype.aether.transfer.ArtifactTransferException: Could not transfer artifact org.apache.shindig:sample-maven-archetype:jar:2.5.1-20130717.015038-2 from/to  (https://repository.apache.org/content/repositories/snapshots): Failed to transfer file: https://repository.apache.org/content/repositories/snapshots/org/apache/shindig/sample-maven-archetype/2.5.1-SNAPSHOT/sample-maven-archetype-2.5.1-20130717.015038-2.jar. Return code is: 401, ReasonPhrase:Unauthorized.
	at org.sonatype.aether.connector.wagon.WagonRepositoryConnector$4.wrap(WagonRepositoryConnector.java:951)
	at org.sonatype.aether.connector.wagon.WagonRepositoryConnector$4.wrap(WagonRepositoryConnector.java:941)
	at org.sonatype.aether.connector.wagon.WagonRepositoryConnector$PutTask.run(WagonRepositoryConnector.java:837)
	at org.sonatype.aether.connector.wagon.WagonRepositoryConnector.put(WagonRepositoryConnector.java:467)
	at org.sonatype.aether.impl.internal.DefaultDeployer.deploy(DefaultDeployer.java:274)
	... 14 more
Caused by: org.apache.maven.wagon.TransferFailedException: Failed to transfer file: https://repository.apache.org/content/repositories/snapshots/org/apache/shindig/sample-maven-archetype/2.5.1-SNAPSHOT/sample-maven-archetype-2.5.1-20130717.015038-2.jar. Return code is: 401, ReasonPhrase:Unauthorized.
	at org.apache.maven.wagon.shared.http4.AbstractHttpClientWagon.put(AbstractHttpClientWagon.java:613)
	at org.apache.maven.wagon.shared.http4.AbstractHttpClientWagon.put(AbstractHttpClientWagon.java:509)
	at org.apache.maven.wagon.shared.http4.AbstractHttpClientWagon.put(AbstractHttpClientWagon.java:490)
	at org.apache.maven.wagon.shared.http4.AbstractHttpClientWagon.put(AbstractHttpClientWagon.java:470)
	at org.sonatype.aether.connector.wagon.WagonRepositoryConnector$PutTask.run(WagonRepositoryConnector.java:811)
	... 16 more
[INFO] Deployment failed after 0.6 sec
Build step 'Deploy artifacts to Maven repository' changed build result to FAILURE
Skipping Cobertura coverage report as build was not UNSTABLE or better ...

Jenkins build is back to normal : Shindig Trunk (JDK 1.6) #156

Posted by Apache Jenkins Server <je...@builds.apache.org>.
See <https://builds.apache.org/job/Shindig%20Trunk%20(JDK%201.6)/156/>