You are viewing a plain text version of this content. The canonical link for it is here.
Posted to builds@beam.apache.org by Apache Jenkins Server <je...@builds.apache.org> on 2023/01/04 12:19:48 UTC
Build failed in Jenkins: beam_PostCommit_XVR_Direct #3585
See <https://ci-beam.apache.org/job/beam_PostCommit_XVR_Direct/3585/display/redirect>
Changes:
------------------------------------------
[...truncated 2.50 MB...]
_common.wait(self._state.condition.wait, _response_ready)
if self._state.response is not None:
response = self._state.response
self._state.response = None
return response
elif cygrpc.OperationType.receive_message not in self._state.due:
if self._state.code is grpc.StatusCode.OK:
raise StopIteration()
elif self._state.code is not None:
> raise self
E grpc._channel._MultiThreadedRendezvous: <_MultiThreadedRendezvous of RPC that terminated with:
E status = StatusCode.DEADLINE_EXCEEDED
E details = "Deadline Exceeded"
E debug_error_string = "UNKNOWN:Error received from peer ipv4:127.0.0.1:46053 {grpc_message:"Deadline Exceeded", grpc_status:4, created_time:"2023-01-04T12:19:39.492174352+00:00"}"
E >
../../build/gradleenv/1922375555/lib/python3.10/site-packages/grpc/_channel.py:826: _MultiThreadedRendezvous
------------------------------ Captured log call -------------------------------
INFO apache_beam.utils.subprocess_server:subprocess_server.py:239 Using pre-built snapshot at <https://ci-beam.apache.org/job/beam_PostCommit_XVR_Direct/ws/src/sdks/java/extensions/sql/expansion-service/build/libs/beam-sdks-java-extensions-sql-expansion-service-2.45.0-SNAPSHOT.jar>
INFO root:external.py:847 Starting a JAR-based expansion service from JAR <https://ci-beam.apache.org/job/beam_PostCommit_XVR_Direct/ws/src/sdks/java/extensions/sql/expansion-service/build/libs/beam-sdks-java-extensions-sql-expansion-service-2.45.0-SNAPSHOT.jar>
INFO apache_beam.utils.subprocess_server:subprocess_server.py:116 Starting service with ['java' '-jar' '<https://ci-beam.apache.org/job/beam_PostCommit_XVR_Direct/ws/src/sdks/java/extensions/sql/expansion-service/build/libs/beam-sdks-java-extensions-sql-expansion-service-2.45.0-SNAPSHOT.jar'> '48797' '--filesToStage=<https://ci-beam.apache.org/job/beam_PostCommit_XVR_Direct/ws/src/sdks/java/extensions/sql/expansion-service/build/libs/beam-sdks-java-extensions-sql-expansion-service-2.45.0-SNAPSHOT.jar']>
INFO apache_beam.utils.subprocess_server:subprocess_server.py:126 Starting expansion service at localhost:48797
INFO apache_beam.utils.subprocess_server:subprocess_server.py:126 Jan 04, 2023 12:18:25 PM org.apache.beam.sdk.expansion.service.ExpansionService loadRegisteredTransforms
INFO apache_beam.utils.subprocess_server:subprocess_server.py:126 INFO: Registering external transforms: [beam:external:java:sql:v1, beam:transform:org.apache.beam:pubsub_read:v1, beam:transform:org.apache.beam:pubsub_write:v1, beam:transform:org.apache.beam:pubsublite_write:v1, beam:transform:org.apache.beam:pubsublite_read:v1, beam:transform:org.apache.beam:spanner_insert:v1, beam:transform:org.apache.beam:spanner_update:v1, beam:transform:org.apache.beam:spanner_replace:v1, beam:transform:org.apache.beam:spanner_insert_or_update:v1, beam:transform:org.apache.beam:spanner_delete:v1, beam:transform:org.apache.beam:spanner_read:v1, beam:transform:org.apache.beam:kafka_read_with_metadata:v1, beam:transform:org.apache.beam:kafka_read_without_metadata:v1, beam:transform:org.apache.beam:kafka_write:v1, beam:external:java:generate_sequence:v1]
INFO apache_beam.utils.subprocess_server:subprocess_server.py:126
INFO apache_beam.utils.subprocess_server:subprocess_server.py:126 Registered transforms:
INFO apache_beam.utils.subprocess_server:subprocess_server.py:126 beam:external:java:sql:v1: org.apache.beam.sdk.expansion.service.ExpansionService$ExternalTransformRegistrarLoader$1@38425407
INFO apache_beam.utils.subprocess_server:subprocess_server.py:126 beam:transform:org.apache.beam:pubsub_read:v1: org.apache.beam.sdk.expansion.service.ExpansionService$ExternalTransformRegistrarLoader$1@43bc63a3
INFO apache_beam.utils.subprocess_server:subprocess_server.py:126 beam:transform:org.apache.beam:pubsub_write:v1: org.apache.beam.sdk.expansion.service.ExpansionService$ExternalTransformRegistrarLoader$1@702657cc
INFO apache_beam.utils.subprocess_server:subprocess_server.py:126 beam:transform:org.apache.beam:pubsublite_write:v1: org.apache.beam.sdk.expansion.service.ExpansionService$ExternalTransformRegistrarLoader$1@6a6cb05c
INFO apache_beam.utils.subprocess_server:subprocess_server.py:126 beam:transform:org.apache.beam:pubsublite_read:v1: org.apache.beam.sdk.expansion.service.ExpansionService$ExternalTransformRegistrarLoader$1@40a4337a
INFO apache_beam.utils.subprocess_server:subprocess_server.py:126 beam:transform:org.apache.beam:spanner_insert:v1: org.apache.beam.sdk.expansion.service.ExpansionService$ExternalTransformRegistrarLoader$1@6025e1b6
INFO apache_beam.utils.subprocess_server:subprocess_server.py:126 beam:transform:org.apache.beam:spanner_update:v1: org.apache.beam.sdk.expansion.service.ExpansionService$ExternalTransformRegistrarLoader$1@22ff4249
INFO apache_beam.utils.subprocess_server:subprocess_server.py:126 beam:transform:org.apache.beam:spanner_replace:v1: org.apache.beam.sdk.expansion.service.ExpansionService$ExternalTransformRegistrarLoader$1@2d1ef81a
INFO apache_beam.utils.subprocess_server:subprocess_server.py:126 beam:transform:org.apache.beam:spanner_insert_or_update:v1: org.apache.beam.sdk.expansion.service.ExpansionService$ExternalTransformRegistrarLoader$1@4c402120
INFO apache_beam.utils.subprocess_server:subprocess_server.py:126 beam:transform:org.apache.beam:spanner_delete:v1: org.apache.beam.sdk.expansion.service.ExpansionService$ExternalTransformRegistrarLoader$1@327514f
INFO apache_beam.utils.subprocess_server:subprocess_server.py:126 beam:transform:org.apache.beam:spanner_read:v1: org.apache.beam.sdk.expansion.service.ExpansionService$ExternalTransformRegistrarLoader$1@5b12b668
INFO apache_beam.utils.subprocess_server:subprocess_server.py:126 beam:transform:org.apache.beam:kafka_read_with_metadata:v1: org.apache.beam.sdk.expansion.service.ExpansionService$ExternalTransformRegistrarLoader$1@1165b38
INFO apache_beam.utils.subprocess_server:subprocess_server.py:126 beam:transform:org.apache.beam:kafka_read_without_metadata:v1: org.apache.beam.sdk.expansion.service.ExpansionService$ExternalTransformRegistrarLoader$1@4c12331b
INFO apache_beam.utils.subprocess_server:subprocess_server.py:126 beam:transform:org.apache.beam:kafka_write:v1: org.apache.beam.sdk.expansion.service.ExpansionService$ExternalTransformRegistrarLoader$1@7586beff
INFO apache_beam.utils.subprocess_server:subprocess_server.py:126 beam:external:java:generate_sequence:v1: org.apache.beam.sdk.expansion.service.ExpansionService$ExternalTransformRegistrarLoader$1@3b69e7d1
INFO apache_beam.utils.subprocess_server:subprocess_server.py:126
INFO apache_beam.utils.subprocess_server:subprocess_server.py:126 Registered SchemaTransformProviders:
INFO apache_beam.utils.subprocess_server:subprocess_server.py:126 beam:schematransform:org.apache.beam:kafka_read:v1
INFO apache_beam.utils.subprocess_server:subprocess_server.py:126 beam:schematransform:org.apache.beam:bigquery_storage_write:v1
INFO apache_beam.utils.subprocess_server:subprocess_server.py:126 beam:schematransform:org.apache.beam:spanner_write:v1
INFO apache_beam.utils.subprocess_server:subprocess_server.py:126 beam:transform:org.apache.beam:bigquery_storage_read:v1
INFO apache_beam.utils.subprocess_server:subprocess_server.py:126 Jan 04, 2023 12:18:26 PM org.apache.beam.sdk.expansion.service.ExpansionService expand
INFO apache_beam.utils.subprocess_server:subprocess_server.py:126 INFO: Expanding 'SqlTransform(beam:external:java:sql:v1)' with URN 'beam:external:java:sql:v1'
INFO apache_beam.utils.subprocess_server:subprocess_server.py:126 Jan 04, 2023 12:18:26 PM org.apache.beam.sdk.expansion.service.ExpansionService$ExternalTransformRegistrarLoader payloadToConfig
INFO apache_beam.utils.subprocess_server:subprocess_server.py:126 WARNING: Configuration class 'org.apache.beam.sdk.extensions.sql.expansion.ExternalSqlTransformRegistrar$Configuration' has no schema registered. Attempting to construct with setter approach.
INFO apache_beam.utils.subprocess_server:subprocess_server.py:126 Jan 04, 2023 12:18:27 PM org.apache.beam.sdk.expansion.service.ExpansionService$ExternalTransformRegistrarLoader payloadToConfig
INFO apache_beam.utils.subprocess_server:subprocess_server.py:126 WARNING: Configuration class 'org.apache.beam.sdk.extensions.sql.expansion.ExternalSqlTransformRegistrar$Configuration' has no schema registered. Attempting to construct with setter approach.
INFO apache_beam.utils.subprocess_server:subprocess_server.py:126 Jan 04, 2023 12:18:29 PM com.google.zetasql.io.grpc.NameResolverRegistry getDefaultRegistry
INFO apache_beam.utils.subprocess_server:subprocess_server.py:126 WARNING: No NameResolverProviders found via ServiceLoader, including for DNS. This is probably due to a broken build. If using ProGuard, check your configuration
INFO apache_beam.utils.subprocess_server:subprocess_server.py:126 Jan 04, 2023 12:18:31 PM org.apache.beam.sdk.extensions.sql.zetasql.ZetaSQLQueryPlanner convertToBeamRelInternal
INFO apache_beam.utils.subprocess_server:subprocess_server.py:126 INFO: BEAMPlan>
INFO apache_beam.utils.subprocess_server:subprocess_server.py:126 BeamZetaSqlCalcRel(expr#0=[{inputs}], expr#1=[1:BIGINT], expr#2=['foo':VARCHAR], expr#3=[3.1400000000000001243E0:DOUBLE], int=[$t1], str=[$t2], flt=[$t3])
INFO apache_beam.utils.subprocess_server:subprocess_server.py:126 BeamValuesRel(tuples=[[{ 0 }]])
INFO apache_beam.utils.subprocess_server:subprocess_server.py:126
INFO root:environments.py:376 Default Python SDK image for environment is apache/beam_python3.10_sdk:2.45.0.dev
INFO root:environments.py:299 No image given, using default Python SDK image
INFO root:environments.py:376 Default Python SDK image for environment is apache/beam_python3.10_sdk:2.45.0.dev
INFO root:environments.py:302 Python SDK container image set to "apache/beam_python3.10_sdk:2.45.0.dev" for Docker environment
INFO apache_beam.runners.portability.fn_api_runner.translations:translations.py:710 ==================== <function pack_combiners at 0x7f05ec756cb0> ====================
INFO apache_beam.runners.portability.fn_api_runner.translations:translations.py:710 ==================== <function lift_combiners at 0x7f05ec756d40> ====================
INFO apache_beam.runners.portability.fn_api_runner.translations:translations.py:710 ==================== <function sort_stages at 0x7f05ec757490> ====================
INFO apache_beam.runners.portability.portable_runner:portable_runner.py:581 Job state changed to STOPPED
INFO apache_beam.runners.portability.portable_runner:portable_runner.py:581 Job state changed to STARTING
INFO apache_beam.runners.portability.portable_runner:portable_runner.py:581 Job state changed to RUNNING
INFO root:portable_runner.py:574 Default Python SDK image for environment is apache/beam_python3.10_sdk:2.45.0.dev
INFO root:portable_runner.py:574 ==================== <function annotate_downstream_side_inputs at 0x7fbacd2c2a70> ====================
INFO root:portable_runner.py:574 ==================== <function fix_side_input_pcoll_coders at 0x7fbacd2c2b90> ====================
INFO root:portable_runner.py:574 ==================== <function pack_combiners at 0x7fbacd2c30a0> ====================
INFO root:portable_runner.py:574 ==================== <function lift_combiners at 0x7fbacd2c3130> ====================
INFO root:portable_runner.py:574 ==================== <function expand_sdf at 0x7fbacd2c32e0> ====================
INFO root:portable_runner.py:574 ==================== <function expand_gbk at 0x7fbacd2c3370> ====================
INFO root:portable_runner.py:574 ==================== <function sink_flattens at 0x7fbacd2c3490> ====================
INFO root:portable_runner.py:574 ==================== <function greedily_fuse at 0x7fbacd2c3520> ====================
INFO root:portable_runner.py:574 ==================== <function read_to_impulse at 0x7fbacd2c35b0> ====================
INFO root:portable_runner.py:574 ==================== <function impulse_to_input at 0x7fbacd2c3640> ====================
INFO root:portable_runner.py:574 ==================== <function sort_stages at 0x7fbacd2c3880> ====================
INFO root:portable_runner.py:574 ==================== <function add_impulse_to_dangling_transforms at 0x7fbacd2c39a0> ====================
INFO root:portable_runner.py:574 ==================== <function setup_timer_mapping at 0x7fbacd2c37f0> ====================
INFO root:portable_runner.py:574 ==================== <function populate_data_channel_coders at 0x7fbacd2c3910> ====================
INFO root:portable_runner.py:574 starting control server on port 41993
INFO root:portable_runner.py:574 starting data server on port 42801
INFO root:portable_runner.py:574 starting state server on port 42721
INFO root:portable_runner.py:574 starting logging server on port 38209
INFO root:portable_runner.py:574 Created Worker handler <apache_beam.runners.portability.fn_api_runner.worker_handlers.DockerSdkWorkerHandler object at 0x7fbaa47035e0> for environment ref_Environment_default_environment_2 (beam:env:docker:v1, b'\n%apache/beam_python3.10_sdk:2.45.0.dev')
INFO root:portable_runner.py:574 Attempting to pull image apache/beam_python3.10_sdk:2.45.0.dev
INFO root:portable_runner.py:574 Unable to pull image apache/beam_python3.10_sdk:2.45.0.dev, defaulting to local image if it exists
INFO root:portable_runner.py:574 Waiting for docker to start up. Current status is running
INFO root:portable_runner.py:574 Docker container is running. container_id = b'47fe24931c1079e02f1b2653cc763c7e69114a9ad60dfb587ca564389069da56', worker_id = worker_87
INFO root:portable_runner.py:574 Created Worker handler <apache_beam.runners.portability.fn_api_runner.worker_handlers.DockerSdkWorkerHandler object at 0x7fbacc135270> for environment external_9beam:env:docker:v1 (beam:env:docker:v1, b'\n apache/beam_java8_sdk:2.45.0.dev')
INFO root:portable_runner.py:574 Attempting to pull image apache/beam_java8_sdk:2.45.0.dev
INFO root:portable_runner.py:574 Unable to pull image apache/beam_java8_sdk:2.45.0.dev, defaulting to local image if it exists
INFO root:portable_runner.py:574 Waiting for docker to start up. Current status is running
INFO root:portable_runner.py:574 Docker container is running. container_id = b'6f856f311248ba6448b47f1e202473da95c8f54bafd9a6ed9ebf8de8ee2aca0c', worker_id = worker_88
=============================== warnings summary ===============================
../../build/gradleenv/1922375555/lib/python3.10/site-packages/hdfs/config.py:15
<https://ci-beam.apache.org/job/beam_PostCommit_XVR_Direct/ws/src/build/gradleenv/1922375555/lib/python3.10/site-packages/hdfs/config.py>:15: DeprecationWarning: the imp module is deprecated in favour of importlib and slated for removal in Python 3.12; see the module's documentation for alternative uses
from imp import load_source
../../build/gradleenv/1922375555/lib/python3.10/site-packages/google/api_core/operations_v1/abstract_operations_client.py:17
<https://ci-beam.apache.org/job/beam_PostCommit_XVR_Direct/ws/src/build/gradleenv/1922375555/lib/python3.10/site-packages/google/api_core/operations_v1/abstract_operations_client.py>:17: DeprecationWarning: The distutils package is deprecated and slated for removal in Python 3.12. Use setuptools or check PEP 632 for potential alternatives
from distutils import util
../../build/gradleenv/1922375555/lib/python3.10/site-packages/tenacity/_asyncio.py:42
<https://ci-beam.apache.org/job/beam_PostCommit_XVR_Direct/ws/src/build/gradleenv/1922375555/lib/python3.10/site-packages/tenacity/_asyncio.py>:42: DeprecationWarning: "@coroutine" decorator is deprecated since Python 3.8, use "async def" instead
def call(self, fn, *args, **kwargs):
apache_beam/typehints/pandas_type_compatibility_test.py:67
<https://ci-beam.apache.org/job/beam_PostCommit_XVR_Direct/ws/src/sdks/python/apache_beam/typehints/pandas_type_compatibility_test.py>:67: FutureWarning: pandas.Int64Index is deprecated and will be removed from pandas in a future version. Use pandas.Index with the appropriate dtype instead.
}).set_index(pd.Int64Index(range(123, 223), name='an_index')),
apache_beam/typehints/pandas_type_compatibility_test.py:90
<https://ci-beam.apache.org/job/beam_PostCommit_XVR_Direct/ws/src/sdks/python/apache_beam/typehints/pandas_type_compatibility_test.py>:90: FutureWarning: pandas.Int64Index is deprecated and will be removed from pandas in a future version. Use pandas.Index with the appropriate dtype instead.
pd.Int64Index(range(123, 223), name='an_index'),
apache_beam/typehints/pandas_type_compatibility_test.py:91
<https://ci-beam.apache.org/job/beam_PostCommit_XVR_Direct/ws/src/sdks/python/apache_beam/typehints/pandas_type_compatibility_test.py>:91: FutureWarning: pandas.Int64Index is deprecated and will be removed from pandas in a future version. Use pandas.Index with the appropriate dtype instead.
pd.Int64Index(range(475, 575), name='another_index'),
apache_beam/transforms/sql_test.py::SqlTransformTest::test_tagged_join
<https://ci-beam.apache.org/job/beam_PostCommit_XVR_Direct/ws/src/build/gradleenv/1922375555/lib/python3.10/site-packages/_pytest/threadexception.py>:73: PytestUnhandledThreadExceptionWarning: Exception in thread wait_until_finish_read
Traceback (most recent call last):
File "/usr/lib/python3.10/threading.py", line 1009, in _bootstrap_inner
self.run()
File "/usr/lib/python3.10/threading.py", line 946, in run
self._target(*self._args, **self._kwargs)
File "<https://ci-beam.apache.org/job/beam_PostCommit_XVR_Direct/ws/src/sdks/python/apache_beam/runners/portability/portable_runner.py",> line 572, in read_messages
for message in self._message_stream:
File "<https://ci-beam.apache.org/job/beam_PostCommit_XVR_Direct/ws/src/build/gradleenv/1922375555/lib/python3.10/site-packages/grpc/_channel.py",> line 426, in __next__
return self._next()
File "<https://ci-beam.apache.org/job/beam_PostCommit_XVR_Direct/ws/src/build/gradleenv/1922375555/lib/python3.10/site-packages/grpc/_channel.py",> line 826, in _next
raise self
grpc._channel._MultiThreadedRendezvous: <_MultiThreadedRendezvous of RPC that terminated with:
status = StatusCode.DEADLINE_EXCEEDED
details = "Deadline Exceeded"
debug_error_string = "UNKNOWN:Error received from peer ipv4:127.0.0.1:46053 {grpc_message:"Deadline Exceeded", grpc_status:4, created_time:"2023-01-04T12:17:10.332094575+00:00"}"
>
warnings.warn(pytest.PytestUnhandledThreadExceptionWarning(msg))
apache_beam/transforms/sql_test.py::SqlTransformTest::test_windowing_before_sql
<https://ci-beam.apache.org/job/beam_PostCommit_XVR_Direct/ws/src/build/gradleenv/1922375555/lib/python3.10/site-packages/_pytest/threadexception.py>:73: PytestUnhandledThreadExceptionWarning: Exception in thread wait_until_finish_read
Traceback (most recent call last):
File "/usr/lib/python3.10/threading.py", line 1009, in _bootstrap_inner
self.run()
File "/usr/lib/python3.10/threading.py", line 946, in run
self._target(*self._args, **self._kwargs)
File "<https://ci-beam.apache.org/job/beam_PostCommit_XVR_Direct/ws/src/sdks/python/apache_beam/runners/portability/portable_runner.py",> line 572, in read_messages
for message in self._message_stream:
File "<https://ci-beam.apache.org/job/beam_PostCommit_XVR_Direct/ws/src/build/gradleenv/1922375555/lib/python3.10/site-packages/grpc/_channel.py",> line 426, in __next__
return self._next()
File "<https://ci-beam.apache.org/job/beam_PostCommit_XVR_Direct/ws/src/build/gradleenv/1922375555/lib/python3.10/site-packages/grpc/_channel.py",> line 826, in _next
raise self
grpc._channel._MultiThreadedRendezvous: <_MultiThreadedRendezvous of RPC that terminated with:
status = StatusCode.DEADLINE_EXCEEDED
details = "Deadline Exceeded"
debug_error_string = "UNKNOWN:Error received from peer ipv4:127.0.0.1:46053 {created_time:"2023-01-04T12:18:23.92511429+00:00", grpc_status:4, grpc_message:"Deadline Exceeded"}"
>
warnings.warn(pytest.PytestUnhandledThreadExceptionWarning(msg))
apache_beam/transforms/sql_test.py::SqlTransformTest::test_zetasql_generate_data
<https://ci-beam.apache.org/job/beam_PostCommit_XVR_Direct/ws/src/build/gradleenv/1922375555/lib/python3.10/site-packages/_pytest/threadexception.py>:73: PytestUnhandledThreadExceptionWarning: Exception in thread wait_until_finish_read
Traceback (most recent call last):
File "/usr/lib/python3.10/threading.py", line 1009, in _bootstrap_inner
self.run()
File "/usr/lib/python3.10/threading.py", line 946, in run
self._target(*self._args, **self._kwargs)
File "<https://ci-beam.apache.org/job/beam_PostCommit_XVR_Direct/ws/src/sdks/python/apache_beam/runners/portability/portable_runner.py",> line 572, in read_messages
for message in self._message_stream:
File "<https://ci-beam.apache.org/job/beam_PostCommit_XVR_Direct/ws/src/build/gradleenv/1922375555/lib/python3.10/site-packages/grpc/_channel.py",> line 426, in __next__
return self._next()
File "<https://ci-beam.apache.org/job/beam_PostCommit_XVR_Direct/ws/src/build/gradleenv/1922375555/lib/python3.10/site-packages/grpc/_channel.py",> line 826, in _next
raise self
grpc._channel._MultiThreadedRendezvous: <_MultiThreadedRendezvous of RPC that terminated with:
status = StatusCode.DEADLINE_EXCEEDED
details = "Deadline Exceeded"
debug_error_string = "UNKNOWN:Error received from peer ipv4:127.0.0.1:46053 {created_time:"2023-01-04T12:19:39.493120042+00:00", grpc_status:4, grpc_message:"Deadline Exceeded"}"
>
warnings.warn(pytest.PytestUnhandledThreadExceptionWarning(msg))
-- Docs: https://docs.pytest.org/en/stable/how-to/capture-warnings.html
- generated xml file: <https://ci-beam.apache.org/job/beam_PostCommit_XVR_Direct/ws/src/sdks/python/pytest_xlangSqlValidateRunner.xml> -
=========================== short test summary info ============================
FAILED apache_beam/transforms/sql_test.py::SqlTransformTest::test_tagged_join - grpc._channel._MultiThreadedRendezvous: <_MultiThreadedRendezvous of RPC that terminated with:
status = StatusCode.DEADLINE_EXCEEDED
details = "Deadline Exceeded"
debug_error_string = "UNKNOWN:Error received from peer ipv4:127.0.0.1:46053 {grpc_message:"Deadline Exceeded", grpc_status:4, created_time:"2023-01-04T12:17:10.331227418+00:00"}"
>
FAILED apache_beam/transforms/sql_test.py::SqlTransformTest::test_windowing_before_sql - grpc._channel._MultiThreadedRendezvous: <_MultiThreadedRendezvous of RPC that terminated with:
status = StatusCode.DEADLINE_EXCEEDED
details = "Deadline Exceeded"
debug_error_string = "UNKNOWN:Error received from peer ipv4:127.0.0.1:46053 {grpc_message:"Deadline Exceeded", grpc_status:4, created_time:"2023-01-04T12:18:23.924161918+00:00"}"
>
FAILED apache_beam/transforms/sql_test.py::SqlTransformTest::test_zetasql_generate_data - grpc._channel._MultiThreadedRendezvous: <_MultiThreadedRendezvous of RPC that terminated with:
status = StatusCode.DEADLINE_EXCEEDED
details = "Deadline Exceeded"
debug_error_string = "UNKNOWN:Error received from peer ipv4:127.0.0.1:46053 {grpc_message:"Deadline Exceeded", grpc_status:4, created_time:"2023-01-04T12:19:39.492174352+00:00"}"
>
= 3 failed, 6 passed, 5 skipped, 6788 deselected, 9 warnings in 411.69s (0:06:51) =
> Task :sdks:python:test-suites:direct:xlang:validatesCrossLanguageRunnerPythonUsingSql FAILED
> Task :sdks:python:test-suites:direct:xlang:fnApiJobServerCleanup
Killing process at 2753233
> Task :sdks:python:test-suites:direct:xlang:validatesCrossLanguageRunnerCleanup
Stopping expansion service pid: 2756209.
Stopping expansion service pid: 2756210.
FAILURE: Build failed with an exception.
* What went wrong:
Execution failed for task ':sdks:python:test-suites:direct:xlang:validatesCrossLanguageRunnerPythonUsingSql'.
> Process 'command 'sh'' finished with non-zero exit value 1
* Try:
> Run with --stacktrace option to get the stack trace.
> Run with --info or --debug option to get more log output.
* Get more help at https://help.gradle.org
Deprecated Gradle features were used in this build, making it incompatible with Gradle 8.0.
You can use '--warning-mode all' to show the individual deprecation warnings and determine if they come from your own scripts or plugins.
See https://docs.gradle.org/7.5.1/userguide/command_line_interface.html#sec:command_line_warnings
Execution optimizations have been disabled for 1 invalid unit(s) of work during this build to ensure correctness.
Please consult deprecation warnings for more details.
BUILD FAILED in 36m 3s
232 actionable tasks: 32 executed, 200 up-to-date
Publishing build scan...
https://gradle.com/s/pujk5suvrb5ui
Build step 'Invoke Gradle script' changed build result to FAILURE
Build step 'Invoke Gradle script' marked build as failure
---------------------------------------------------------------------
To unsubscribe, e-mail: builds-unsubscribe@beam.apache.org
For additional commands, e-mail: builds-help@beam.apache.org
Jenkins build is back to normal : beam_PostCommit_XVR_Direct #3587
Posted by Apache Jenkins Server <je...@builds.apache.org>.
See <https://ci-beam.apache.org/job/beam_PostCommit_XVR_Direct/3587/display/redirect?page=changes>
---------------------------------------------------------------------
To unsubscribe, e-mail: builds-unsubscribe@beam.apache.org
For additional commands, e-mail: builds-help@beam.apache.org
Build failed in Jenkins: beam_PostCommit_XVR_Direct #3586
Posted by Apache Jenkins Server <je...@builds.apache.org>.
See <https://ci-beam.apache.org/job/beam_PostCommit_XVR_Direct/3586/display/redirect?page=changes>
Changes:
[noreply] Disable sonarqube cron job (#24769)
------------------------------------------
[...truncated 995.79 KB...]
INFO root:portable_runner.py:577 ==================== <function greedily_fuse at 0x7f15140c1cb0> ====================
INFO root:portable_runner.py:577 ==================== <function read_to_impulse at 0x7f15140c1d40> ====================
INFO root:portable_runner.py:577 ==================== <function impulse_to_input at 0x7f15140c1dd0> ====================
INFO root:portable_runner.py:577 ==================== <function sort_stages at 0x7f15140c2050> ====================
INFO root:portable_runner.py:577 ==================== <function add_impulse_to_dangling_transforms at 0x7f15140c2170> ====================
INFO root:portable_runner.py:577 ==================== <function setup_timer_mapping at 0x7f15140c1f80> ====================
INFO root:portable_runner.py:577 ==================== <function populate_data_channel_coders at 0x7f15140c20e0> ====================
INFO root:portable_runner.py:577 starting control server on port 45277
INFO root:portable_runner.py:577 starting data server on port 46677
INFO root:portable_runner.py:577 starting state server on port 34281
INFO root:portable_runner.py:577 starting logging server on port 41569
INFO root:portable_runner.py:577 Created Worker handler <apache_beam.runners.portability.fn_api_runner.worker_handlers.DockerSdkWorkerHandler object at 0x7f150e649350> for environment ref_Environment_default_environment_2 (beam:env:docker:v1, b'\n$apache/beam_python3.7_sdk:2.45.0.dev')
INFO root:portable_runner.py:577 Attempting to pull image apache/beam_python3.7_sdk:2.45.0.dev
INFO root:portable_runner.py:577 Unable to pull image apache/beam_python3.7_sdk:2.45.0.dev, defaulting to local image if it exists
INFO root:portable_runner.py:577 Waiting for docker to start up. Current status is running
INFO root:portable_runner.py:577 Docker container is running. container_id = b'083622db457f661b28dbb721736868f038261cb8333b21e863c044ce680878c0', worker_id = worker_83
INFO root:portable_runner.py:577 Created Worker handler <apache_beam.runners.portability.fn_api_runner.worker_handlers.DockerSdkWorkerHandler object at 0x7f150c780510> for environment external_7beam:env:docker:v1 (beam:env:docker:v1, b'\n apache/beam_java8_sdk:2.45.0.dev')
INFO root:portable_runner.py:577 Attempting to pull image apache/beam_java8_sdk:2.45.0.dev
INFO root:portable_runner.py:577 Unable to pull image apache/beam_java8_sdk:2.45.0.dev, defaulting to local image if it exists
INFO root:portable_runner.py:577 Waiting for docker to start up. Current status is running
INFO root:portable_runner.py:577 Docker container is running. container_id = b'e186065ed56eef2d6995ada5680ade26af00721ecd6a21dcf51ec4980d74f776', worker_id = worker_84
INFO root:portable_runner.py:577 Completed job in 11.667940616607666 seconds with state DONE.
INFO apache_beam.runners.portability.portable_runner:portable_runner.py:583 Job state changed to DONE
PASSED [ 77%]
apache_beam/transforms/sql_test.py::SqlTransformTest::test_windowing_before_sql
-------------------------------- live log call ---------------------------------
INFO apache_beam.utils.subprocess_server:subprocess_server.py:239 Using pre-built snapshot at <https://ci-beam.apache.org/job/beam_PostCommit_XVR_Direct/ws/src/sdks/java/extensions/sql/expansion-service/build/libs/beam-sdks-java-extensions-sql-expansion-service-2.45.0-SNAPSHOT.jar>
INFO root:external.py:851 Starting a JAR-based expansion service from JAR <https://ci-beam.apache.org/job/beam_PostCommit_XVR_Direct/ws/src/sdks/java/extensions/sql/expansion-service/build/libs/beam-sdks-java-extensions-sql-expansion-service-2.45.0-SNAPSHOT.jar>
INFO apache_beam.utils.subprocess_server:subprocess_server.py:116 Starting service with ['java' '-jar' '<https://ci-beam.apache.org/job/beam_PostCommit_XVR_Direct/ws/src/sdks/java/extensions/sql/expansion-service/build/libs/beam-sdks-java-extensions-sql-expansion-service-2.45.0-SNAPSHOT.jar'> '38005' '--filesToStage=<https://ci-beam.apache.org/job/beam_PostCommit_XVR_Direct/ws/src/sdks/java/extensions/sql/expansion-service/build/libs/beam-sdks-java-extensions-sql-expansion-service-2.45.0-SNAPSHOT.jar']>
INFO apache_beam.utils.subprocess_server:subprocess_server.py:126 Starting expansion service at localhost:38005
INFO apache_beam.utils.subprocess_server:subprocess_server.py:126 Jan 04, 2023 5:46:17 PM org.apache.beam.sdk.expansion.service.ExpansionService loadRegisteredTransforms
INFO apache_beam.utils.subprocess_server:subprocess_server.py:126 INFO: Registering external transforms: [beam:external:java:sql:v1, beam:transform:org.apache.beam:pubsub_read:v1, beam:transform:org.apache.beam:pubsub_write:v1, beam:transform:org.apache.beam:pubsublite_write:v1, beam:transform:org.apache.beam:pubsublite_read:v1, beam:transform:org.apache.beam:spanner_insert:v1, beam:transform:org.apache.beam:spanner_update:v1, beam:transform:org.apache.beam:spanner_replace:v1, beam:transform:org.apache.beam:spanner_insert_or_update:v1, beam:transform:org.apache.beam:spanner_delete:v1, beam:transform:org.apache.beam:spanner_read:v1, beam:transform:org.apache.beam:kafka_read_with_metadata:v1, beam:transform:org.apache.beam:kafka_read_without_metadata:v1, beam:transform:org.apache.beam:kafka_write:v1, beam:external:java:generate_sequence:v1]
INFO apache_beam.utils.subprocess_server:subprocess_server.py:126
INFO apache_beam.utils.subprocess_server:subprocess_server.py:126 Registered transforms:
INFO apache_beam.utils.subprocess_server:subprocess_server.py:126 beam:external:java:sql:v1: org.apache.beam.sdk.expansion.service.ExpansionService$ExternalTransformRegistrarLoader$1@38425407
INFO apache_beam.utils.subprocess_server:subprocess_server.py:126 beam:transform:org.apache.beam:pubsub_read:v1: org.apache.beam.sdk.expansion.service.ExpansionService$ExternalTransformRegistrarLoader$1@43bc63a3
INFO apache_beam.utils.subprocess_server:subprocess_server.py:126 beam:transform:org.apache.beam:pubsub_write:v1: org.apache.beam.sdk.expansion.service.ExpansionService$ExternalTransformRegistrarLoader$1@702657cc
INFO apache_beam.utils.subprocess_server:subprocess_server.py:126 beam:transform:org.apache.beam:pubsublite_write:v1: org.apache.beam.sdk.expansion.service.ExpansionService$ExternalTransformRegistrarLoader$1@6a6cb05c
INFO apache_beam.utils.subprocess_server:subprocess_server.py:126 beam:transform:org.apache.beam:pubsublite_read:v1: org.apache.beam.sdk.expansion.service.ExpansionService$ExternalTransformRegistrarLoader$1@40a4337a
INFO apache_beam.utils.subprocess_server:subprocess_server.py:126 beam:transform:org.apache.beam:spanner_insert:v1: org.apache.beam.sdk.expansion.service.ExpansionService$ExternalTransformRegistrarLoader$1@6025e1b6
INFO apache_beam.utils.subprocess_server:subprocess_server.py:126 beam:transform:org.apache.beam:spanner_update:v1: org.apache.beam.sdk.expansion.service.ExpansionService$ExternalTransformRegistrarLoader$1@22ff4249
INFO apache_beam.utils.subprocess_server:subprocess_server.py:126 beam:transform:org.apache.beam:spanner_replace:v1: org.apache.beam.sdk.expansion.service.ExpansionService$ExternalTransformRegistrarLoader$1@2d1ef81a
INFO apache_beam.utils.subprocess_server:subprocess_server.py:126 beam:transform:org.apache.beam:spanner_insert_or_update:v1: org.apache.beam.sdk.expansion.service.ExpansionService$ExternalTransformRegistrarLoader$1@4c402120
INFO apache_beam.utils.subprocess_server:subprocess_server.py:126 beam:transform:org.apache.beam:spanner_delete:v1: org.apache.beam.sdk.expansion.service.ExpansionService$ExternalTransformRegistrarLoader$1@327514f
INFO apache_beam.utils.subprocess_server:subprocess_server.py:126 beam:transform:org.apache.beam:spanner_read:v1: org.apache.beam.sdk.expansion.service.ExpansionService$ExternalTransformRegistrarLoader$1@5b12b668
INFO apache_beam.utils.subprocess_server:subprocess_server.py:126 beam:transform:org.apache.beam:kafka_read_with_metadata:v1: org.apache.beam.sdk.expansion.service.ExpansionService$ExternalTransformRegistrarLoader$1@1165b38
INFO apache_beam.utils.subprocess_server:subprocess_server.py:126 beam:transform:org.apache.beam:kafka_read_without_metadata:v1: org.apache.beam.sdk.expansion.service.ExpansionService$ExternalTransformRegistrarLoader$1@4c12331b
INFO apache_beam.utils.subprocess_server:subprocess_server.py:126 beam:transform:org.apache.beam:kafka_write:v1: org.apache.beam.sdk.expansion.service.ExpansionService$ExternalTransformRegistrarLoader$1@7586beff
INFO apache_beam.utils.subprocess_server:subprocess_server.py:126 beam:external:java:generate_sequence:v1: org.apache.beam.sdk.expansion.service.ExpansionService$ExternalTransformRegistrarLoader$1@3b69e7d1
INFO apache_beam.utils.subprocess_server:subprocess_server.py:126
INFO apache_beam.utils.subprocess_server:subprocess_server.py:126 Registered SchemaTransformProviders:
INFO apache_beam.utils.subprocess_server:subprocess_server.py:126 beam:schematransform:org.apache.beam:kafka_read:v1
INFO apache_beam.utils.subprocess_server:subprocess_server.py:126 beam:schematransform:org.apache.beam:bigquery_storage_write:v1
INFO apache_beam.utils.subprocess_server:subprocess_server.py:126 beam:schematransform:org.apache.beam:spanner_write:v1
INFO apache_beam.utils.subprocess_server:subprocess_server.py:126 beam:transform:org.apache.beam:bigquery_storage_read:v1
INFO apache_beam.utils.subprocess_server:subprocess_server.py:126 Jan 04, 2023 5:46:18 PM org.apache.beam.sdk.expansion.service.ExpansionService expand
INFO apache_beam.utils.subprocess_server:subprocess_server.py:126 INFO: Expanding 'SqlTransform(beam:external:java:sql:v1)' with URN 'beam:external:java:sql:v1'
INFO apache_beam.utils.subprocess_server:subprocess_server.py:126 Jan 04, 2023 5:46:19 PM org.apache.beam.sdk.expansion.service.ExpansionService$ExternalTransformRegistrarLoader payloadToConfig
INFO apache_beam.utils.subprocess_server:subprocess_server.py:126 WARNING: Configuration class 'org.apache.beam.sdk.extensions.sql.expansion.ExternalSqlTransformRegistrar$Configuration' has no schema registered. Attempting to construct with setter approach.
INFO apache_beam.utils.subprocess_server:subprocess_server.py:126 Jan 04, 2023 5:46:19 PM org.apache.beam.sdk.expansion.service.ExpansionService$ExternalTransformRegistrarLoader payloadToConfig
INFO apache_beam.utils.subprocess_server:subprocess_server.py:126 WARNING: Configuration class 'org.apache.beam.sdk.extensions.sql.expansion.ExternalSqlTransformRegistrar$Configuration' has no schema registered. Attempting to construct with setter approach.
INFO apache_beam.utils.subprocess_server:subprocess_server.py:126 Jan 04, 2023 5:46:21 PM org.apache.beam.sdk.extensions.sql.impl.CalciteQueryPlanner convertToBeamRel
INFO apache_beam.utils.subprocess_server:subprocess_server.py:126 INFO: SQL:
INFO apache_beam.utils.subprocess_server:subprocess_server.py:126 SELECT COUNT(*) AS `count`
INFO apache_beam.utils.subprocess_server:subprocess_server.py:126 FROM `beam`.`PCOLLECTION` AS `PCOLLECTION`
INFO apache_beam.utils.subprocess_server:subprocess_server.py:126 Jan 04, 2023 5:46:21 PM org.apache.beam.sdk.extensions.sql.impl.CalciteQueryPlanner convertToBeamRel
INFO apache_beam.utils.subprocess_server:subprocess_server.py:126 INFO: SQLPlan>
INFO apache_beam.utils.subprocess_server:subprocess_server.py:126 LogicalAggregate(group=[{}], count=[COUNT()])
INFO apache_beam.utils.subprocess_server:subprocess_server.py:126 BeamIOSourceRel(table=[[beam, PCOLLECTION]])
INFO apache_beam.utils.subprocess_server:subprocess_server.py:126
INFO apache_beam.utils.subprocess_server:subprocess_server.py:126 Jan 04, 2023 5:46:21 PM org.apache.beam.sdk.extensions.sql.impl.CalciteQueryPlanner convertToBeamRel
INFO apache_beam.utils.subprocess_server:subprocess_server.py:126 INFO: BEAMPlan>
INFO apache_beam.utils.subprocess_server:subprocess_server.py:126 BeamAggregationRel(group=[{}], count=[COUNT()])
INFO apache_beam.utils.subprocess_server:subprocess_server.py:126 BeamIOSourceRel(table=[[beam, PCOLLECTION]])
INFO apache_beam.utils.subprocess_server:subprocess_server.py:126
INFO root:environments.py:376 Default Python SDK image for environment is apache/beam_python3.7_sdk:2.45.0.dev
INFO root:environments.py:299 No image given, using default Python SDK image
INFO root:environments.py:376 Default Python SDK image for environment is apache/beam_python3.7_sdk:2.45.0.dev
INFO root:environments.py:304 Python SDK container image set to "apache/beam_python3.7_sdk:2.45.0.dev" for Docker environment
INFO apache_beam.runners.portability.fn_api_runner.translations:translations.py:710 ==================== <function pack_combiners at 0x7ff072a03cb0> ====================
INFO apache_beam.runners.portability.fn_api_runner.translations:translations.py:710 ==================== <function lift_combiners at 0x7ff072a03d40> ====================
INFO apache_beam.runners.portability.fn_api_runner.translations:translations.py:710 ==================== <function sort_stages at 0x7ff072a044d0> ====================
INFO apache_beam.runners.portability.portable_runner:portable_runner.py:583 Job state changed to STOPPED
INFO apache_beam.runners.portability.portable_runner:portable_runner.py:583 Job state changed to STARTING
INFO apache_beam.runners.portability.portable_runner:portable_runner.py:583 Job state changed to RUNNING
INFO root:portable_runner.py:577 Default Python SDK image for environment is apache/beam_python3.7_sdk:2.45.0.dev
INFO root:portable_runner.py:577 ==================== <function annotate_downstream_side_inputs at 0x7f15140c1200> ====================
INFO root:portable_runner.py:577 ==================== <function fix_side_input_pcoll_coders at 0x7f15140c1320> ====================
INFO root:portable_runner.py:577 ==================== <function pack_combiners at 0x7f15140c1830> ====================
INFO root:portable_runner.py:577 ==================== <function lift_combiners at 0x7f15140c18c0> ====================
INFO root:portable_runner.py:577 ==================== <function expand_sdf at 0x7f15140c1a70> ====================
INFO root:portable_runner.py:577 ==================== <function expand_gbk at 0x7f15140c1b00> ====================
INFO root:portable_runner.py:577 ==================== <function sink_flattens at 0x7f15140c1c20> ====================
INFO root:portable_runner.py:577 ==================== <function greedily_fuse at 0x7f15140c1cb0> ====================
INFO root:portable_runner.py:577 ==================== <function read_to_impulse at 0x7f15140c1d40> ====================
INFO root:portable_runner.py:577 ==================== <function impulse_to_input at 0x7f15140c1dd0> ====================
INFO root:portable_runner.py:577 ==================== <function sort_stages at 0x7f15140c2050> ====================
INFO root:portable_runner.py:577 ==================== <function add_impulse_to_dangling_transforms at 0x7f15140c2170> ====================
INFO root:portable_runner.py:577 ==================== <function setup_timer_mapping at 0x7f15140c1f80> ====================
INFO root:portable_runner.py:577 ==================== <function populate_data_channel_coders at 0x7f15140c20e0> ====================
INFO root:portable_runner.py:577 starting control server on port 37017
INFO root:portable_runner.py:577 starting data server on port 33811
INFO root:portable_runner.py:577 starting state server on port 46457
INFO root:portable_runner.py:577 starting logging server on port 46257
INFO root:portable_runner.py:577 Created Worker handler <apache_beam.runners.portability.fn_api_runner.worker_handlers.DockerSdkWorkerHandler object at 0x7f150d92e9d0> for environment ref_Environment_default_environment_2 (beam:env:docker:v1, b'\n$apache/beam_python3.7_sdk:2.45.0.dev')
INFO root:portable_runner.py:577 Attempting to pull image apache/beam_python3.7_sdk:2.45.0.dev
INFO root:portable_runner.py:577 Unable to pull image apache/beam_python3.7_sdk:2.45.0.dev, defaulting to local image if it exists
INFO root:portable_runner.py:577 Waiting for docker to start up. Current status is running
INFO root:portable_runner.py:577 Docker container is running. container_id = b'907aef1543f2eebecfe43654afd358b6f973a05a726789f77d5f94ed7c3f0d54', worker_id = worker_85
INFO root:portable_runner.py:577 Created Worker handler <apache_beam.runners.portability.fn_api_runner.worker_handlers.DockerSdkWorkerHandler object at 0x7f150e6dc9d0> for environment external_8beam:env:docker:v1 (beam:env:docker:v1, b'\n apache/beam_java8_sdk:2.45.0.dev')
INFO root:portable_runner.py:577 Attempting to pull image apache/beam_java8_sdk:2.45.0.dev
INFO root:portable_runner.py:577 Unable to pull image apache/beam_java8_sdk:2.45.0.dev, defaulting to local image if it exists
INFO root:portable_runner.py:577 Waiting for docker to start up. Current status is running
INFO root:portable_runner.py:577 Docker container is running. container_id = b'f220fa7bdef41b0fdcf231a8bf803f68b9e205e526ba98561b99f5a6da5c1ef4', worker_id = worker_86
INFO root:portable_runner.py:577 Completed job in 11.952690362930298 seconds with state DONE.
INFO apache_beam.runners.portability.portable_runner:portable_runner.py:583 Job state changed to DONE
PASSED [ 88%]
apache_beam/transforms/sql_test.py::SqlTransformTest::test_zetasql_generate_data
-------------------------------- live log call ---------------------------------
INFO apache_beam.utils.subprocess_server:subprocess_server.py:239 Using pre-built snapshot at <https://ci-beam.apache.org/job/beam_PostCommit_XVR_Direct/ws/src/sdks/java/extensions/sql/expansion-service/build/libs/beam-sdks-java-extensions-sql-expansion-service-2.45.0-SNAPSHOT.jar>
INFO root:external.py:851 Starting a JAR-based expansion service from JAR <https://ci-beam.apache.org/job/beam_PostCommit_XVR_Direct/ws/src/sdks/java/extensions/sql/expansion-service/build/libs/beam-sdks-java-extensions-sql-expansion-service-2.45.0-SNAPSHOT.jar>
INFO apache_beam.utils.subprocess_server:subprocess_server.py:116 Starting service with ['java' '-jar' '<https://ci-beam.apache.org/job/beam_PostCommit_XVR_Direct/ws/src/sdks/java/extensions/sql/expansion-service/build/libs/beam-sdks-java-extensions-sql-expansion-service-2.45.0-SNAPSHOT.jar'> '44419' '--filesToStage=<https://ci-beam.apache.org/job/beam_PostCommit_XVR_Direct/ws/src/sdks/java/extensions/sql/expansion-service/build/libs/beam-sdks-java-extensions-sql-expansion-service-2.45.0-SNAPSHOT.jar']>
INFO apache_beam.utils.subprocess_server:subprocess_server.py:126 Starting expansion service at localhost:44419
INFO apache_beam.utils.subprocess_server:subprocess_server.py:126 Jan 04, 2023 5:46:41 PM org.apache.beam.sdk.expansion.service.ExpansionService loadRegisteredTransforms
INFO apache_beam.utils.subprocess_server:subprocess_server.py:126 INFO: Registering external transforms: [beam:external:java:sql:v1, beam:transform:org.apache.beam:pubsub_read:v1, beam:transform:org.apache.beam:pubsub_write:v1, beam:transform:org.apache.beam:pubsublite_write:v1, beam:transform:org.apache.beam:pubsublite_read:v1, beam:transform:org.apache.beam:spanner_insert:v1, beam:transform:org.apache.beam:spanner_update:v1, beam:transform:org.apache.beam:spanner_replace:v1, beam:transform:org.apache.beam:spanner_insert_or_update:v1, beam:transform:org.apache.beam:spanner_delete:v1, beam:transform:org.apache.beam:spanner_read:v1, beam:transform:org.apache.beam:kafka_read_with_metadata:v1, beam:transform:org.apache.beam:kafka_read_without_metadata:v1, beam:transform:org.apache.beam:kafka_write:v1, beam:external:java:generate_sequence:v1]
INFO apache_beam.utils.subprocess_server:subprocess_server.py:126
INFO apache_beam.utils.subprocess_server:subprocess_server.py:126 Registered transforms:
INFO apache_beam.utils.subprocess_server:subprocess_server.py:126 beam:external:java:sql:v1: org.apache.beam.sdk.expansion.service.ExpansionService$ExternalTransformRegistrarLoader$1@38425407
INFO apache_beam.utils.subprocess_server:subprocess_server.py:126 beam:transform:org.apache.beam:pubsub_read:v1: org.apache.beam.sdk.expansion.service.ExpansionService$ExternalTransformRegistrarLoader$1@43bc63a3
INFO apache_beam.utils.subprocess_server:subprocess_server.py:126 beam:transform:org.apache.beam:pubsub_write:v1: org.apache.beam.sdk.expansion.service.ExpansionService$ExternalTransformRegistrarLoader$1@702657cc
INFO apache_beam.utils.subprocess_server:subprocess_server.py:126 beam:transform:org.apache.beam:pubsublite_write:v1: org.apache.beam.sdk.expansion.service.ExpansionService$ExternalTransformRegistrarLoader$1@6a6cb05c
INFO apache_beam.utils.subprocess_server:subprocess_server.py:126 beam:transform:org.apache.beam:pubsublite_read:v1: org.apache.beam.sdk.expansion.service.ExpansionService$ExternalTransformRegistrarLoader$1@40a4337a
INFO apache_beam.utils.subprocess_server:subprocess_server.py:126 beam:transform:org.apache.beam:spanner_insert:v1: org.apache.beam.sdk.expansion.service.ExpansionService$ExternalTransformRegistrarLoader$1@6025e1b6
INFO apache_beam.utils.subprocess_server:subprocess_server.py:126 beam:transform:org.apache.beam:spanner_update:v1: org.apache.beam.sdk.expansion.service.ExpansionService$ExternalTransformRegistrarLoader$1@22ff4249
INFO apache_beam.utils.subprocess_server:subprocess_server.py:126 beam:transform:org.apache.beam:spanner_replace:v1: org.apache.beam.sdk.expansion.service.ExpansionService$ExternalTransformRegistrarLoader$1@2d1ef81a
INFO apache_beam.utils.subprocess_server:subprocess_server.py:126 beam:transform:org.apache.beam:spanner_insert_or_update:v1: org.apache.beam.sdk.expansion.service.ExpansionService$ExternalTransformRegistrarLoader$1@4c402120
INFO apache_beam.utils.subprocess_server:subprocess_server.py:126 beam:transform:org.apache.beam:spanner_delete:v1: org.apache.beam.sdk.expansion.service.ExpansionService$ExternalTransformRegistrarLoader$1@327514f
INFO apache_beam.utils.subprocess_server:subprocess_server.py:126 beam:transform:org.apache.beam:spanner_read:v1: org.apache.beam.sdk.expansion.service.ExpansionService$ExternalTransformRegistrarLoader$1@5b12b668
INFO apache_beam.utils.subprocess_server:subprocess_server.py:126 beam:transform:org.apache.beam:kafka_read_with_metadata:v1: org.apache.beam.sdk.expansion.service.ExpansionService$ExternalTransformRegistrarLoader$1@1165b38
INFO apache_beam.utils.subprocess_server:subprocess_server.py:126 beam:transform:org.apache.beam:kafka_read_without_metadata:v1: org.apache.beam.sdk.expansion.service.ExpansionService$ExternalTransformRegistrarLoader$1@4c12331b
INFO apache_beam.utils.subprocess_server:subprocess_server.py:126 beam:transform:org.apache.beam:kafka_write:v1: org.apache.beam.sdk.expansion.service.ExpansionService$ExternalTransformRegistrarLoader$1@7586beff
INFO apache_beam.utils.subprocess_server:subprocess_server.py:126 beam:external:java:generate_sequence:v1: org.apache.beam.sdk.expansion.service.ExpansionService$ExternalTransformRegistrarLoader$1@3b69e7d1
INFO apache_beam.utils.subprocess_server:subprocess_server.py:126
INFO apache_beam.utils.subprocess_server:subprocess_server.py:126 Registered SchemaTransformProviders:
INFO apache_beam.utils.subprocess_server:subprocess_server.py:126 beam:schematransform:org.apache.beam:kafka_read:v1
INFO apache_beam.utils.subprocess_server:subprocess_server.py:126 beam:schematransform:org.apache.beam:bigquery_storage_write:v1
INFO apache_beam.utils.subprocess_server:subprocess_server.py:126 beam:schematransform:org.apache.beam:spanner_write:v1
INFO apache_beam.utils.subprocess_server:subprocess_server.py:126 beam:transform:org.apache.beam:bigquery_storage_read:v1
INFO apache_beam.utils.subprocess_server:subprocess_server.py:126 Jan 04, 2023 5:46:43 PM org.apache.beam.sdk.expansion.service.ExpansionService expand
INFO apache_beam.utils.subprocess_server:subprocess_server.py:126 INFO: Expanding 'SqlTransform(beam:external:java:sql:v1)' with URN 'beam:external:java:sql:v1'
INFO apache_beam.utils.subprocess_server:subprocess_server.py:126 Jan 04, 2023 5:46:43 PM org.apache.beam.sdk.expansion.service.ExpansionService$ExternalTransformRegistrarLoader payloadToConfig
INFO apache_beam.utils.subprocess_server:subprocess_server.py:126 WARNING: Configuration class 'org.apache.beam.sdk.extensions.sql.expansion.ExternalSqlTransformRegistrar$Configuration' has no schema registered. Attempting to construct with setter approach.
INFO apache_beam.utils.subprocess_server:subprocess_server.py:126 Jan 04, 2023 5:46:43 PM org.apache.beam.sdk.expansion.service.ExpansionService$ExternalTransformRegistrarLoader payloadToConfig
INFO apache_beam.utils.subprocess_server:subprocess_server.py:126 WARNING: Configuration class 'org.apache.beam.sdk.extensions.sql.expansion.ExternalSqlTransformRegistrar$Configuration' has no schema registered. Attempting to construct with setter approach.
INFO apache_beam.utils.subprocess_server:subprocess_server.py:126 Jan 04, 2023 5:46:45 PM com.google.zetasql.io.grpc.NameResolverRegistry getDefaultRegistry
INFO apache_beam.utils.subprocess_server:subprocess_server.py:126 WARNING: No NameResolverProviders found via ServiceLoader, including for DNS. This is probably due to a broken build. If using ProGuard, check your configuration
INFO apache_beam.utils.subprocess_server:subprocess_server.py:126 Jan 04, 2023 5:46:47 PM org.apache.beam.sdk.extensions.sql.zetasql.ZetaSQLQueryPlanner convertToBeamRelInternal
INFO apache_beam.utils.subprocess_server:subprocess_server.py:126 INFO: BEAMPlan>
INFO apache_beam.utils.subprocess_server:subprocess_server.py:126 BeamZetaSqlCalcRel(expr#0=[{inputs}], expr#1=[1:BIGINT], expr#2=['foo':VARCHAR], expr#3=[3.1400000000000001243E0:DOUBLE], int=[$t1], str=[$t2], flt=[$t3])
INFO apache_beam.utils.subprocess_server:subprocess_server.py:126 BeamValuesRel(tuples=[[{ 0 }]])
INFO apache_beam.utils.subprocess_server:subprocess_server.py:126
INFO root:environments.py:376 Default Python SDK image for environment is apache/beam_python3.7_sdk:2.45.0.dev
INFO root:environments.py:299 No image given, using default Python SDK image
INFO root:environments.py:376 Default Python SDK image for environment is apache/beam_python3.7_sdk:2.45.0.dev
INFO root:environments.py:304 Python SDK container image set to "apache/beam_python3.7_sdk:2.45.0.dev" for Docker environment
INFO apache_beam.runners.portability.fn_api_runner.translations:translations.py:710 ==================== <function pack_combiners at 0x7ff072a03cb0> ====================
INFO apache_beam.runners.portability.fn_api_runner.translations:translations.py:710 ==================== <function lift_combiners at 0x7ff072a03d40> ====================
INFO apache_beam.runners.portability.fn_api_runner.translations:translations.py:710 ==================== <function sort_stages at 0x7ff072a044d0> ====================
INFO apache_beam.runners.portability.portable_runner:portable_runner.py:583 Job state changed to STOPPED
INFO apache_beam.runners.portability.portable_runner:portable_runner.py:583 Job state changed to STARTING
INFO apache_beam.runners.portability.portable_runner:portable_runner.py:583 Job state changed to RUNNING
INFO root:portable_runner.py:577 Default Python SDK image for environment is apache/beam_python3.7_sdk:2.45.0.dev
INFO root:portable_runner.py:577 ==================== <function annotate_downstream_side_inputs at 0x7f15140c1200> ====================
INFO root:portable_runner.py:577 ==================== <function fix_side_input_pcoll_coders at 0x7f15140c1320> ====================
INFO root:portable_runner.py:577 ==================== <function pack_combiners at 0x7f15140c1830> ====================
INFO root:portable_runner.py:577 ==================== <function lift_combiners at 0x7f15140c18c0> ====================
INFO root:portable_runner.py:577 ==================== <function expand_sdf at 0x7f15140c1a70> ====================
INFO root:portable_runner.py:577 ==================== <function expand_gbk at 0x7f15140c1b00> ====================
INFO root:portable_runner.py:577 ==================== <function sink_flattens at 0x7f15140c1c20> ====================
INFO root:portable_runner.py:577 ==================== <function greedily_fuse at 0x7f15140c1cb0> ====================
INFO root:portable_runner.py:577 ==================== <function read_to_impulse at 0x7f15140c1d40> ====================
INFO root:portable_runner.py:577 ==================== <function impulse_to_input at 0x7f15140c1dd0> ====================
INFO root:portable_runner.py:577 ==================== <function sort_stages at 0x7f15140c2050> ====================
INFO root:portable_runner.py:577 ==================== <function add_impulse_to_dangling_transforms at 0x7f15140c2170> ====================
INFO root:portable_runner.py:577 ==================== <function setup_timer_mapping at 0x7f15140c1f80> ====================
INFO root:portable_runner.py:577 ==================== <function populate_data_channel_coders at 0x7f15140c20e0> ====================
INFO root:portable_runner.py:577 starting control server on port 33687
INFO root:portable_runner.py:577 starting data server on port 45937
INFO root:portable_runner.py:577 starting state server on port 35631
INFO root:portable_runner.py:577 starting logging server on port 42767
INFO root:portable_runner.py:577 Created Worker handler <apache_beam.runners.portability.fn_api_runner.worker_handlers.DockerSdkWorkerHandler object at 0x7f150e6b3750> for environment external_9beam:env:docker:v1 (beam:env:docker:v1, b'\n apache/beam_java8_sdk:2.45.0.dev')
INFO root:portable_runner.py:577 Attempting to pull image apache/beam_java8_sdk:2.45.0.dev
INFO root:portable_runner.py:577 Unable to pull image apache/beam_java8_sdk:2.45.0.dev, defaulting to local image if it exists
INFO root:portable_runner.py:577 Waiting for docker to start up. Current status is running
INFO root:portable_runner.py:577 Docker container is running. container_id = b'9b92047c1fbe62e9ca6e639f61727d121a4cbe71a1c5f0bda0d5943d40b7a194', worker_id = worker_87
INFO root:portable_runner.py:577 Created Worker handler <apache_beam.runners.portability.fn_api_runner.worker_handlers.DockerSdkWorkerHandler object at 0x7f150d9b4850> for environment ref_Environment_default_environment_2 (beam:env:docker:v1, b'\n$apache/beam_python3.7_sdk:2.45.0.dev')
INFO root:portable_runner.py:577 Attempting to pull image apache/beam_python3.7_sdk:2.45.0.dev
INFO root:portable_runner.py:577 Unable to pull image apache/beam_python3.7_sdk:2.45.0.dev, defaulting to local image if it exists
INFO root:portable_runner.py:577 Waiting for docker to start up. Current status is running
INFO root:portable_runner.py:577 Docker container is running. container_id = b'81c2123c0908a04afb5b129114fea02017af9424dfa02767e22ef9fa2c5ba6b0', worker_id = worker_88
INFO root:portable_runner.py:577 Completed job in 16.285160303115845 seconds with state DONE.
INFO apache_beam.runners.portability.portable_runner:portable_runner.py:583 Job state changed to DONE
PASSED [100%]
=============================== warnings summary ===============================
../../build/gradleenv/1922375555/lib/python3.7/site-packages/hdfs/config.py:15
<https://ci-beam.apache.org/job/beam_PostCommit_XVR_Direct/ws/src/build/gradleenv/1922375555/lib/python3.7/site-packages/hdfs/config.py>:15: DeprecationWarning: the imp module is deprecated in favour of importlib; see the module's documentation for alternative uses
from imp import load_source
-- Docs: https://docs.pytest.org/en/stable/how-to/capture-warnings.html
- generated xml file: <https://ci-beam.apache.org/job/beam_PostCommit_XVR_Direct/ws/src/sdks/python/pytest_xlangSqlValidateRunner.xml> -
===== 9 passed, 5 skipped, 6788 deselected, 1 warning in 235.50s (0:03:55) =====
> Task :sdks:python:test-suites:direct:xlang:fnApiJobServerCleanup
Killing process at 3511921
> Task :sdks:python:test-suites:direct:xlang:validatesCrossLanguageRunnerCleanup
Stopping expansion service pid: 3516888.
Stopping expansion service pid: 3516889.
FAILURE: Build failed with an exception.
* What went wrong:
Execution failed for task ':sdks:python:test-suites:direct:xlang:validatesCrossLanguageRunnerJavaUsingPython'.
> There were failing tests. See the report at: file://<https://ci-beam.apache.org/job/beam_PostCommit_XVR_Direct/ws/src/sdks/python/test-suites/direct/xlang/build/reports/tests/validatesCrossLanguageRunnerJavaUsingPython/index.html>
* Try:
> Run with --stacktrace option to get the stack trace.
> Run with --info or --debug option to get more log output.
* Get more help at https://help.gradle.org
Deprecated Gradle features were used in this build, making it incompatible with Gradle 8.0.
You can use '--warning-mode all' to show the individual deprecation warnings and determine if they come from your own scripts or plugins.
See https://docs.gradle.org/7.5.1/userguide/command_line_interface.html#sec:command_line_warnings
Execution optimizations have been disabled for 1 invalid unit(s) of work during this build to ensure correctness.
Please consult deprecation warnings for more details.
BUILD FAILED in 36m 46s
247 actionable tasks: 162 executed, 73 from cache, 12 up-to-date
Publishing build scan...
https://gradle.com/s/pndpnghsx2xyc
Build step 'Invoke Gradle script' changed build result to FAILURE
Build step 'Invoke Gradle script' marked build as failure
---------------------------------------------------------------------
To unsubscribe, e-mail: builds-unsubscribe@beam.apache.org
For additional commands, e-mail: builds-help@beam.apache.org