You are viewing a plain text version of this content. The canonical link for it is here.
Posted to notifications@maven.apache.org by Apache Jenkins Server <je...@builds.apache.org> on 2011/08/16 17:10:33 UTC
Build failed in Jenkins: maven-plugins-ITs-m2 #313
See <https://builds.apache.org/job/maven-plugins-ITs-m2/313/changes>
Changes:
[brett] add readme
------------------------------------------
Started by an SCM change
Building remotely on ubuntu3
Updating http://svn.apache.org/repos/asf/maven/plugins/trunk
AU README
At revision 1158313
[maven-plugins-ITs-m2] $ /home/hudson/tools/maven/apache-maven-2.2.1/bin/mvn clean install -Prun-its -U -B -V -fae
Apache Maven 2.2.1 (r801777; 2009-08-06 19:16:01+0000)
Java version: 1.5.0_22
Java home: /x1/jenkins/tools/java/jdk1.5.0_22-32/jre
Default locale: en_US, platform encoding: ANSI_X3.4-1968
OS name: "linux" version: "2.6.32-32-server" arch: "i386" Family: "unix"
[INFO] Scanning for projects...
Downloading: http://repo1.maven.org/maven2/org/apache/maven/maven-parent/21/maven-parent-21.pom
[INFO] Unable to find resource 'org.apache.maven:maven-parent:pom:21' in repository central (http://repo1.maven.org/maven2)
[INFO] ------------------------------------------------------------------------
[ERROR] FATAL ERROR
[INFO] ------------------------------------------------------------------------
[INFO] Failed to resolve artifact.
GroupId: org.apache.maven
ArtifactId: maven-parent
Version: 21
Reason: Unable to download the artifact from any repository
org.apache.maven:maven-parent:pom:21
from the specified remote repositories:
central (http://repo1.maven.org/maven2),
Nexus (http://repository.apache.org/snapshots)
[INFO] ------------------------------------------------------------------------
[INFO] Trace
org.apache.maven.reactor.MavenExecutionException: Cannot find parent: org.apache.maven:maven-parent for project: org.apache.maven.plugins:maven-plugins:pom:23-SNAPSHOT for project org.apache.maven.plugins:maven-plugins:pom:23-SNAPSHOT
at org.apache.maven.DefaultMaven.getProjects(DefaultMaven.java:404)
at org.apache.maven.DefaultMaven.doExecute(DefaultMaven.java:272)
at org.apache.maven.DefaultMaven.execute(DefaultMaven.java:138)
at org.apache.maven.cli.MavenCli.main(MavenCli.java:362)
at org.apache.maven.cli.compat.CompatibleMain.main(CompatibleMain.java:60)
at sun.reflect.NativeMethodAccessorImpl.invoke0(Native Method)
at sun.reflect.NativeMethodAccessorImpl.invoke(NativeMethodAccessorImpl.java:39)
at sun.reflect.DelegatingMethodAccessorImpl.invoke(DelegatingMethodAccessorImpl.java:25)
at java.lang.reflect.Method.invoke(Method.java:592)
at org.codehaus.classworlds.Launcher.launchEnhanced(Launcher.java:315)
at org.codehaus.classworlds.Launcher.launch(Launcher.java:255)
at org.codehaus.classworlds.Launcher.mainWithExitCode(Launcher.java:430)
at org.codehaus.classworlds.Launcher.main(Launcher.java:375)
Caused by: org.apache.maven.project.ProjectBuildingException: Cannot find parent: org.apache.maven:maven-parent for project: org.apache.maven.plugins:maven-plugins:pom:23-SNAPSHOT for project org.apache.maven.plugins:maven-plugins:pom:23-SNAPSHOT
at org.apache.maven.project.DefaultMavenProjectBuilder.assembleLineage(DefaultMavenProjectBuilder.java:1396)
at org.apache.maven.project.DefaultMavenProjectBuilder.buildInternal(DefaultMavenProjectBuilder.java:823)
at org.apache.maven.project.DefaultMavenProjectBuilder.buildFromSourceFileInternal(DefaultMavenProjectBuilder.java:508)
at org.apache.maven.project.DefaultMavenProjectBuilder.build(DefaultMavenProjectBuilder.java:200)
at org.apache.maven.DefaultMaven.getProject(DefaultMaven.java:604)
at org.apache.maven.DefaultMaven.collectProjects(DefaultMaven.java:487)
at org.apache.maven.DefaultMaven.collectProjects(DefaultMaven.java:560)
at org.apache.maven.DefaultMaven.getProjects(DefaultMaven.java:391)
... 12 more
Caused by: org.apache.maven.project.ProjectBuildingException: POM 'org.apache.maven:maven-parent' not found in repository: Unable to download the artifact from any repository
org.apache.maven:maven-parent:pom:21
from the specified remote repositories:
central (http://repo1.maven.org/maven2),
Nexus (http://repository.apache.org/snapshots)
for project org.apache.maven:maven-parent
at org.apache.maven.project.DefaultMavenProjectBuilder.findModelFromRepository(DefaultMavenProjectBuilder.java:605)
at org.apache.maven.project.DefaultMavenProjectBuilder.assembleLineage(DefaultMavenProjectBuilder.java:1392)
... 19 more
Caused by: org.apache.maven.artifact.resolver.ArtifactNotFoundException: Unable to download the artifact from any repository
org.apache.maven:maven-parent:pom:21
from the specified remote repositories:
central (http://repo1.maven.org/maven2),
Nexus (http://repository.apache.org/snapshots)
at org.apache.maven.artifact.resolver.DefaultArtifactResolver.resolve(DefaultArtifactResolver.java:228)
at org.apache.maven.artifact.resolver.DefaultArtifactResolver.resolve(DefaultArtifactResolver.java:90)
at org.apache.maven.project.DefaultMavenProjectBuilder.findModelFromRepository(DefaultMavenProjectBuilder.java:558)
... 20 more
Caused by: org.apache.maven.wagon.ResourceDoesNotExistException: Unable to download the artifact from any repository
at org.apache.maven.artifact.manager.DefaultWagonManager.getArtifact(DefaultWagonManager.java:404)
at org.apache.maven.artifact.resolver.DefaultArtifactResolver.resolve(DefaultArtifactResolver.java:216)
... 22 more
[INFO] ------------------------------------------------------------------------
[INFO] Total time: < 1 second
[INFO] Finished at: Tue Aug 16 15:10:33 GMT 2011
[INFO] Final Memory: 2M/372M
[INFO] ------------------------------------------------------------------------
Jenkins build is back to normal : maven-plugins-ITs-m2 #314
Posted by Apache Jenkins Server <je...@builds.apache.org>.
See <https://builds.apache.org/job/maven-plugins-ITs-m2/314/changes>