You are viewing a plain text version of this content. The canonical link for it is here.
Posted to dev@openmeetings.apache.org by Apache Jenkins Server <je...@builds.apache.org> on 2020/04/25 21:03:29 UTC

Build failed in Jenkins: openmeetings-pr-build #23

See <https://builds.apache.org/job/openmeetings-pr-build/23/display/redirect?page=changes>

Changes:

[sebawagner] OPENMEETINGS-2298 Add KStream to admin panel. Add methods to create

[sebawagner] OPENMEETINGS-2298 Move method to combine KStream lists into Admin panel.

[sebawagner] OPENMEETINGS-2298 Fix and remove unused import


------------------------------------------
[...truncated 63.77 KB...]
[INFO] Downloaded from kurento-snapshots: https://maven.openvidu.io/repository/snapshots/org/kurento/kms-api-core/6.8.1-SNAPSHOT/maven-metadata.xml (360 B at 867 B/s)
[INFO] Downloading from apache-snapshots: https://repository.apache.org/content/groups/snapshots/org/kurento/kms-api-core/6.9.0-SNAPSHOT/maven-metadata.xml
[INFO] Downloading from Nexus: http://repository.apache.org/snapshots/org/kurento/kms-api-core/6.9.0-SNAPSHOT/maven-metadata.xml
[INFO] Downloading from sonatype-snapshots: https://oss.sonatype.org/content/repositories/snapshots/org/kurento/kms-api-core/6.9.0-SNAPSHOT/maven-metadata.xml
[INFO] Downloading from kurento-snapshots: https://maven.openvidu.io/repository/snapshots/org/kurento/kms-api-core/6.9.0-SNAPSHOT/maven-metadata.xml
[INFO] Downloaded from kurento-snapshots: https://maven.openvidu.io/repository/snapshots/org/kurento/kms-api-core/6.9.0-SNAPSHOT/maven-metadata.xml (360 B at 865 B/s)
[INFO] Downloading from Nexus: http://repository.apache.org/snapshots/org/kurento/kms-api-core/6.9.1-SNAPSHOT/maven-metadata.xml
[INFO] Downloading from apache-snapshots: https://repository.apache.org/content/groups/snapshots/org/kurento/kms-api-core/6.9.1-SNAPSHOT/maven-metadata.xml
[INFO] Downloading from sonatype-snapshots: https://oss.sonatype.org/content/repositories/snapshots/org/kurento/kms-api-core/6.9.1-SNAPSHOT/maven-metadata.xml
[INFO] Downloading from kurento-snapshots: https://maven.openvidu.io/repository/snapshots/org/kurento/kms-api-core/6.9.1-SNAPSHOT/maven-metadata.xml
[INFO] Downloaded from kurento-snapshots: https://maven.openvidu.io/repository/snapshots/org/kurento/kms-api-core/6.9.1-SNAPSHOT/maven-metadata.xml (361 B at 874 B/s)
[INFO] Downloading from Nexus: http://repository.apache.org/snapshots/org/kurento/kms-api-core/6.10.1-SNAPSHOT/maven-metadata.xml
[INFO] Downloading from apache-snapshots: https://repository.apache.org/content/groups/snapshots/org/kurento/kms-api-core/6.10.1-SNAPSHOT/maven-metadata.xml
[INFO] Downloading from sonatype-snapshots: https://oss.sonatype.org/content/repositories/snapshots/org/kurento/kms-api-core/6.10.1-SNAPSHOT/maven-metadata.xml
[INFO] Downloading from kurento-snapshots: https://maven.openvidu.io/repository/snapshots/org/kurento/kms-api-core/6.10.1-SNAPSHOT/maven-metadata.xml
[INFO] Downloaded from kurento-snapshots: https://maven.openvidu.io/repository/snapshots/org/kurento/kms-api-core/6.10.1-SNAPSHOT/maven-metadata.xml (361 B at 867 B/s)
[INFO] Downloading from Nexus: http://repository.apache.org/snapshots/org/kurento/kms-api-core/6.11.0-SNAPSHOT/maven-metadata.xml
[INFO] Downloading from apache-snapshots: https://repository.apache.org/content/groups/snapshots/org/kurento/kms-api-core/6.11.0-SNAPSHOT/maven-metadata.xml
[INFO] Downloading from sonatype-snapshots: https://oss.sonatype.org/content/repositories/snapshots/org/kurento/kms-api-core/6.11.0-SNAPSHOT/maven-metadata.xml
[INFO] Downloading from kurento-snapshots: https://maven.openvidu.io/repository/snapshots/org/kurento/kms-api-core/6.11.0-SNAPSHOT/maven-metadata.xml
[INFO] Downloaded from kurento-snapshots: https://maven.openvidu.io/repository/snapshots/org/kurento/kms-api-core/6.11.0-SNAPSHOT/maven-metadata.xml (361 B at 859 B/s)
[INFO] Downloading from apache-snapshots: https://repository.apache.org/content/groups/snapshots/org/kurento/kms-api-core/6.11.1-SNAPSHOT/maven-metadata.xml
[INFO] Downloading from sonatype-snapshots: https://oss.sonatype.org/content/repositories/snapshots/org/kurento/kms-api-core/6.11.1-SNAPSHOT/maven-metadata.xml
[INFO] Downloading from Nexus: http://repository.apache.org/snapshots/org/kurento/kms-api-core/6.11.1-SNAPSHOT/maven-metadata.xml
[INFO] Downloading from kurento-snapshots: https://maven.openvidu.io/repository/snapshots/org/kurento/kms-api-core/6.11.1-SNAPSHOT/maven-metadata.xml
[INFO] Downloaded from kurento-snapshots: https://maven.openvidu.io/repository/snapshots/org/kurento/kms-api-core/6.11.1-SNAPSHOT/maven-metadata.xml (362 B at 880 B/s)
[INFO] Downloading from apache-snapshots: https://repository.apache.org/content/groups/snapshots/org/kurento/kms-api-core/6.12.1-SNAPSHOT/maven-metadata.xml
[INFO] Downloading from Nexus: http://repository.apache.org/snapshots/org/kurento/kms-api-core/6.12.1-SNAPSHOT/maven-metadata.xml
[INFO] Downloading from sonatype-snapshots: https://oss.sonatype.org/content/repositories/snapshots/org/kurento/kms-api-core/6.12.1-SNAPSHOT/maven-metadata.xml
[INFO] Downloading from kurento-snapshots: https://maven.openvidu.io/repository/snapshots/org/kurento/kms-api-core/6.12.1-SNAPSHOT/maven-metadata.xml
[INFO] Downloaded from kurento-snapshots: https://maven.openvidu.io/repository/snapshots/org/kurento/kms-api-core/6.12.1-SNAPSHOT/maven-metadata.xml (361 B at 878 B/s)
[INFO] Downloading from kurento-snapshots: https://maven.openvidu.io/repository/snapshots/org/kurento/kms-api-core/6.13.1-SNAPSHOT/maven-metadata.xml
[INFO] Downloading from apache-snapshots: https://repository.apache.org/content/groups/snapshots/org/kurento/kms-api-core/6.13.1-SNAPSHOT/maven-metadata.xml
[INFO] Downloading from sonatype-snapshots: https://oss.sonatype.org/content/repositories/snapshots/org/kurento/kms-api-core/6.13.1-SNAPSHOT/maven-metadata.xml
[INFO] Downloading from Nexus: http://repository.apache.org/snapshots/org/kurento/kms-api-core/6.13.1-SNAPSHOT/maven-metadata.xml
[INFO] Downloaded from kurento-snapshots: https://maven.openvidu.io/repository/snapshots/org/kurento/kms-api-core/6.13.1-SNAPSHOT/maven-metadata.xml (361 B at 871 B/s)
[INFO] Downloading from central: https://repo.maven.apache.org/maven2/org/kurento/kms-api-elements/maven-metadata.xml
[INFO] Downloading from sonatype-snapshots: https://oss.sonatype.org/content/repositories/snapshots/org/kurento/kms-api-elements/maven-metadata.xml
[INFO] Downloading from apache-snapshots: https://repository.apache.org/content/groups/snapshots/org/kurento/kms-api-elements/maven-metadata.xml
[INFO] Downloading from Nexus: http://repository.apache.org/snapshots/org/kurento/kms-api-elements/maven-metadata.xml
[INFO] Downloaded from central: https://repo.maven.apache.org/maven2/org/kurento/kms-api-elements/maven-metadata.xml (867 B at 51 kB/s)
[INFO] Downloading from kurento-snapshots: https://maven.openvidu.io/repository/snapshots/org/kurento/kms-api-elements/maven-metadata.xml
[INFO] Downloaded from kurento-snapshots: https://maven.openvidu.io/repository/snapshots/org/kurento/kms-api-elements/maven-metadata.xml (771 B at 1.9 kB/s)
[INFO] Downloading from sonatype-snapshots: https://oss.sonatype.org/content/repositories/snapshots/org/kurento/kms-api-elements/6.7.1-SNAPSHOT/maven-metadata.xml
[INFO] Downloading from apache-snapshots: https://repository.apache.org/content/groups/snapshots/org/kurento/kms-api-elements/6.7.1-SNAPSHOT/maven-metadata.xml
[INFO] Downloading from kurento-snapshots: https://maven.openvidu.io/repository/snapshots/org/kurento/kms-api-elements/6.7.1-SNAPSHOT/maven-metadata.xml
[INFO] Downloading from Nexus: http://repository.apache.org/snapshots/org/kurento/kms-api-elements/6.7.1-SNAPSHOT/maven-metadata.xml
[INFO] Downloaded from kurento-snapshots: https://maven.openvidu.io/repository/snapshots/org/kurento/kms-api-elements/6.7.1-SNAPSHOT/maven-metadata.xml (364 B at 879 B/s)
[INFO] Downloading from apache-snapshots: https://repository.apache.org/content/groups/snapshots/org/kurento/kms-api-elements/6.7.2-SNAPSHOT/maven-metadata.xml
[INFO] Downloading from sonatype-snapshots: https://oss.sonatype.org/content/repositories/snapshots/org/kurento/kms-api-elements/6.7.2-SNAPSHOT/maven-metadata.xml
[INFO] Downloading from Nexus: http://repository.apache.org/snapshots/org/kurento/kms-api-elements/6.7.2-SNAPSHOT/maven-metadata.xml
[INFO] Downloading from kurento-snapshots: https://maven.openvidu.io/repository/snapshots/org/kurento/kms-api-elements/6.7.2-SNAPSHOT/maven-metadata.xml
[INFO] Downloaded from kurento-snapshots: https://maven.openvidu.io/repository/snapshots/org/kurento/kms-api-elements/6.7.2-SNAPSHOT/maven-metadata.xml (364 B at 877 B/s)
[INFO] Downloading from apache-snapshots: https://repository.apache.org/content/groups/snapshots/org/kurento/kms-api-elements/6.7.3-SNAPSHOT/maven-metadata.xml
[INFO] Downloading from kurento-snapshots: https://maven.openvidu.io/repository/snapshots/org/kurento/kms-api-elements/6.7.3-SNAPSHOT/maven-metadata.xml
[INFO] Downloading from sonatype-snapshots: https://oss.sonatype.org/content/repositories/snapshots/org/kurento/kms-api-elements/6.7.3-SNAPSHOT/maven-metadata.xml
[INFO] Downloading from Nexus: http://repository.apache.org/snapshots/org/kurento/kms-api-elements/6.7.3-SNAPSHOT/maven-metadata.xml
[INFO] Downloaded from kurento-snapshots: https://maven.openvidu.io/repository/snapshots/org/kurento/kms-api-elements/6.7.3-SNAPSHOT/maven-metadata.xml (365 B at 883 B/s)
[INFO] Downloading from Nexus: http://repository.apache.org/snapshots/org/kurento/kms-api-elements/6.8.1-SNAPSHOT/maven-metadata.xml
[INFO] Downloading from apache-snapshots: https://repository.apache.org/content/groups/snapshots/org/kurento/kms-api-elements/6.8.1-SNAPSHOT/maven-metadata.xml
[INFO] Downloading from sonatype-snapshots: https://oss.sonatype.org/content/repositories/snapshots/org/kurento/kms-api-elements/6.8.1-SNAPSHOT/maven-metadata.xml
[INFO] Downloading from kurento-snapshots: https://maven.openvidu.io/repository/snapshots/org/kurento/kms-api-elements/6.8.1-SNAPSHOT/maven-metadata.xml
[INFO] Downloaded from kurento-snapshots: https://maven.openvidu.io/repository/snapshots/org/kurento/kms-api-elements/6.8.1-SNAPSHOT/maven-metadata.xml (364 B at 877 B/s)
[INFO] Downloading from sonatype-snapshots: https://oss.sonatype.org/content/repositories/snapshots/org/kurento/kms-api-elements/6.9.0-SNAPSHOT/maven-metadata.xml
[INFO] Downloading from Nexus: http://repository.apache.org/snapshots/org/kurento/kms-api-elements/6.9.0-SNAPSHOT/maven-metadata.xml
[INFO] Downloading from apache-snapshots: https://repository.apache.org/content/groups/snapshots/org/kurento/kms-api-elements/6.9.0-SNAPSHOT/maven-metadata.xml
[INFO] Downloading from kurento-snapshots: https://maven.openvidu.io/repository/snapshots/org/kurento/kms-api-elements/6.9.0-SNAPSHOT/maven-metadata.xml
[INFO] Downloaded from kurento-snapshots: https://maven.openvidu.io/repository/snapshots/org/kurento/kms-api-elements/6.9.0-SNAPSHOT/maven-metadata.xml (364 B at 885 B/s)
[INFO] Downloading from Nexus: http://repository.apache.org/snapshots/org/kurento/kms-api-elements/6.9.1-SNAPSHOT/maven-metadata.xml
[INFO] Downloading from apache-snapshots: https://repository.apache.org/content/groups/snapshots/org/kurento/kms-api-elements/6.9.1-SNAPSHOT/maven-metadata.xml
[INFO] Downloading from kurento-snapshots: https://maven.openvidu.io/repository/snapshots/org/kurento/kms-api-elements/6.9.1-SNAPSHOT/maven-metadata.xml
[INFO] Downloading from sonatype-snapshots: https://oss.sonatype.org/content/repositories/snapshots/org/kurento/kms-api-elements/6.9.1-SNAPSHOT/maven-metadata.xml
[INFO] Downloaded from kurento-snapshots: https://maven.openvidu.io/repository/snapshots/org/kurento/kms-api-elements/6.9.1-SNAPSHOT/maven-metadata.xml (365 B at 885 B/s)
[INFO] Downloading from Nexus: http://repository.apache.org/snapshots/org/kurento/kms-api-elements/6.10.1-SNAPSHOT/maven-metadata.xml
[INFO] Downloading from apache-snapshots: https://repository.apache.org/content/groups/snapshots/org/kurento/kms-api-elements/6.10.1-SNAPSHOT/maven-metadata.xml
[INFO] Downloading from sonatype-snapshots: https://oss.sonatype.org/content/repositories/snapshots/org/kurento/kms-api-elements/6.10.1-SNAPSHOT/maven-metadata.xml
[INFO] Downloading from kurento-snapshots: https://maven.openvidu.io/repository/snapshots/org/kurento/kms-api-elements/6.10.1-SNAPSHOT/maven-metadata.xml
[INFO] Downloaded from kurento-snapshots: https://maven.openvidu.io/repository/snapshots/org/kurento/kms-api-elements/6.10.1-SNAPSHOT/maven-metadata.xml (365 B at 881 B/s)
[INFO] Downloading from Nexus: http://repository.apache.org/snapshots/org/kurento/kms-api-elements/6.11.0-SNAPSHOT/maven-metadata.xml
[INFO] Downloading from apache-snapshots: https://repository.apache.org/content/groups/snapshots/org/kurento/kms-api-elements/6.11.0-SNAPSHOT/maven-metadata.xml
[INFO] Downloading from sonatype-snapshots: https://oss.sonatype.org/content/repositories/snapshots/org/kurento/kms-api-elements/6.11.0-SNAPSHOT/maven-metadata.xml
[INFO] Downloading from kurento-snapshots: https://maven.openvidu.io/repository/snapshots/org/kurento/kms-api-elements/6.11.0-SNAPSHOT/maven-metadata.xml
[INFO] Downloaded from kurento-snapshots: https://maven.openvidu.io/repository/snapshots/org/kurento/kms-api-elements/6.11.0-SNAPSHOT/maven-metadata.xml (365 B at 881 B/s)
[INFO] Downloading from apache-snapshots: https://repository.apache.org/content/groups/snapshots/org/kurento/kms-api-elements/6.11.1-SNAPSHOT/maven-metadata.xml
[INFO] Downloading from sonatype-snapshots: https://oss.sonatype.org/content/repositories/snapshots/org/kurento/kms-api-elements/6.11.1-SNAPSHOT/maven-metadata.xml
[INFO] Downloading from Nexus: http://repository.apache.org/snapshots/org/kurento/kms-api-elements/6.11.1-SNAPSHOT/maven-metadata.xml
[INFO] Downloading from kurento-snapshots: https://maven.openvidu.io/repository/snapshots/org/kurento/kms-api-elements/6.11.1-SNAPSHOT/maven-metadata.xml
[INFO] Downloaded from kurento-snapshots: https://maven.openvidu.io/repository/snapshots/org/kurento/kms-api-elements/6.11.1-SNAPSHOT/maven-metadata.xml (366 B at 881 B/s)
[INFO] Downloading from apache-snapshots: https://repository.apache.org/content/groups/snapshots/org/kurento/kms-api-elements/6.12.1-SNAPSHOT/maven-metadata.xml
[INFO] Downloading from sonatype-snapshots: https://oss.sonatype.org/content/repositories/snapshots/org/kurento/kms-api-elements/6.12.1-SNAPSHOT/maven-metadata.xml
[INFO] Downloading from kurento-snapshots: https://maven.openvidu.io/repository/snapshots/org/kurento/kms-api-elements/6.12.1-SNAPSHOT/maven-metadata.xml
[INFO] Downloading from Nexus: http://repository.apache.org/snapshots/org/kurento/kms-api-elements/6.12.1-SNAPSHOT/maven-metadata.xml
[INFO] Downloaded from kurento-snapshots: https://maven.openvidu.io/repository/snapshots/org/kurento/kms-api-elements/6.12.1-SNAPSHOT/maven-metadata.xml (365 B at 879 B/s)
[INFO] Downloading from Nexus: http://repository.apache.org/snapshots/org/kurento/kms-api-elements/6.13.1-SNAPSHOT/maven-metadata.xml
[INFO] Downloading from apache-snapshots: https://repository.apache.org/content/groups/snapshots/org/kurento/kms-api-elements/6.13.1-SNAPSHOT/maven-metadata.xml
[INFO] Downloading from sonatype-snapshots: https://oss.sonatype.org/content/repositories/snapshots/org/kurento/kms-api-elements/6.13.1-SNAPSHOT/maven-metadata.xml
[INFO] Downloading from kurento-snapshots: https://maven.openvidu.io/repository/snapshots/org/kurento/kms-api-elements/6.13.1-SNAPSHOT/maven-metadata.xml
[INFO] Downloaded from kurento-snapshots: https://maven.openvidu.io/repository/snapshots/org/kurento/kms-api-elements/6.13.1-SNAPSHOT/maven-metadata.xml (365 B at 881 B/s)
[INFO] 
[INFO] --- maven-clean-plugin:3.1.0:clean (default-clean) @ openmeetings-core ---
[INFO] 
[INFO] --- buildnumber-maven-plugin:1.4:create (default) @ openmeetings-core ---
[INFO] 
[INFO] --- apache-rat-plugin:0.13:check (default) @ openmeetings-core ---
[INFO] Added 2 additional default licenses.
[INFO] Enabled default license matchers.
[INFO] Added 2 custom approved licenses.
[INFO] Will parse SCM ignores for exclusions...
[INFO] Finished adding exclusions from SCM ignore files.
[INFO] 62 implicit excludes (use -debug for more details).
[INFO] 2 explicit excludes (use -debug for more details).
[INFO] 49 resources included (use -debug for more details)
[INFO] Rat check: Summary over all files. Unapproved: 0, unknown: 0, generated: 0, approved: 49 licenses.
[INFO] 
[INFO] --- maven-enforcer-plugin:3.0.0-M3:enforce (enforce-versions) @ openmeetings-core ---
[INFO] 
[INFO] --- maven-enforcer-plugin:3.0.0-M3:enforce (enforce-maven-version) @ openmeetings-core ---
[INFO] 
[INFO] --- jacoco-maven-plugin:0.8.5:prepare-agent (prepare-agent) @ openmeetings-core ---
[INFO] argLine set to -javaagent:/home/jenkins/jenkins-slave/maven-repositories/1/org/jacoco/org.jacoco.agent/0.8.5/org.jacoco.agent-0.8.5-runtime.jar=destfile=<https://builds.apache.org/job/openmeetings-pr-build/ws/openmeetings-core/../target/jacoco.exec,append=true>
[INFO] 
[INFO] --- maven-remote-resources-plugin:1.6.0:process (process-resource-bundles) @ openmeetings-core ---
[INFO] Preparing remote bundle org.apache:apache-jar-resource-bundle:1.4
[INFO] Copying 3 resources from 1 bundle.
[INFO] 
[INFO] --- maven-site-plugin:3.9.0:site (generate-site) @ openmeetings-core ---
[INFO] configuring report plugin org.apache.maven.plugins:maven-project-info-reports-plugin:3.0.0
[INFO] 14 reports configured for maven-project-info-reports-plugin:3.0.0: index, ci-management, dependencies, dependency-convergence, dependency-management, distribution-management, issue-management, licenses, mailing-lists, plugin-management, plugins, team, scm, summary
[INFO] configuring report plugin org.apache.maven.plugins:maven-surefire-report-plugin:3.0.0-M4
[INFO] 1 report configured for maven-surefire-report-plugin:3.0.0-M4: report-only
[INFO] configuring report plugin org.apache.rat:apache-rat-plugin:0.13
[INFO] 1 report configured for apache-rat-plugin:0.13: rat
[INFO] Rendering site with default locale English (en)
[INFO] Relativizing decoration links with respect to localized project URL: https://openmeetings.apache.org/openmeetings-core
[INFO] Rendering content with io.github.devacfr.maven.skins:reflow-maven-skin:jar:2.3.0 skin.
[INFO] Generating "About" report                --- maven-project-info-reports-plugin:3.0.0:index
[INFO] Generating "CI Management" report        --- maven-project-info-reports-plugin:3.0.0:ci-management
[INFO] Generating "Dependencies" report         --- maven-project-info-reports-plugin:3.0.0:dependencies
[INFO] Generating "Dependency Convergence" report --- maven-project-info-reports-plugin:3.0.0:dependency-convergence
[INFO] Generating "Dependency Management" report --- maven-project-info-reports-plugin:3.0.0:dependency-management
[INFO] Generating "Distribution Management" report --- maven-project-info-reports-plugin:3.0.0:distribution-management
[INFO] Generating "Issue Management" report     --- maven-project-info-reports-plugin:3.0.0:issue-management
[INFO] Generating "Licenses" report             --- maven-project-info-reports-plugin:3.0.0:licenses
[INFO] Generating "Mailing Lists" report        --- maven-project-info-reports-plugin:3.0.0:mailing-lists
[INFO] Generating "Plugin Management" report    --- maven-project-info-reports-plugin:3.0.0:plugin-management
[INFO] Generating "Plugins" report              --- maven-project-info-reports-plugin:3.0.0:plugins
[INFO] Generating "Team" report                 --- maven-project-info-reports-plugin:3.0.0:team
[INFO] Generating "Source Code Management" report --- maven-project-info-reports-plugin:3.0.0:scm
[INFO] Generating "Summary" report              --- maven-project-info-reports-plugin:3.0.0:summary
[INFO] Generating "Surefire Report" report      --- maven-surefire-report-plugin:3.0.0-M4:report-only
[WARNING] Unable to locate Test Source XRef to link to - DISABLED
[INFO] Generating "Rat Report" report           --- apache-rat-plugin:0.13:rat
[INFO] Added 2 additional default licenses.
[INFO] Enabled default license matchers.
[INFO] Added 2 custom approved licenses.
[INFO] Will parse SCM ignores for exclusions...
[INFO] Finished adding exclusions from SCM ignore files.
[INFO] 62 implicit excludes (use -debug for more details).
[INFO] 2 explicit excludes (use -debug for more details).
[INFO] 49 resources included (use -debug for more details)
[JENKINS] Archiving site from <https://builds.apache.org/job/openmeetings-pr-build/ws/openmeetings-core/target/site> to /x1/jenkins/jenkins-home/jobs/openmeetings-pr-build/site/openmeetings-core
[INFO] 
[INFO] --- maven-resources-plugin:3.1.0:resources (default-resources) @ openmeetings-core ---
[INFO] Using 'UTF-8' encoding to copy filtered resources.
[INFO] skip non existing resourceDirectory <https://builds.apache.org/job/openmeetings-pr-build/ws/openmeetings-core/src/main/resources>
[INFO] Copying 3 resources
[INFO] 
[INFO] --- maven-compiler-plugin:3.8.1:compile (default-compile) @ openmeetings-core ---
[INFO] Changes detected - recompiling the module!
[INFO] Compiling 35 source files to <https://builds.apache.org/job/openmeetings-pr-build/ws/openmeetings-core/target/classes>
[INFO] 
[INFO] --- maven-resources-plugin:3.1.0:testResources (default-testResources) @ openmeetings-core ---
[INFO] Using 'UTF-8' encoding to copy filtered resources.
[INFO] skip non existing resourceDirectory <https://builds.apache.org/job/openmeetings-pr-build/ws/openmeetings-core/src/test/resources>
[INFO] Copying 3 resources
[INFO] 
[INFO] --- maven-compiler-plugin:3.8.1:testCompile (default-testCompile) @ openmeetings-core ---
[INFO] Changes detected - recompiling the module!
[INFO] Compiling 12 source files to <https://builds.apache.org/job/openmeetings-pr-build/ws/openmeetings-core/target/test-classes>
[INFO] -------------------------------------------------------------
[ERROR] COMPILATION ERROR : 
[INFO] -------------------------------------------------------------
[ERROR] <https://builds.apache.org/job/openmeetings-pr-build/ws/openmeetings-core/src/test/java/org/apache/openmeetings/core/remote/KurentoHandlerTest.java>:[78,70] cannot find symbol
  symbol:   method getAllStreams()
  location: variable kurentoHandler of type org.apache.openmeetings.core.remote.KurentoHandler
[INFO] 1 error
[INFO] -------------------------------------------------------------
[INFO] ------------------------------------------------------------------------
[INFO] Reactor Summary for Openmeetings 5.0.0-M5-SNAPSHOT:
[INFO] 
[INFO] Openmeetings ....................................... SUCCESS [01:27 min]
[INFO] Openmeetings Util .................................. SUCCESS [04:27 min]
[INFO] Openmeetings DB .................................... SUCCESS [ 43.836 s]
[INFO] Openmeetings Core .................................. FAILURE [ 50.527 s]
[INFO] Openmeetings Install ............................... SKIPPED
[INFO] Openmeetings Service ............................... SKIPPED
[INFO] Openmeetings Webservices ........................... SKIPPED
[INFO] Openmeetings Web ................................... SKIPPED
[INFO] Openmeetings Screen Sharing applet ................. SKIPPED
[INFO] Openmeetings Server ................................ SKIPPED
[INFO] ------------------------------------------------------------------------
[INFO] BUILD FAILURE
[INFO] ------------------------------------------------------------------------
[INFO] Total time:  07:55 min
[INFO] Finished at: 2020-04-25T21:02:58Z
[INFO] ------------------------------------------------------------------------
Waiting for Jenkins to finish collecting data
[ERROR] Failed to execute goal org.apache.maven.plugins:maven-compiler-plugin:3.8.1:testCompile (default-testCompile) on project openmeetings-core: Compilation failure
[ERROR] <https://builds.apache.org/job/openmeetings-pr-build/ws/openmeetings-core/src/test/java/org/apache/openmeetings/core/remote/KurentoHandlerTest.java>:[78,70] cannot find symbol
[ERROR] symbol:   method getAllStreams()
[ERROR] location: variable kurentoHandler of type org.apache.openmeetings.core.remote.KurentoHandler
[ERROR] -> [Help 1]
[ERROR] 
[ERROR] To see the full stack trace of the errors, re-run Maven with the -e switch.
[ERROR] Re-run Maven using the -X switch to enable full debug logging.
[ERROR] 
[ERROR] For more information about the errors and possible solutions, please read the following articles:
[ERROR] [Help 1] http://cwiki.apache.org/confluence/display/MAVEN/MojoFailureException
[ERROR] 
[ERROR] After correcting the problems, you can resume the build with the command
[ERROR]   mvn <goals> -rf :openmeetings-core
[JENKINS] Archiving <https://builds.apache.org/job/openmeetings-pr-build/ws/openmeetings-server/pom.xml> to org.apache.openmeetings/openmeetings-server/5.0.0-M5-SNAPSHOT/openmeetings-server-5.0.0-M5-SNAPSHOT.pom
[JENKINS] Archiving <https://builds.apache.org/job/openmeetings-pr-build/ws/openmeetings-screenshare/pom.xml> to org.apache.openmeetings/openmeetings-screenshare/5.0.0-M5-SNAPSHOT/openmeetings-screenshare-5.0.0-M5-SNAPSHOT.pom
[JENKINS] Archiving <https://builds.apache.org/job/openmeetings-pr-build/ws/openmeetings-util/pom.xml> to org.apache.openmeetings/openmeetings-util/5.0.0-M5-SNAPSHOT/openmeetings-util-5.0.0-M5-SNAPSHOT.pom
[JENKINS] Archiving <https://builds.apache.org/job/openmeetings-pr-build/ws/openmeetings-util/target/openmeetings-util-5.0.0-M5-SNAPSHOT.jar> to org.apache.openmeetings/openmeetings-util/5.0.0-M5-SNAPSHOT/openmeetings-util-5.0.0-M5-SNAPSHOT.jar
[JENKINS] Archiving <https://builds.apache.org/job/openmeetings-pr-build/ws/openmeetings-util/target/openmeetings-util-5.0.0-M5-SNAPSHOT-tests.jar> to org.apache.openmeetings/openmeetings-util/5.0.0-M5-SNAPSHOT/openmeetings-util-5.0.0-M5-SNAPSHOT-tests.jar
[JENKINS] Archiving <https://builds.apache.org/job/openmeetings-pr-build/ws/openmeetings-install/pom.xml> to org.apache.openmeetings/openmeetings-install/5.0.0-M5-SNAPSHOT/openmeetings-install-5.0.0-M5-SNAPSHOT.pom
[JENKINS] Archiving <https://builds.apache.org/job/openmeetings-pr-build/ws/openmeetings-service/pom.xml> to org.apache.openmeetings/openmeetings-service/5.0.0-M5-SNAPSHOT/openmeetings-service-5.0.0-M5-SNAPSHOT.pom
[JENKINS] Archiving <https://builds.apache.org/job/openmeetings-pr-build/ws/pom.xml> to org.apache.openmeetings/openmeetings-parent/5.0.0-M5-SNAPSHOT/openmeetings-parent-5.0.0-M5-SNAPSHOT.pom
[JENKINS] Archiving <https://builds.apache.org/job/openmeetings-pr-build/ws/target/openmeetings-parent-5.0.0-M5-SNAPSHOT-site.xml> to org.apache.openmeetings/openmeetings-parent/5.0.0-M5-SNAPSHOT/openmeetings-parent-5.0.0-M5-SNAPSHOT-site.xml
[JENKINS] Archiving <https://builds.apache.org/job/openmeetings-pr-build/ws/openmeetings-db/pom.xml> to org.apache.openmeetings/openmeetings-db/5.0.0-M5-SNAPSHOT/openmeetings-db-5.0.0-M5-SNAPSHOT.pom
[JENKINS] Archiving <https://builds.apache.org/job/openmeetings-pr-build/ws/openmeetings-db/target/openmeetings-db-5.0.0-M5-SNAPSHOT.jar> to org.apache.openmeetings/openmeetings-db/5.0.0-M5-SNAPSHOT/openmeetings-db-5.0.0-M5-SNAPSHOT.jar
[Fast Archiver] Compressed 436.94 KB of artifacts by 73.2% relative to #22
[JENKINS] Archiving <https://builds.apache.org/job/openmeetings-pr-build/ws/openmeetings-web/pom.xml> to org.apache.openmeetings/openmeetings-web/5.0.0-M5-SNAPSHOT/openmeetings-web-5.0.0-M5-SNAPSHOT.pom
[JENKINS] Archiving <https://builds.apache.org/job/openmeetings-pr-build/ws/openmeetings-webservice/pom.xml> to org.apache.openmeetings/openmeetings-webservice/5.0.0-M5-SNAPSHOT/openmeetings-webservice-5.0.0-M5-SNAPSHOT.pom
[JENKINS] Archiving <https://builds.apache.org/job/openmeetings-pr-build/ws/openmeetings-core/pom.xml> to org.apache.openmeetings/openmeetings-core/5.0.0-M5-SNAPSHOT/openmeetings-core-5.0.0-M5-SNAPSHOT.pom
No mail will be sent out, as 'openmeetings-pr-build » Openmeetings Server #23' does not have a result yet. Please make sure you set a proper result in case of pipeline/build scripts.
No mail will be sent out, as 'openmeetings-pr-build » Openmeetings Screen Sharing applet #23' does not have a result yet. Please make sure you set a proper result in case of pipeline/build scripts.
No mail will be sent out, as 'openmeetings-pr-build » Openmeetings Util #23' does not have a result yet. Please make sure you set a proper result in case of pipeline/build scripts.
No mail will be sent out, as 'openmeetings-pr-build » Openmeetings Install #23' does not have a result yet. Please make sure you set a proper result in case of pipeline/build scripts.
No mail will be sent out, as 'openmeetings-pr-build » Openmeetings Service #23' does not have a result yet. Please make sure you set a proper result in case of pipeline/build scripts.
No mail will be sent out, as 'openmeetings-pr-build » Openmeetings #23' does not have a result yet. Please make sure you set a proper result in case of pipeline/build scripts.
No mail will be sent out, as 'openmeetings-pr-build » Openmeetings DB #23' does not have a result yet. Please make sure you set a proper result in case of pipeline/build scripts.
No mail will be sent out, as 'openmeetings-pr-build » Openmeetings Web #23' does not have a result yet. Please make sure you set a proper result in case of pipeline/build scripts.
No mail will be sent out, as 'openmeetings-pr-build » Openmeetings Webservices #23' does not have a result yet. Please make sure you set a proper result in case of pipeline/build scripts.
Sending e-mails to: dev@openmeetings.apache.org sebawagner@apache.org
channel stopped
Archiving artifacts
Putting comment on the pull request

Jenkins build is back to normal : openmeetings-pr-build #24

Posted by Apache Jenkins Server <je...@builds.apache.org>.
See <https://builds.apache.org/job/openmeetings-pr-build/24/display/redirect?page=changes>