You are viewing a plain text version of this content. The canonical link for it is here.
Posted to issues@tez.apache.org by Apache Jenkins Server <je...@builds.apache.org> on 2015/03/10 22:06:51 UTC
Failed: TEZ-2179 PreCommit Build #268
Jira: https://issues.apache.org/jira/browse/TEZ-2179
Build: https://builds.apache.org/job/PreCommit-TEZ-Build/268/
###################################################################################
########################## LAST 60 LINES OF THE CONSOLE ###########################
[...truncated 2418 lines...]
{color:red}-1 overall{color}. Here are the results of testing the latest attachment
http://issues.apache.org/jira/secure/attachment/12703721/TEZ-2179.1.patch
against master revision 4a19a43.
{color:green}+1 @author{color}. The patch does not contain any @author tags.
{color:red}-1 tests included{color}. The patch doesn't appear to include any new or modified tests.
Please justify why no new tests are needed for this patch.
Also please list what manual steps were performed to verify this patch.
{color:green}+1 javac{color}. The applied patch does not increase the total number of javac compiler warnings.
{color:green}+1 javadoc{color}. There were no new javadoc warning messages.
{color:green}+1 findbugs{color}. The patch does not introduce any new Findbugs (version 2.0.3) warnings.
{color:green}+1 release audit{color}. The applied patch does not increase the total number of release audit warnings.
{color:red}-1 core tests{color}. The following test timeouts occurred in :
org.apache.tez.test.TestDAGRecovery2
Test results: https://builds.apache.org/job/PreCommit-TEZ-Build/268//testReport/
Console output: https://builds.apache.org/job/PreCommit-TEZ-Build/268//console
This message is automatically generated.
======================================================================
======================================================================
Adding comment to Jira.
======================================================================
======================================================================
Comment added.
e13c7ca76012d7d6f7a7ef563b145930ec8a04d3 logged out
======================================================================
======================================================================
Finished build.
======================================================================
======================================================================
Build step 'Execute shell' marked build as failure
Archiving artifacts
Sending artifact delta relative to PreCommit-TEZ-Build #267
Archived 41 artifacts
Archive block size is 32768
Received 6 blocks and 2485218 bytes
Compression is 7.3%
Took 0.86 sec
[description-setter] Could not determine description.
Recording test results
Email was triggered for: Failure
Sending email for trigger: Failure
###################################################################################
############################## FAILED TESTS (if any) ##############################
All tests passed
Success: TEZ-2190 PreCommit Build #270
Posted by Apache Jenkins Server <je...@builds.apache.org>.
Jira: https://issues.apache.org/jira/browse/TEZ-2190
Build: https://builds.apache.org/job/PreCommit-TEZ-Build/270/
###################################################################################
########################## LAST 60 LINES OF THE CONSOLE ###########################
[...truncated 2616 lines...]
[INFO] Final Memory: 69M/1018M
[INFO] ------------------------------------------------------------------------
{color:green}+1 overall{color}. Here are the results of testing the latest attachment
http://issues.apache.org/jira/secure/attachment/12703741/TEZ-2190.1.patch
against master revision 4a19a43.
{color:green}+1 @author{color}. The patch does not contain any @author tags.
{color:green}+1 tests included{color}. The patch appears to include 2 new or modified test files.
{color:green}+1 javac{color}. The applied patch does not increase the total number of javac compiler warnings.
{color:green}+1 javadoc{color}. There were no new javadoc warning messages.
{color:green}+1 findbugs{color}. The patch does not introduce any new Findbugs (version 2.0.3) warnings.
{color:green}+1 release audit{color}. The applied patch does not increase the total number of release audit warnings.
{color:green}+1 core tests{color}. The patch passed unit tests in .
Test results: https://builds.apache.org/job/PreCommit-TEZ-Build/270//testReport/
Console output: https://builds.apache.org/job/PreCommit-TEZ-Build/270//console
This message is automatically generated.
======================================================================
======================================================================
Adding comment to Jira.
======================================================================
======================================================================
Comment added.
c3e8c80e0d0278ccf810b3d80711d27dfca8b053 logged out
======================================================================
======================================================================
Finished build.
======================================================================
======================================================================
Archiving artifacts
Sending artifact delta relative to PreCommit-TEZ-Build #267
Archived 41 artifacts
Archive block size is 32768
Received 24 blocks and 1872134 bytes
Compression is 29.6%
Took 0.68 sec
Description set: TEZ-2190
Recording test results
Email was triggered for: Success
Sending email for trigger: Success
###################################################################################
############################## FAILED TESTS (if any) ##############################
All tests passed
Failed: TEZ-1827 PreCommit Build #269
Posted by Apache Jenkins Server <je...@builds.apache.org>.
Jira: https://issues.apache.org/jira/browse/TEZ-1827
Build: https://builds.apache.org/job/PreCommit-TEZ-Build/269/
###################################################################################
########################## LAST 60 LINES OF THE CONSOLE ###########################
[...truncated 2419 lines...]
{color:red}-1 overall{color}. Here are the results of testing the latest attachment
http://issues.apache.org/jira/secure/attachment/12703743/TEZ-1827.2.patch
against master revision 4a19a43.
{color:green}+1 @author{color}. The patch does not contain any @author tags.
{color:green}+1 tests included{color}. The patch appears to include 2 new or modified test files.
{color:green}+1 javac{color}. The applied patch does not increase the total number of javac compiler warnings.
{color:green}+1 javadoc{color}. There were no new javadoc warning messages.
{color:green}+1 findbugs{color}. The patch does not introduce any new Findbugs (version 2.0.3) warnings.
{color:green}+1 release audit{color}. The applied patch does not increase the total number of release audit warnings.
{color:red}-1 core tests{color}. The following test timeouts occurred in :
org.apache.tez.test.TestAMRecovery
Test results: https://builds.apache.org/job/PreCommit-TEZ-Build/269//testReport/
Console output: https://builds.apache.org/job/PreCommit-TEZ-Build/269//console
This message is automatically generated.
======================================================================
======================================================================
Adding comment to Jira.
======================================================================
======================================================================
Comment added.
bb7460c9c7c5262a6377a0f5e9855a08ace1d74e logged out
======================================================================
======================================================================
Finished build.
======================================================================
======================================================================
Build step 'Execute shell' marked build as failure
Archiving artifacts
Sending artifact delta relative to PreCommit-TEZ-Build #267
Archived 41 artifacts
Archive block size is 32768
Received 6 blocks and 2447682 bytes
Compression is 7.4%
Took 1 sec
[description-setter] Could not determine description.
Recording test results
Email was triggered for: Failure
Sending email for trigger: Failure
###################################################################################
############################## FAILED TESTS (if any) ##############################
All tests passed