You are viewing a plain text version of this content. The canonical link for it is here.
Posted to builds@cassandra.apache.org by Apache Jenkins Server <je...@builds.apache.org> on 2023/04/14 19:00:51 UTC
Build complete: Cassandra-4.0 #565 [UNSTABLE] f2427a0c861aa9badab2b7532810e25b51812750
-------------------------------------------------------------------------------
Build Cassandra-4.0 #565 Still Unstable
URL: https://ci-cassandra.apache.org/job/Cassandra-4.0/565/
-------------------------------------------------------------------------------
Changes:
[Stefan Miklosovic] Increment version to 4.0.10
-------------------------------------------------------------------------------
Failed Tests:
6 tests failed.
FAILED: dtest-upgrade.upgrade_tests.bootstrap_upgrade_test.TestBootstrapUpgrade.test_simultaneous_bootstrap
FAILED: org.apache.cassandra.db.compaction.SingleSSTableLCSTaskTest.uplevelDisabledTest
FAILED: org.apache.cassandra.dht.tokenallocator.OfflineTokenAllocatorTest.testTokenGenerations
FAILED: org.apache.cassandra.dht.tokenallocator.OfflineTokenAllocatorTest.testTokenGenerations
FAILED: org.apache.cassandra.distributed.test.FailingRepairTest.testFailingMessage[VALIDATION_REQ/parallel/true]
FAILED: org.apache.cassandra.distributed.test.FailingRepairTest.testFailingMessage[VALIDATION_REQ/parallel/true]
-------------------------------------------------------------------------------
For complete test report and logs see https://nightlies.apache.org/cassandra/Cassandra-4.0/565/