You are viewing a plain text version of this content. The canonical link for it is here.
Posted to builds@solr.apache.org by Apache Jenkins Server <je...@builds.apache.org> on 2021/11/11 12:35:24 UTC
[JENKINS] Solr » Solr-Artifacts-main - Build # 433 - Failure!
Build: https://ci-builds.apache.org/job/Solr/job/Solr-Artifacts-main/433/
No tests ran.
Build Log:
[...truncated 220 lines...]
ERROR: Error installing /home/jenkins/.gradle/caches/modules-2/files-2.1/rubygems/http_parser.rb/0.8.0/8aa1092bbc1f10fd9622224babf2b2a98d4d4b22/http_parser.rb-0.8.0.gem:
ERROR: Failed to build gem native extension.
current directory: /home/jenkins/jenkins-slave/workspace/Solr/Solr-Artifacts-main/solr/solr-ref-guide/build/.gems/gems/http_parser.rb-0.8.0/ext/ruby_http_parser
/usr/local/asfpackages/java/oraclejdk-11.0.11/bin/java -cp :/home/jenkins/.gradle/caches/modules-2/files-2.1/org.jruby/jruby-complete/9.2.9.0/8e44ce7a1417966d89957bd766a148601e28828b/jruby-complete-9.2.9.0.jar org.jruby.Main -r ./siteconf20211111-3733650-17d0m56.rb extconf.rb
WARNING: An illegal reflective access operation has occurred
WARNING: Illegal reflective access by com.headius.backport9.modules.Modules (file:/home/jenkins/.gradle/caches/modules-2/files-2.1/org.jruby/jruby-complete/9.2.9.0/8e44ce7a1417966d89957bd766a148601e28828b/jruby-complete-9.2.9.0.jar) to method sun.nio.ch.NativeThread.signal(long)
WARNING: Please consider reporting this to the maintainers of com.headius.backport9.modules.Modules
WARNING: Use --illegal-access=warn to enable warnings of further illegal reflective access operations
WARNING: All illegal access operations will be denied in a future release
creating Makefile
current directory: /home/jenkins/jenkins-slave/workspace/Solr/Solr-Artifacts-main/solr/solr-ref-guide/build/.gems/gems/http_parser.rb-0.8.0/ext/ruby_http_parser
make "DESTDIR=" clean
Makefile:225: *** multiple target patterns. Stop.
current directory: /home/jenkins/jenkins-slave/workspace/Solr/Solr-Artifacts-main/solr/solr-ref-guide/build/.gems/gems/http_parser.rb-0.8.0/ext/ruby_http_parser
make "DESTDIR="
Makefile:225: *** multiple target patterns. Stop.
make failed, exit code 2
Gem files will remain installed in /home/jenkins/jenkins-slave/workspace/Solr/Solr-Artifacts-main/solr/solr-ref-guide/build/.gems/gems/http_parser.rb-0.8.0 for inspection.
Results logged to /home/jenkins/jenkins-slave/workspace/Solr/Solr-Artifacts-main/solr/solr-ref-guide/build/.gems/extensions/universal-java-11/2.5.0/http_parser.rb-0.8.0/gem_make.out
Successfully installed eventmachine-1.2.7-java
Successfully installed public_suffix-4.0.6
Successfully installed temple-0.8.2
Successfully installed asciidoctor-2.0.16
Successfully installed safe_yaml-1.0.5
Successfully installed rouge-3.26.1
Successfully installed pathutil-0.16.2
Successfully installed mercenary-0.3.6
Successfully installed liquid-4.0.3
Successfully installed kramdown-2.3.1
Successfully installed jekyll-watch-2.2.1
Successfully installed jekyll-sass-converter-1.5.2
Successfully installed em-websocket-0.5.3
Successfully installed colorator-1.1.0
Successfully installed addressable-2.8.0
Successfully installed concurrent-ruby-1.1.9
Successfully installed i18n-0.9.5
Successfully installed tilt-2.0.10
Successfully installed slim-4.1.0
Successfully installed jekyll-3.9.1
Successfully installed jekyll-asciidoc-3.0.0
29 gems installed
> Task :solr:solr-ref-guide:jrubyPrepare FAILED
FAILURE: Build failed with an exception.
* What went wrong:
Execution failed for task ':solr:solr-ref-guide:jrubyPrepare'.
> Process 'command '/usr/local/asfpackages/java/oraclejdk-11.0.11/bin/java'' finished with non-zero exit value 1
* Try:
Run with --stacktrace option to get the stack trace. Run with --info or --debug option to get more log output. Run with --scan to get full insights.
* Get more help at https://help.gradle.org
Deprecated Gradle features were used in this build, making it incompatible with Gradle 8.0.
You can use '--warning-mode all' to show the individual deprecation warnings and determine if they come from your own scripts or plugins.
See https://docs.gradle.org/7.2/userguide/command_line_interface.html#sec:command_line_warnings
BUILD FAILED in 3m 7s
83 actionable tasks: 83 executed
Build step 'Invoke Gradle script' changed build result to FAILURE
Build step 'Invoke Gradle script' marked build as failure
Archiving artifacts
[Fast Archiver] Compressed 351.63 MB of artifacts by 42.6% relative to #432
Publishing Javadoc
Email was triggered for: Failure - Any
Sending email for trigger: Failure - Any