You are viewing a plain text version of this content. The canonical link for it is here.
Posted to dev@zookeeper.apache.org by Apache Jenkins Server <je...@builds.apache.org> on 2014/11/10 12:10:13 UTC

ZooKeeper-trunk - Build # 2497 - Still Failing

See https://builds.apache.org/job/ZooKeeper-trunk/2497/

###################################################################################
########################## LAST 60 LINES OF THE CONSOLE ###########################
[...truncated 328351 lines...]
    [junit] 2014-11-10 11:09:50,842 [myid:] - INFO  [main:FileTxnSnapLog@298] - Snapshotting: 0xb to /home/jenkins/jenkins-slave/workspace/ZooKeeper-trunk/trunk/build/test/tmp/test7530548684022689544.junit.dir/version-2/snapshot.b
    [junit] 2014-11-10 11:09:50,845 [myid:] - INFO  [main:FourLetterWordMain@43] - connecting to 127.0.0.1 11221
    [junit] 2014-11-10 11:09:50,845 [myid:] - INFO  [NIOServerCxnFactory.AcceptThread:0.0.0.0/0.0.0.0:11221:NIOServerCnxnFactory$AcceptThread@296] - Accepted socket connection from /127.0.0.1:39851
    [junit] 2014-11-10 11:09:50,847 [myid:] - INFO  [NIOWorkerThread-1:NIOServerCnxn@835] - Processing stat command from /127.0.0.1:39851
    [junit] 2014-11-10 11:09:50,847 [myid:] - INFO  [NIOWorkerThread-1:NIOServerCnxn$StatCommand@684] - Stat command output
    [junit] 2014-11-10 11:09:50,848 [myid:] - INFO  [NIOWorkerThread-1:NIOServerCnxn@1006] - Closed socket connection for client /127.0.0.1:39851 (no session established for client)
    [junit] 2014-11-10 11:09:50,848 [myid:] - INFO  [main:JMXEnv@224] - ensureParent:[InMemoryDataTree, StandaloneServer_port]
    [junit] 2014-11-10 11:09:50,850 [myid:] - INFO  [main:JMXEnv@241] - expect:InMemoryDataTree
    [junit] 2014-11-10 11:09:50,850 [myid:] - INFO  [main:JMXEnv@245] - found:InMemoryDataTree org.apache.ZooKeeperService:name0=StandaloneServer_port11221,name1=InMemoryDataTree
    [junit] 2014-11-10 11:09:50,851 [myid:] - INFO  [main:JMXEnv@241] - expect:StandaloneServer_port
    [junit] 2014-11-10 11:09:50,851 [myid:] - INFO  [main:JMXEnv@245] - found:StandaloneServer_port org.apache.ZooKeeperService:name0=StandaloneServer_port11221
    [junit] 2014-11-10 11:09:50,851 [myid:] - INFO  [main:JUnit4ZKTestRunner$LoggedInvokeMethod@55] - Memory used 83949
    [junit] 2014-11-10 11:09:50,852 [myid:] - INFO  [main:JUnit4ZKTestRunner$LoggedInvokeMethod@60] - Number of threads 24
    [junit] 2014-11-10 11:09:50,852 [myid:] - INFO  [main:JUnit4ZKTestRunner$LoggedInvokeMethod@65] - FINISHED TEST METHOD testQuota
    [junit] 2014-11-10 11:09:50,852 [myid:] - INFO  [main:ClientBase@520] - tearDown starting
    [junit] 2014-11-10 11:09:50,897 [myid:] - INFO  [main:ZooKeeper@968] - Session: 0x149996542540000 closed
    [junit] 2014-11-10 11:09:50,897 [myid:] - INFO  [main:ClientBase@490] - STOPPING server
    [junit] 2014-11-10 11:09:50,897 [myid:] - INFO  [main-EventThread:ClientCnxn$EventThread@529] - EventThread shut down
    [junit] 2014-11-10 11:09:50,897 [myid:] - INFO  [NIOServerCxnFactory.AcceptThread:0.0.0.0/0.0.0.0:11221:NIOServerCnxnFactory$AcceptThread@219] - accept thread exitted run method
    [junit] 2014-11-10 11:09:50,897 [myid:] - INFO  [ConnnectionExpirer:NIOServerCnxnFactory$ConnectionExpirerThread@583] - ConnnectionExpirerThread interrupted
    [junit] 2014-11-10 11:09:50,898 [myid:] - INFO  [NIOServerCxnFactory.SelectorThread-0:NIOServerCnxnFactory$SelectorThread@420] - selector thread exitted run method
    [junit] 2014-11-10 11:09:50,897 [myid:] - INFO  [NIOServerCxnFactory.SelectorThread-1:NIOServerCnxnFactory$SelectorThread@420] - selector thread exitted run method
    [junit] 2014-11-10 11:09:50,899 [myid:] - INFO  [main:ZooKeeperServer@443] - shutting down
    [junit] 2014-11-10 11:09:50,899 [myid:] - INFO  [main:SessionTrackerImpl@231] - Shutting down
    [junit] 2014-11-10 11:09:50,899 [myid:] - INFO  [main:PrepRequestProcessor@971] - Shutting down
    [junit] 2014-11-10 11:09:50,899 [myid:] - INFO  [main:SyncRequestProcessor@191] - Shutting down
    [junit] 2014-11-10 11:09:50,899 [myid:] - INFO  [ProcessThread(sid:0 cport:11221)::PrepRequestProcessor@155] - PrepRequestProcessor exited loop!
    [junit] 2014-11-10 11:09:50,900 [myid:] - INFO  [SyncThread:0:SyncRequestProcessor@169] - SyncRequestProcessor exited!
    [junit] 2014-11-10 11:09:50,900 [myid:] - INFO  [main:FinalRequestProcessor@476] - shutdown of request processor complete
    [junit] 2014-11-10 11:09:50,901 [myid:] - INFO  [main:MBeanRegistry@119] - Unregister MBean [org.apache.ZooKeeperService:name0=StandaloneServer_port11221,name1=InMemoryDataTree]
    [junit] 2014-11-10 11:09:50,901 [myid:] - INFO  [main:MBeanRegistry@119] - Unregister MBean [org.apache.ZooKeeperService:name0=StandaloneServer_port11221]
    [junit] 2014-11-10 11:09:50,902 [myid:] - INFO  [main:FourLetterWordMain@43] - connecting to 127.0.0.1 11221
    [junit] 2014-11-10 11:09:50,903 [myid:] - INFO  [main:JMXEnv@142] - ensureOnly:[]
    [junit] 2014-11-10 11:09:50,907 [myid:] - INFO  [main:ClientBase@545] - fdcount after test is: 46 at start it was 33
    [junit] 2014-11-10 11:09:50,907 [myid:] - INFO  [main:ClientBase@547] - sleeping for 20 secs
    [junit] 2014-11-10 11:09:50,909 [myid:] - INFO  [main:ZKTestCase$1@65] - SUCCEEDED testQuota
    [junit] 2014-11-10 11:09:50,909 [myid:] - INFO  [main:ZKTestCase$1@60] - FINISHED testQuota
    [junit] Tests run: 1, Failures: 0, Errors: 0, Skipped: 0, Time elapsed: 0.701 sec

BUILD FAILED
/home/jenkins/jenkins-slave/workspace/ZooKeeper-trunk/trunk/build.xml:1422: The following error occurred while executing this line:
/home/jenkins/jenkins-slave/workspace/ZooKeeper-trunk/trunk/build.xml:1333: Tests failed!

Total time: 38 minutes 10 seconds
Build step 'Execute shell' marked build as failure
[FINDBUGS] Skipping publisher since build result is FAILURE
[WARNINGS] Skipping publisher since build result is FAILURE
Archiving artifacts
Sending artifact delta relative to ZooKeeper-trunk #2494
Archived 3 artifacts
Archive block size is 32768
Received 2 blocks and 17816690 bytes
Compression is 0.4%
Took 8.9 sec
Recording fingerprints
Recording test results
Publishing Javadoc
Email was triggered for: Failure
Sending email for trigger: Failure



###################################################################################
############################## FAILED TESTS (if any) ##############################
1 tests failed.
FAILED:  org.apache.zookeeper.test.ReconfigTest.testPortChange

Error Message:
expected:<test[1]> but was:<test[0]>

Stack Trace:
junit.framework.AssertionFailedError: expected:<test[1]> but was:<test[0]>
	at org.apache.zookeeper.test.ReconfigTest.testNormalOperation(ReconfigTest.java:151)
	at org.apache.zookeeper.test.ReconfigTest.testPortChange(ReconfigTest.java:600)
	at org.apache.zookeeper.JUnit4ZKTestRunner$LoggedInvokeMethod.evaluate(JUnit4ZKTestRunner.java:52)