You are viewing a plain text version of this content. The canonical link for it is here.
Posted to dev@lucene.apache.org by Policeman Jenkins Server <je...@thetaphi.de> on 2015/09/19 22:11:25 UTC
[JENKINS] Lucene-Solr-trunk-Solaris (64bit/jdk1.8.0) - Build # 64 -
Still Failing!
Build: http://jenkins.thetaphi.de/job/Lucene-Solr-trunk-Solaris/64/
Java: 64bit/jdk1.8.0 -XX:+UseCompressedOops -XX:+UseG1GC
3 tests failed.
FAILED: org.apache.solr.client.solrj.io.sql.JdbcTest.doTest
Error Message:
Stack Trace:
java.lang.AssertionError
at __randomizedtesting.SeedInfo.seed([E59B57130FBDAD02:42DFEFB76206BEBB]:0)
at org.apache.solr.client.solrj.io.sql.JdbcTest.doTest(JdbcTest.java:142)
at sun.reflect.NativeMethodAccessorImpl.invoke0(Native Method)
at sun.reflect.NativeMethodAccessorImpl.invoke(NativeMethodAccessorImpl.java:62)
at sun.reflect.DelegatingMethodAccessorImpl.invoke(DelegatingMethodAccessorImpl.java:43)
at java.lang.reflect.Method.invoke(Method.java:497)
at com.carrotsearch.randomizedtesting.RandomizedRunner.invoke(RandomizedRunner.java:1627)
at com.carrotsearch.randomizedtesting.RandomizedRunner$6.evaluate(RandomizedRunner.java:836)
at com.carrotsearch.randomizedtesting.RandomizedRunner$7.evaluate(RandomizedRunner.java:872)
at com.carrotsearch.randomizedtesting.RandomizedRunner$8.evaluate(RandomizedRunner.java:886)
at org.apache.solr.BaseDistributedSearchTestCase$ShardsRepeatRule$ShardsFixedStatement.callStatement(BaseDistributedSearchTestCase.java:963)
at org.apache.solr.BaseDistributedSearchTestCase$ShardsRepeatRule$ShardsStatement.evaluate(BaseDistributedSearchTestCase.java:938)
at com.carrotsearch.randomizedtesting.rules.SystemPropertiesRestoreRule$1.evaluate(SystemPropertiesRestoreRule.java:57)
at org.apache.lucene.util.TestRuleSetupTeardownChained$1.evaluate(TestRuleSetupTeardownChained.java:50)
at org.apache.lucene.util.AbstractBeforeAfterRule$1.evaluate(AbstractBeforeAfterRule.java:46)
at org.apache.lucene.util.TestRuleThreadAndTestName$1.evaluate(TestRuleThreadAndTestName.java:49)
at org.apache.lucene.util.TestRuleIgnoreAfterMaxFailures$1.evaluate(TestRuleIgnoreAfterMaxFailures.java:65)
at org.apache.lucene.util.TestRuleMarkFailure$1.evaluate(TestRuleMarkFailure.java:48)
at com.carrotsearch.randomizedtesting.rules.StatementAdapter.evaluate(StatementAdapter.java:36)
at com.carrotsearch.randomizedtesting.ThreadLeakControl$StatementRunner.run(ThreadLeakControl.java:365)
at com.carrotsearch.randomizedtesting.ThreadLeakControl.forkTimeoutingTask(ThreadLeakControl.java:798)
at com.carrotsearch.randomizedtesting.ThreadLeakControl$3.evaluate(ThreadLeakControl.java:458)
at com.carrotsearch.randomizedtesting.RandomizedRunner.runSingleTest(RandomizedRunner.java:845)
at com.carrotsearch.randomizedtesting.RandomizedRunner$3.evaluate(RandomizedRunner.java:747)
at com.carrotsearch.randomizedtesting.RandomizedRunner$4.evaluate(RandomizedRunner.java:781)
at com.carrotsearch.randomizedtesting.RandomizedRunner$5.evaluate(RandomizedRunner.java:792)
at com.carrotsearch.randomizedtesting.rules.StatementAdapter.evaluate(StatementAdapter.java:36)
at com.carrotsearch.randomizedtesting.rules.SystemPropertiesRestoreRule$1.evaluate(SystemPropertiesRestoreRule.java:57)
at org.apache.lucene.util.AbstractBeforeAfterRule$1.evaluate(AbstractBeforeAfterRule.java:46)
at com.carrotsearch.randomizedtesting.rules.StatementAdapter.evaluate(StatementAdapter.java:36)
at org.apache.lucene.util.TestRuleStoreClassName$1.evaluate(TestRuleStoreClassName.java:42)
at com.carrotsearch.randomizedtesting.rules.NoShadowingOrOverridesOnMethodsRule$1.evaluate(NoShadowingOrOverridesOnMethodsRule.java:39)
at com.carrotsearch.randomizedtesting.rules.NoShadowingOrOverridesOnMethodsRule$1.evaluate(NoShadowingOrOverridesOnMethodsRule.java:39)
at com.carrotsearch.randomizedtesting.rules.StatementAdapter.evaluate(StatementAdapter.java:36)
at com.carrotsearch.randomizedtesting.rules.StatementAdapter.evaluate(StatementAdapter.java:36)
at com.carrotsearch.randomizedtesting.rules.StatementAdapter.evaluate(StatementAdapter.java:36)
at org.apache.lucene.util.TestRuleAssertionsRequired$1.evaluate(TestRuleAssertionsRequired.java:54)
at org.apache.lucene.util.TestRuleMarkFailure$1.evaluate(TestRuleMarkFailure.java:48)
at org.apache.lucene.util.TestRuleIgnoreAfterMaxFailures$1.evaluate(TestRuleIgnoreAfterMaxFailures.java:65)
at org.apache.lucene.util.TestRuleIgnoreTestSuites$1.evaluate(TestRuleIgnoreTestSuites.java:55)
at com.carrotsearch.randomizedtesting.rules.StatementAdapter.evaluate(StatementAdapter.java:36)
at com.carrotsearch.randomizedtesting.ThreadLeakControl$StatementRunner.run(ThreadLeakControl.java:365)
at java.lang.Thread.run(Thread.java:745)
FAILED: junit.framework.TestSuite.org.apache.solr.client.solrj.io.sql.JdbcTest
Error Message:
6 threads leaked from SUITE scope at org.apache.solr.client.solrj.io.sql.JdbcTest: 1) Thread[id=797, name=TEST-JdbcTest.doTest-seed#[E59B57130FBDAD02]-EventThread, state=WAITING, group=TGRP-JdbcTest] at sun.misc.Unsafe.park(Native Method) at java.util.concurrent.locks.LockSupport.park(LockSupport.java:175) at java.util.concurrent.locks.AbstractQueuedSynchronizer$ConditionObject.await(AbstractQueuedSynchronizer.java:2039) at java.util.concurrent.LinkedBlockingQueue.take(LinkedBlockingQueue.java:442) at org.apache.zookeeper.ClientCnxn$EventThread.run(ClientCnxn.java:494) 2) Thread[id=798, name=zkCallback-65-thread-1, state=TIMED_WAITING, group=TGRP-JdbcTest] at sun.misc.Unsafe.park(Native Method) at java.util.concurrent.locks.LockSupport.parkNanos(LockSupport.java:215) at java.util.concurrent.SynchronousQueue$TransferStack.awaitFulfill(SynchronousQueue.java:460) at java.util.concurrent.SynchronousQueue$TransferStack.transfer(SynchronousQueue.java:362) at java.util.concurrent.SynchronousQueue.poll(SynchronousQueue.java:941) at java.util.concurrent.ThreadPoolExecutor.getTask(ThreadPoolExecutor.java:1066) at java.util.concurrent.ThreadPoolExecutor.runWorker(ThreadPoolExecutor.java:1127) at java.util.concurrent.ThreadPoolExecutor$Worker.run(ThreadPoolExecutor.java:617) at java.lang.Thread.run(Thread.java:745) 3) Thread[id=836, name=zkCallback-65-thread-2, state=TIMED_WAITING, group=TGRP-JdbcTest] at sun.misc.Unsafe.park(Native Method) at java.util.concurrent.locks.LockSupport.parkNanos(LockSupport.java:215) at java.util.concurrent.SynchronousQueue$TransferStack.awaitFulfill(SynchronousQueue.java:460) at java.util.concurrent.SynchronousQueue$TransferStack.transfer(SynchronousQueue.java:362) at java.util.concurrent.SynchronousQueue.poll(SynchronousQueue.java:941) at java.util.concurrent.ThreadPoolExecutor.getTask(ThreadPoolExecutor.java:1066) at java.util.concurrent.ThreadPoolExecutor.runWorker(ThreadPoolExecutor.java:1127) at java.util.concurrent.ThreadPoolExecutor$Worker.run(ThreadPoolExecutor.java:617) at java.lang.Thread.run(Thread.java:745) 4) Thread[id=838, name=zkCallback-65-thread-4, state=TIMED_WAITING, group=TGRP-JdbcTest] at sun.misc.Unsafe.park(Native Method) at java.util.concurrent.locks.LockSupport.parkNanos(LockSupport.java:215) at java.util.concurrent.SynchronousQueue$TransferStack.awaitFulfill(SynchronousQueue.java:460) at java.util.concurrent.SynchronousQueue$TransferStack.transfer(SynchronousQueue.java:362) at java.util.concurrent.SynchronousQueue.poll(SynchronousQueue.java:941) at java.util.concurrent.ThreadPoolExecutor.getTask(ThreadPoolExecutor.java:1066) at java.util.concurrent.ThreadPoolExecutor.runWorker(ThreadPoolExecutor.java:1127) at java.util.concurrent.ThreadPoolExecutor$Worker.run(ThreadPoolExecutor.java:617) at java.lang.Thread.run(Thread.java:745) 5) Thread[id=796, name=TEST-JdbcTest.doTest-seed#[E59B57130FBDAD02]-SendThread(127.0.0.1:55479), state=TIMED_WAITING, group=TGRP-JdbcTest] at java.lang.Thread.sleep(Native Method) at org.apache.zookeeper.client.StaticHostProvider.next(StaticHostProvider.java:101) at org.apache.zookeeper.ClientCnxn$SendThread.startConnect(ClientCnxn.java:940) at org.apache.zookeeper.ClientCnxn$SendThread.run(ClientCnxn.java:1003) 6) Thread[id=837, name=zkCallback-65-thread-3, state=TIMED_WAITING, group=TGRP-JdbcTest] at sun.misc.Unsafe.park(Native Method) at java.util.concurrent.locks.LockSupport.parkNanos(LockSupport.java:215) at java.util.concurrent.SynchronousQueue$TransferStack.awaitFulfill(SynchronousQueue.java:460) at java.util.concurrent.SynchronousQueue$TransferStack.transfer(SynchronousQueue.java:362) at java.util.concurrent.SynchronousQueue.poll(SynchronousQueue.java:941) at java.util.concurrent.ThreadPoolExecutor.getTask(ThreadPoolExecutor.java:1066) at java.util.concurrent.ThreadPoolExecutor.runWorker(ThreadPoolExecutor.java:1127) at java.util.concurrent.ThreadPoolExecutor$Worker.run(ThreadPoolExecutor.java:617) at java.lang.Thread.run(Thread.java:745)
Stack Trace:
com.carrotsearch.randomizedtesting.ThreadLeakError: 6 threads leaked from SUITE scope at org.apache.solr.client.solrj.io.sql.JdbcTest:
1) Thread[id=797, name=TEST-JdbcTest.doTest-seed#[E59B57130FBDAD02]-EventThread, state=WAITING, group=TGRP-JdbcTest]
at sun.misc.Unsafe.park(Native Method)
at java.util.concurrent.locks.LockSupport.park(LockSupport.java:175)
at java.util.concurrent.locks.AbstractQueuedSynchronizer$ConditionObject.await(AbstractQueuedSynchronizer.java:2039)
at java.util.concurrent.LinkedBlockingQueue.take(LinkedBlockingQueue.java:442)
at org.apache.zookeeper.ClientCnxn$EventThread.run(ClientCnxn.java:494)
2) Thread[id=798, name=zkCallback-65-thread-1, state=TIMED_WAITING, group=TGRP-JdbcTest]
at sun.misc.Unsafe.park(Native Method)
at java.util.concurrent.locks.LockSupport.parkNanos(LockSupport.java:215)
at java.util.concurrent.SynchronousQueue$TransferStack.awaitFulfill(SynchronousQueue.java:460)
at java.util.concurrent.SynchronousQueue$TransferStack.transfer(SynchronousQueue.java:362)
at java.util.concurrent.SynchronousQueue.poll(SynchronousQueue.java:941)
at java.util.concurrent.ThreadPoolExecutor.getTask(ThreadPoolExecutor.java:1066)
at java.util.concurrent.ThreadPoolExecutor.runWorker(ThreadPoolExecutor.java:1127)
at java.util.concurrent.ThreadPoolExecutor$Worker.run(ThreadPoolExecutor.java:617)
at java.lang.Thread.run(Thread.java:745)
3) Thread[id=836, name=zkCallback-65-thread-2, state=TIMED_WAITING, group=TGRP-JdbcTest]
at sun.misc.Unsafe.park(Native Method)
at java.util.concurrent.locks.LockSupport.parkNanos(LockSupport.java:215)
at java.util.concurrent.SynchronousQueue$TransferStack.awaitFulfill(SynchronousQueue.java:460)
at java.util.concurrent.SynchronousQueue$TransferStack.transfer(SynchronousQueue.java:362)
at java.util.concurrent.SynchronousQueue.poll(SynchronousQueue.java:941)
at java.util.concurrent.ThreadPoolExecutor.getTask(ThreadPoolExecutor.java:1066)
at java.util.concurrent.ThreadPoolExecutor.runWorker(ThreadPoolExecutor.java:1127)
at java.util.concurrent.ThreadPoolExecutor$Worker.run(ThreadPoolExecutor.java:617)
at java.lang.Thread.run(Thread.java:745)
4) Thread[id=838, name=zkCallback-65-thread-4, state=TIMED_WAITING, group=TGRP-JdbcTest]
at sun.misc.Unsafe.park(Native Method)
at java.util.concurrent.locks.LockSupport.parkNanos(LockSupport.java:215)
at java.util.concurrent.SynchronousQueue$TransferStack.awaitFulfill(SynchronousQueue.java:460)
at java.util.concurrent.SynchronousQueue$TransferStack.transfer(SynchronousQueue.java:362)
at java.util.concurrent.SynchronousQueue.poll(SynchronousQueue.java:941)
at java.util.concurrent.ThreadPoolExecutor.getTask(ThreadPoolExecutor.java:1066)
at java.util.concurrent.ThreadPoolExecutor.runWorker(ThreadPoolExecutor.java:1127)
at java.util.concurrent.ThreadPoolExecutor$Worker.run(ThreadPoolExecutor.java:617)
at java.lang.Thread.run(Thread.java:745)
5) Thread[id=796, name=TEST-JdbcTest.doTest-seed#[E59B57130FBDAD02]-SendThread(127.0.0.1:55479), state=TIMED_WAITING, group=TGRP-JdbcTest]
at java.lang.Thread.sleep(Native Method)
at org.apache.zookeeper.client.StaticHostProvider.next(StaticHostProvider.java:101)
at org.apache.zookeeper.ClientCnxn$SendThread.startConnect(ClientCnxn.java:940)
at org.apache.zookeeper.ClientCnxn$SendThread.run(ClientCnxn.java:1003)
6) Thread[id=837, name=zkCallback-65-thread-3, state=TIMED_WAITING, group=TGRP-JdbcTest]
at sun.misc.Unsafe.park(Native Method)
at java.util.concurrent.locks.LockSupport.parkNanos(LockSupport.java:215)
at java.util.concurrent.SynchronousQueue$TransferStack.awaitFulfill(SynchronousQueue.java:460)
at java.util.concurrent.SynchronousQueue$TransferStack.transfer(SynchronousQueue.java:362)
at java.util.concurrent.SynchronousQueue.poll(SynchronousQueue.java:941)
at java.util.concurrent.ThreadPoolExecutor.getTask(ThreadPoolExecutor.java:1066)
at java.util.concurrent.ThreadPoolExecutor.runWorker(ThreadPoolExecutor.java:1127)
at java.util.concurrent.ThreadPoolExecutor$Worker.run(ThreadPoolExecutor.java:617)
at java.lang.Thread.run(Thread.java:745)
at __randomizedtesting.SeedInfo.seed([E59B57130FBDAD02]:0)
FAILED: junit.framework.TestSuite.org.apache.solr.client.solrj.io.sql.JdbcTest
Error Message:
There are still zombie threads that couldn't be terminated: 1) Thread[id=798, name=zkCallback-65-thread-1, state=TIMED_WAITING, group=TGRP-JdbcTest] at sun.misc.Unsafe.park(Native Method) at java.util.concurrent.locks.LockSupport.parkNanos(LockSupport.java:215) at java.util.concurrent.SynchronousQueue$TransferStack.awaitFulfill(SynchronousQueue.java:460) at java.util.concurrent.SynchronousQueue$TransferStack.transfer(SynchronousQueue.java:362) at java.util.concurrent.SynchronousQueue.poll(SynchronousQueue.java:941) at java.util.concurrent.ThreadPoolExecutor.getTask(ThreadPoolExecutor.java:1066) at java.util.concurrent.ThreadPoolExecutor.runWorker(ThreadPoolExecutor.java:1127) at java.util.concurrent.ThreadPoolExecutor$Worker.run(ThreadPoolExecutor.java:617) at java.lang.Thread.run(Thread.java:745) 2) Thread[id=836, name=zkCallback-65-thread-2, state=TIMED_WAITING, group=TGRP-JdbcTest] at sun.misc.Unsafe.park(Native Method) at java.util.concurrent.locks.LockSupport.parkNanos(LockSupport.java:215) at java.util.concurrent.SynchronousQueue$TransferStack.awaitFulfill(SynchronousQueue.java:460) at java.util.concurrent.SynchronousQueue$TransferStack.transfer(SynchronousQueue.java:362) at java.util.concurrent.SynchronousQueue.poll(SynchronousQueue.java:941) at java.util.concurrent.ThreadPoolExecutor.getTask(ThreadPoolExecutor.java:1066) at java.util.concurrent.ThreadPoolExecutor.runWorker(ThreadPoolExecutor.java:1127) at java.util.concurrent.ThreadPoolExecutor$Worker.run(ThreadPoolExecutor.java:617) at java.lang.Thread.run(Thread.java:745) 3) Thread[id=838, name=zkCallback-65-thread-4, state=TIMED_WAITING, group=TGRP-JdbcTest] at sun.misc.Unsafe.park(Native Method) at java.util.concurrent.locks.LockSupport.parkNanos(LockSupport.java:215) at java.util.concurrent.SynchronousQueue$TransferStack.awaitFulfill(SynchronousQueue.java:460) at java.util.concurrent.SynchronousQueue$TransferStack.transfer(SynchronousQueue.java:362) at java.util.concurrent.SynchronousQueue.poll(SynchronousQueue.java:941) at java.util.concurrent.ThreadPoolExecutor.getTask(ThreadPoolExecutor.java:1066) at java.util.concurrent.ThreadPoolExecutor.runWorker(ThreadPoolExecutor.java:1127) at java.util.concurrent.ThreadPoolExecutor$Worker.run(ThreadPoolExecutor.java:617) at java.lang.Thread.run(Thread.java:745) 4) Thread[id=796, name=TEST-JdbcTest.doTest-seed#[E59B57130FBDAD02]-SendThread(127.0.0.1:55479), state=TIMED_WAITING, group=TGRP-JdbcTest] at java.lang.Thread.sleep(Native Method) at org.apache.zookeeper.client.StaticHostProvider.next(StaticHostProvider.java:101) at org.apache.zookeeper.ClientCnxn$SendThread.startConnect(ClientCnxn.java:940) at org.apache.zookeeper.ClientCnxn$SendThread.run(ClientCnxn.java:1003) 5) Thread[id=837, name=zkCallback-65-thread-3, state=TIMED_WAITING, group=TGRP-JdbcTest] at sun.misc.Unsafe.park(Native Method) at java.util.concurrent.locks.LockSupport.parkNanos(LockSupport.java:215) at java.util.concurrent.SynchronousQueue$TransferStack.awaitFulfill(SynchronousQueue.java:460) at java.util.concurrent.SynchronousQueue$TransferStack.transfer(SynchronousQueue.java:362) at java.util.concurrent.SynchronousQueue.poll(SynchronousQueue.java:941) at java.util.concurrent.ThreadPoolExecutor.getTask(ThreadPoolExecutor.java:1066) at java.util.concurrent.ThreadPoolExecutor.runWorker(ThreadPoolExecutor.java:1127) at java.util.concurrent.ThreadPoolExecutor$Worker.run(ThreadPoolExecutor.java:617) at java.lang.Thread.run(Thread.java:745)
Stack Trace:
com.carrotsearch.randomizedtesting.ThreadLeakError: There are still zombie threads that couldn't be terminated:
1) Thread[id=798, name=zkCallback-65-thread-1, state=TIMED_WAITING, group=TGRP-JdbcTest]
at sun.misc.Unsafe.park(Native Method)
at java.util.concurrent.locks.LockSupport.parkNanos(LockSupport.java:215)
at java.util.concurrent.SynchronousQueue$TransferStack.awaitFulfill(SynchronousQueue.java:460)
at java.util.concurrent.SynchronousQueue$TransferStack.transfer(SynchronousQueue.java:362)
at java.util.concurrent.SynchronousQueue.poll(SynchronousQueue.java:941)
at java.util.concurrent.ThreadPoolExecutor.getTask(ThreadPoolExecutor.java:1066)
at java.util.concurrent.ThreadPoolExecutor.runWorker(ThreadPoolExecutor.java:1127)
at java.util.concurrent.ThreadPoolExecutor$Worker.run(ThreadPoolExecutor.java:617)
at java.lang.Thread.run(Thread.java:745)
2) Thread[id=836, name=zkCallback-65-thread-2, state=TIMED_WAITING, group=TGRP-JdbcTest]
at sun.misc.Unsafe.park(Native Method)
at java.util.concurrent.locks.LockSupport.parkNanos(LockSupport.java:215)
at java.util.concurrent.SynchronousQueue$TransferStack.awaitFulfill(SynchronousQueue.java:460)
at java.util.concurrent.SynchronousQueue$TransferStack.transfer(SynchronousQueue.java:362)
at java.util.concurrent.SynchronousQueue.poll(SynchronousQueue.java:941)
at java.util.concurrent.ThreadPoolExecutor.getTask(ThreadPoolExecutor.java:1066)
at java.util.concurrent.ThreadPoolExecutor.runWorker(ThreadPoolExecutor.java:1127)
at java.util.concurrent.ThreadPoolExecutor$Worker.run(ThreadPoolExecutor.java:617)
at java.lang.Thread.run(Thread.java:745)
3) Thread[id=838, name=zkCallback-65-thread-4, state=TIMED_WAITING, group=TGRP-JdbcTest]
at sun.misc.Unsafe.park(Native Method)
at java.util.concurrent.locks.LockSupport.parkNanos(LockSupport.java:215)
at java.util.concurrent.SynchronousQueue$TransferStack.awaitFulfill(SynchronousQueue.java:460)
at java.util.concurrent.SynchronousQueue$TransferStack.transfer(SynchronousQueue.java:362)
at java.util.concurrent.SynchronousQueue.poll(SynchronousQueue.java:941)
at java.util.concurrent.ThreadPoolExecutor.getTask(ThreadPoolExecutor.java:1066)
at java.util.concurrent.ThreadPoolExecutor.runWorker(ThreadPoolExecutor.java:1127)
at java.util.concurrent.ThreadPoolExecutor$Worker.run(ThreadPoolExecutor.java:617)
at java.lang.Thread.run(Thread.java:745)
4) Thread[id=796, name=TEST-JdbcTest.doTest-seed#[E59B57130FBDAD02]-SendThread(127.0.0.1:55479), state=TIMED_WAITING, group=TGRP-JdbcTest]
at java.lang.Thread.sleep(Native Method)
at org.apache.zookeeper.client.StaticHostProvider.next(StaticHostProvider.java:101)
at org.apache.zookeeper.ClientCnxn$SendThread.startConnect(ClientCnxn.java:940)
at org.apache.zookeeper.ClientCnxn$SendThread.run(ClientCnxn.java:1003)
5) Thread[id=837, name=zkCallback-65-thread-3, state=TIMED_WAITING, group=TGRP-JdbcTest]
at sun.misc.Unsafe.park(Native Method)
at java.util.concurrent.locks.LockSupport.parkNanos(LockSupport.java:215)
at java.util.concurrent.SynchronousQueue$TransferStack.awaitFulfill(SynchronousQueue.java:460)
at java.util.concurrent.SynchronousQueue$TransferStack.transfer(SynchronousQueue.java:362)
at java.util.concurrent.SynchronousQueue.poll(SynchronousQueue.java:941)
at java.util.concurrent.ThreadPoolExecutor.getTask(ThreadPoolExecutor.java:1066)
at java.util.concurrent.ThreadPoolExecutor.runWorker(ThreadPoolExecutor.java:1127)
at java.util.concurrent.ThreadPoolExecutor$Worker.run(ThreadPoolExecutor.java:617)
at java.lang.Thread.run(Thread.java:745)
at __randomizedtesting.SeedInfo.seed([E59B57130FBDAD02]:0)
Build Log:
[...truncated 11333 lines...]
[junit4] Suite: org.apache.solr.client.solrj.io.sql.JdbcTest
[junit4] 2> Creating dataDir: /export/home/jenkins/workspace/Lucene-Solr-trunk-Solaris/solr/build/solr-solrj/test/J1/temp/solr.client.solrj.io.sql.JdbcTest_E59B57130FBDAD02-001/init-core-data-001
[junit4] 2> 136501 INFO (SUITE-JdbcTest-seed#[E59B57130FBDAD02]-worker) [ ] o.a.s.SolrTestCaseJ4 Randomized ssl (false) and clientAuth (false)
[junit4] 2> 136501 INFO (SUITE-JdbcTest-seed#[E59B57130FBDAD02]-worker) [ ] o.a.s.BaseDistributedSearchTestCase Setting hostContext system property: /
[junit4] 2> 136504 WARN (SUITE-JdbcTest-seed#[E59B57130FBDAD02]-worker) [ ] o.a.s.c.AbstractZkTestCase TEST_HOME() does not exist - solrj test?
[junit4] 2> 136516 INFO (TEST-JdbcTest.doTest-seed#[E59B57130FBDAD02]) [ ] o.a.s.c.ZkTestServer STARTING ZK TEST SERVER
[junit4] 2> 136519 INFO (Thread-350) [ ] o.a.s.c.ZkTestServer client port:0.0.0.0/0.0.0.0:0
[junit4] 2> 136519 INFO (Thread-350) [ ] o.a.s.c.ZkTestServer Starting server
[junit4] 2> 136619 INFO (TEST-JdbcTest.doTest-seed#[E59B57130FBDAD02]) [ ] o.a.s.c.ZkTestServer start zk server on port:55479
[junit4] 2> 136642 INFO (TEST-JdbcTest.doTest-seed#[E59B57130FBDAD02]) [ ] o.a.s.c.c.SolrZkClient Using default ZkCredentialsProvider
[junit4] 2> 136694 INFO (TEST-JdbcTest.doTest-seed#[E59B57130FBDAD02]) [ ] o.a.s.c.c.ConnectionManager Waiting for client to connect to ZooKeeper
[junit4] 2> 136716 WARN (NIOServerCxn.Factory:0.0.0.0/0.0.0.0:0) [ ] o.a.z.s.NIOServerCnxn Exception causing close of session 0x0 due to java.io.IOException: ZooKeeperServer not running
[junit4] 2> 138820 INFO (zkCallback-37-thread-1) [ ] o.a.s.c.c.ConnectionManager Watcher org.apache.solr.common.cloud.ConnectionManager@77d2e644 name:ZooKeeperConnection Watcher:127.0.0.1:55479 got event WatchedEvent state:SyncConnected type:None path:null path:null type:None
[junit4] 2> 138820 INFO (TEST-JdbcTest.doTest-seed#[E59B57130FBDAD02]) [ ] o.a.s.c.c.ConnectionManager Client is connected to ZooKeeper
[junit4] 2> 138821 INFO (TEST-JdbcTest.doTest-seed#[E59B57130FBDAD02]) [ ] o.a.s.c.c.SolrZkClient Using default ZkACLProvider
[junit4] 2> 138823 INFO (TEST-JdbcTest.doTest-seed#[E59B57130FBDAD02]) [ ] o.a.s.c.c.SolrZkClient makePath: /solr
[junit4] 2> 138851 INFO (TEST-JdbcTest.doTest-seed#[E59B57130FBDAD02]) [ ] o.a.s.c.c.SolrZkClient Using default ZkCredentialsProvider
[junit4] 2> 138852 INFO (TEST-JdbcTest.doTest-seed#[E59B57130FBDAD02]) [ ] o.a.s.c.c.ConnectionManager Waiting for client to connect to ZooKeeper
[junit4] 2> 138856 INFO (zkCallback-38-thread-1) [ ] o.a.s.c.c.ConnectionManager Watcher org.apache.solr.common.cloud.ConnectionManager@1745ff40 name:ZooKeeperConnection Watcher:127.0.0.1:55479/solr got event WatchedEvent state:SyncConnected type:None path:null path:null type:None
[junit4] 2> 138856 INFO (TEST-JdbcTest.doTest-seed#[E59B57130FBDAD02]) [ ] o.a.s.c.c.ConnectionManager Client is connected to ZooKeeper
[junit4] 2> 138857 INFO (TEST-JdbcTest.doTest-seed#[E59B57130FBDAD02]) [ ] o.a.s.c.c.SolrZkClient Using default ZkACLProvider
[junit4] 2> 138859 INFO (TEST-JdbcTest.doTest-seed#[E59B57130FBDAD02]) [ ] o.a.s.c.c.SolrZkClient makePath: /collections/collection1
[junit4] 2> 138868 INFO (TEST-JdbcTest.doTest-seed#[E59B57130FBDAD02]) [ ] o.a.s.c.c.SolrZkClient makePath: /collections/collection1/shards
[junit4] 2> 138872 INFO (TEST-JdbcTest.doTest-seed#[E59B57130FBDAD02]) [ ] o.a.s.c.c.SolrZkClient makePath: /collections/control_collection
[junit4] 2> 138878 INFO (TEST-JdbcTest.doTest-seed#[E59B57130FBDAD02]) [ ] o.a.s.c.c.SolrZkClient makePath: /collections/control_collection/shards
[junit4] 2> 138893 INFO (TEST-JdbcTest.doTest-seed#[E59B57130FBDAD02]) [ ] o.a.s.c.AbstractZkTestCase put /export/home/jenkins/workspace/Lucene-Solr-trunk-Solaris/solr/solrj/src/test-files/solrj/solr/collection1/conf/solrconfig-sql.xml to /configs/conf1/solrconfig.xml
[junit4] 2> 138894 INFO (TEST-JdbcTest.doTest-seed#[E59B57130FBDAD02]) [ ] o.a.s.c.c.SolrZkClient makePath: /configs/conf1/solrconfig.xml
[junit4] 2> 138904 INFO (TEST-JdbcTest.doTest-seed#[E59B57130FBDAD02]) [ ] o.a.s.c.AbstractZkTestCase put /export/home/jenkins/workspace/Lucene-Solr-trunk-Solaris/solr/solrj/src/test-files/solrj/solr/collection1/conf/schema-sql.xml to /configs/conf1/schema.xml
[junit4] 2> 138904 INFO (TEST-JdbcTest.doTest-seed#[E59B57130FBDAD02]) [ ] o.a.s.c.c.SolrZkClient makePath: /configs/conf1/schema.xml
[junit4] 2> 138916 INFO (TEST-JdbcTest.doTest-seed#[E59B57130FBDAD02]) [ ] o.a.s.c.AbstractZkTestCase skipping /export/home/jenkins/workspace/Lucene-Solr-trunk-Solaris/solr/solrj/src/test-files/solrj/solr/collection1/conf/solrconfig.snippet.randomindexconfig.xml because it doesn't exist
[junit4] 2> 138916 INFO (TEST-JdbcTest.doTest-seed#[E59B57130FBDAD02]) [ ] o.a.s.c.AbstractZkTestCase skipping /export/home/jenkins/workspace/Lucene-Solr-trunk-Solaris/solr/solrj/src/test-files/solrj/solr/collection1/conf/stopwords.txt because it doesn't exist
[junit4] 2> 138916 INFO (TEST-JdbcTest.doTest-seed#[E59B57130FBDAD02]) [ ] o.a.s.c.AbstractZkTestCase skipping /export/home/jenkins/workspace/Lucene-Solr-trunk-Solaris/solr/solrj/src/test-files/solrj/solr/collection1/conf/protwords.txt because it doesn't exist
[junit4] 2> 138916 INFO (TEST-JdbcTest.doTest-seed#[E59B57130FBDAD02]) [ ] o.a.s.c.AbstractZkTestCase skipping /export/home/jenkins/workspace/Lucene-Solr-trunk-Solaris/solr/solrj/src/test-files/solrj/solr/collection1/conf/currency.xml because it doesn't exist
[junit4] 2> 138917 INFO (TEST-JdbcTest.doTest-seed#[E59B57130FBDAD02]) [ ] o.a.s.c.AbstractZkTestCase skipping /export/home/jenkins/workspace/Lucene-Solr-trunk-Solaris/solr/solrj/src/test-files/solrj/solr/collection1/conf/enumsConfig.xml because it doesn't exist
[junit4] 2> 138917 INFO (TEST-JdbcTest.doTest-seed#[E59B57130FBDAD02]) [ ] o.a.s.c.AbstractZkTestCase skipping /export/home/jenkins/workspace/Lucene-Solr-trunk-Solaris/solr/solrj/src/test-files/solrj/solr/collection1/conf/open-exchange-rates.json because it doesn't exist
[junit4] 2> 138917 INFO (TEST-JdbcTest.doTest-seed#[E59B57130FBDAD02]) [ ] o.a.s.c.AbstractZkTestCase skipping /export/home/jenkins/workspace/Lucene-Solr-trunk-Solaris/solr/solrj/src/test-files/solrj/solr/collection1/conf/mapping-ISOLatin1Accent.txt because it doesn't exist
[junit4] 2> 138917 INFO (TEST-JdbcTest.doTest-seed#[E59B57130FBDAD02]) [ ] o.a.s.c.AbstractZkTestCase skipping /export/home/jenkins/workspace/Lucene-Solr-trunk-Solaris/solr/solrj/src/test-files/solrj/solr/collection1/conf/old_synonyms.txt because it doesn't exist
[junit4] 2> 138917 INFO (TEST-JdbcTest.doTest-seed#[E59B57130FBDAD02]) [ ] o.a.s.c.AbstractZkTestCase skipping /export/home/jenkins/workspace/Lucene-Solr-trunk-Solaris/solr/solrj/src/test-files/solrj/solr/collection1/conf/synonyms.txt because it doesn't exist
[junit4] 2> 138969 INFO (TEST-JdbcTest.doTest-seed#[E59B57130FBDAD02]) [ ] o.a.s.SolrTestCaseJ4 Writing core.properties file to /export/home/jenkins/workspace/Lucene-Solr-trunk-Solaris/solr/build/solr-solrj/test/J1/temp/solr.client.solrj.io.sql.JdbcTest_E59B57130FBDAD02-001/control-001/cores/collection1
[junit4] 2> 138971 INFO (TEST-JdbcTest.doTest-seed#[E59B57130FBDAD02]) [ ] o.e.j.s.Server jetty-9.2.13.v20150730
[junit4] 2> 138974 INFO (TEST-JdbcTest.doTest-seed#[E59B57130FBDAD02]) [ ] o.e.j.s.h.ContextHandler Started o.e.j.s.ServletContextHandler@9f5aa31{/,null,AVAILABLE}
[junit4] 2> 138974 INFO (TEST-JdbcTest.doTest-seed#[E59B57130FBDAD02]) [ ] o.e.j.s.ServerConnector Started ServerConnector@5d016d73{HTTP/1.1}{127.0.0.1:65274}
[junit4] 2> 138974 INFO (TEST-JdbcTest.doTest-seed#[E59B57130FBDAD02]) [ ] o.e.j.s.Server Started @147059ms
[junit4] 2> 138974 INFO (TEST-JdbcTest.doTest-seed#[E59B57130FBDAD02]) [ ] o.a.s.c.s.e.JettySolrRunner Jetty properties: {solr.data.dir=/export/home/jenkins/workspace/Lucene-Solr-trunk-Solaris/solr/build/solr-solrj/test/J1/temp/solr.client.solrj.io.sql.JdbcTest_E59B57130FBDAD02-001/tempDir-001/control/data, hostContext=/, hostPort=65274, coreRootDirectory=/export/home/jenkins/workspace/Lucene-Solr-trunk-Solaris/solr/build/solr-solrj/test/J1/../../../../../../../../../../export/home/jenkins/workspace/Lucene-Solr-trunk-Solaris/solr/build/solr-solrj/test/J1/temp/solr.client.solrj.io.sql.JdbcTest_E59B57130FBDAD02-001/control-001/cores}
[junit4] 2> 138975 INFO (TEST-JdbcTest.doTest-seed#[E59B57130FBDAD02]) [ ] o.a.s.s.SolrDispatchFilter SolrDispatchFilter.init(): sun.misc.Launcher$AppClassLoader@15db9742
[junit4] 2> 138975 INFO (TEST-JdbcTest.doTest-seed#[E59B57130FBDAD02]) [ ] o.a.s.c.SolrResourceLoader new SolrResourceLoader for directory: '/export/home/jenkins/workspace/Lucene-Solr-trunk-Solaris/solr/build/solr-solrj/test/J1/../../../../../../../../../../export/home/jenkins/workspace/Lucene-Solr-trunk-Solaris/solr/build/solr-solrj/test/J1/temp/solr.client.solrj.io.sql.JdbcTest_E59B57130FBDAD02-001/control-001/'
[junit4] 2> 138989 INFO (TEST-JdbcTest.doTest-seed#[E59B57130FBDAD02]) [ ] o.a.s.c.c.SolrZkClient Using default ZkCredentialsProvider
[junit4] 2> 138989 INFO (TEST-JdbcTest.doTest-seed#[E59B57130FBDAD02]) [ ] o.a.s.c.c.ConnectionManager Waiting for client to connect to ZooKeeper
[junit4] 2> 138993 INFO (zkCallback-39-thread-1) [ ] o.a.s.c.c.ConnectionManager Watcher org.apache.solr.common.cloud.ConnectionManager@7f000670 name:ZooKeeperConnection Watcher:127.0.0.1:55479/solr got event WatchedEvent state:SyncConnected type:None path:null path:null type:None
[junit4] 2> 138994 INFO (TEST-JdbcTest.doTest-seed#[E59B57130FBDAD02]) [ ] o.a.s.c.c.ConnectionManager Client is connected to ZooKeeper
[junit4] 2> 138994 INFO (TEST-JdbcTest.doTest-seed#[E59B57130FBDAD02]) [ ] o.a.s.c.c.SolrZkClient Using default ZkACLProvider
[junit4] 2> 138997 INFO (TEST-JdbcTest.doTest-seed#[E59B57130FBDAD02]) [ ] o.a.s.s.SolrDispatchFilter Loading solr.xml from SolrHome (not found in ZooKeeper)
[junit4] 2> 138997 INFO (TEST-JdbcTest.doTest-seed#[E59B57130FBDAD02]) [ ] o.a.s.c.SolrXmlConfig Loading container configuration from /export/home/jenkins/workspace/Lucene-Solr-trunk-Solaris/solr/build/solr-solrj/test/J1/../../../../../../../../../../export/home/jenkins/workspace/Lucene-Solr-trunk-Solaris/solr/build/solr-solrj/test/J1/temp/solr.client.solrj.io.sql.JdbcTest_E59B57130FBDAD02-001/control-001/solr.xml
[junit4] 2> 139004 INFO (TEST-JdbcTest.doTest-seed#[E59B57130FBDAD02]) [ ] o.a.s.c.CoresLocator Config-defined core root directory: /export/home/jenkins/workspace/Lucene-Solr-trunk-Solaris/solr/build/solr-solrj/test/J1/../../../../../../../../../../export/home/jenkins/workspace/Lucene-Solr-trunk-Solaris/solr/build/solr-solrj/test/J1/temp/solr.client.solrj.io.sql.JdbcTest_E59B57130FBDAD02-001/control-001/cores
[junit4] 2> 139004 INFO (TEST-JdbcTest.doTest-seed#[E59B57130FBDAD02]) [ ] o.a.s.c.CoreContainer New CoreContainer 414664785
[junit4] 2> 139004 INFO (TEST-JdbcTest.doTest-seed#[E59B57130FBDAD02]) [ ] o.a.s.c.CoreContainer Loading cores into CoreContainer [instanceDir=/export/home/jenkins/workspace/Lucene-Solr-trunk-Solaris/solr/build/solr-solrj/test/J1/../../../../../../../../../../export/home/jenkins/workspace/Lucene-Solr-trunk-Solaris/solr/build/solr-solrj/test/J1/temp/solr.client.solrj.io.sql.JdbcTest_E59B57130FBDAD02-001/control-001/]
[junit4] 2> 139004 INFO (TEST-JdbcTest.doTest-seed#[E59B57130FBDAD02]) [ ] o.a.s.c.CoreContainer loading shared library: /export/home/jenkins/workspace/Lucene-Solr-trunk-Solaris/solr/build/solr-solrj/test/J1/../../../../../../../../../../export/home/jenkins/workspace/Lucene-Solr-trunk-Solaris/solr/build/solr-solrj/test/J1/temp/solr.client.solrj.io.sql.JdbcTest_E59B57130FBDAD02-001/control-001/lib
[junit4] 2> 139005 WARN (TEST-JdbcTest.doTest-seed#[E59B57130FBDAD02]) [ ] o.a.s.c.SolrResourceLoader Can't find (or read) directory to add to classloader: lib (resolved as: /export/home/jenkins/workspace/Lucene-Solr-trunk-Solaris/solr/build/solr-solrj/test/J1/../../../../../../../../../../export/home/jenkins/workspace/Lucene-Solr-trunk-Solaris/solr/build/solr-solrj/test/J1/temp/solr.client.solrj.io.sql.JdbcTest_E59B57130FBDAD02-001/control-001/lib).
[junit4] 2> 139012 INFO (TEST-JdbcTest.doTest-seed#[E59B57130FBDAD02]) [ ] o.a.s.h.c.HttpShardHandlerFactory created with socketTimeout : 90000,urlScheme : ,connTimeout : 15000,maxConnectionsPerHost : 20,maxConnections : 10000,corePoolSize : 0,maximumPoolSize : 2147483647,maxThreadIdleTime : 5,sizeOfQueue : -1,fairnessPolicy : false,useRetries : false,
[junit4] 2> 139013 INFO (TEST-JdbcTest.doTest-seed#[E59B57130FBDAD02]) [ ] o.a.s.u.UpdateShardHandler Creating UpdateShardHandler HTTP client with params: socketTimeout=340000&connTimeout=45000&retry=true
[junit4] 2> 139014 INFO (TEST-JdbcTest.doTest-seed#[E59B57130FBDAD02]) [ ] o.a.s.l.LogWatcher SLF4J impl is org.slf4j.impl.Log4jLoggerFactory
[junit4] 2> 139014 INFO (TEST-JdbcTest.doTest-seed#[E59B57130FBDAD02]) [ ] o.a.s.l.LogWatcher Registering Log Listener [Log4j (org.slf4j.impl.Log4jLoggerFactory)]
[junit4] 2> 139014 INFO (TEST-JdbcTest.doTest-seed#[E59B57130FBDAD02]) [ ] o.a.s.c.ZkContainer Zookeeper client=127.0.0.1:55479/solr
[junit4] 2> 139029 INFO (TEST-JdbcTest.doTest-seed#[E59B57130FBDAD02]) [ ] o.a.s.c.ZkController zkHost includes chroot
[junit4] 2> 139029 INFO (TEST-JdbcTest.doTest-seed#[E59B57130FBDAD02]) [ ] o.a.s.c.c.SolrZkClient Using default ZkCredentialsProvider
[junit4] 2> 139029 INFO (TEST-JdbcTest.doTest-seed#[E59B57130FBDAD02]) [ ] o.a.s.c.c.ConnectionManager Waiting for client to connect to ZooKeeper
[junit4] 2> 139033 INFO (zkCallback-41-thread-1) [ ] o.a.s.c.c.ConnectionManager Watcher org.apache.solr.common.cloud.ConnectionManager@7cf17349 name:ZooKeeperConnection Watcher:127.0.0.1:55479 got event WatchedEvent state:SyncConnected type:None path:null path:null type:None
[junit4] 2> 139033 INFO (TEST-JdbcTest.doTest-seed#[E59B57130FBDAD02]) [ ] o.a.s.c.c.ConnectionManager Client is connected to ZooKeeper
[junit4] 2> 139034 INFO (TEST-JdbcTest.doTest-seed#[E59B57130FBDAD02]) [ ] o.a.s.c.c.SolrZkClient Using default ZkACLProvider
[junit4] 2> 139043 INFO (TEST-JdbcTest.doTest-seed#[E59B57130FBDAD02]) [n:127.0.0.1:65274_ ] o.a.s.c.c.ConnectionManager Waiting for client to connect to ZooKeeper
[junit4] 2> 139046 INFO (zkCallback-42-thread-1-processing-n:127.0.0.1:65274_) [n:127.0.0.1:65274_ ] o.a.s.c.c.ConnectionManager Watcher org.apache.solr.common.cloud.ConnectionManager@709dc49c name:ZooKeeperConnection Watcher:127.0.0.1:55479/solr got event WatchedEvent state:SyncConnected type:None path:null path:null type:None
[junit4] 2> 139046 INFO (TEST-JdbcTest.doTest-seed#[E59B57130FBDAD02]) [n:127.0.0.1:65274_ ] o.a.s.c.c.ConnectionManager Client is connected to ZooKeeper
[junit4] 2> 139057 INFO (TEST-JdbcTest.doTest-seed#[E59B57130FBDAD02]) [n:127.0.0.1:65274_ ] o.a.s.c.c.SolrZkClient makePath: /overseer/queue
[junit4] 2> 139070 INFO (TEST-JdbcTest.doTest-seed#[E59B57130FBDAD02]) [n:127.0.0.1:65274_ ] o.a.s.c.c.SolrZkClient makePath: /overseer/collection-queue-work
[junit4] 2> 139078 INFO (TEST-JdbcTest.doTest-seed#[E59B57130FBDAD02]) [n:127.0.0.1:65274_ ] o.a.s.c.c.SolrZkClient makePath: /overseer/collection-map-running
[junit4] 2> 139085 INFO (TEST-JdbcTest.doTest-seed#[E59B57130FBDAD02]) [n:127.0.0.1:65274_ ] o.a.s.c.c.SolrZkClient makePath: /overseer/collection-map-completed
[junit4] 2> 139091 INFO (TEST-JdbcTest.doTest-seed#[E59B57130FBDAD02]) [n:127.0.0.1:65274_ ] o.a.s.c.c.SolrZkClient makePath: /overseer/collection-map-failure
[junit4] 2> 139105 INFO (TEST-JdbcTest.doTest-seed#[E59B57130FBDAD02]) [n:127.0.0.1:65274_ ] o.a.s.c.c.SolrZkClient makePath: /live_nodes
[junit4] 2> 139110 INFO (TEST-JdbcTest.doTest-seed#[E59B57130FBDAD02]) [n:127.0.0.1:65274_ ] o.a.s.c.c.SolrZkClient makePath: /aliases.json
[junit4] 2> 139112 INFO (TEST-JdbcTest.doTest-seed#[E59B57130FBDAD02]) [n:127.0.0.1:65274_ ] o.a.s.c.c.SolrZkClient makePath: /clusterstate.json
[junit4] 2> 139115 INFO (TEST-JdbcTest.doTest-seed#[E59B57130FBDAD02]) [n:127.0.0.1:65274_ ] o.a.s.c.c.SolrZkClient makePath: /security.json
[junit4] 2> 139117 INFO (TEST-JdbcTest.doTest-seed#[E59B57130FBDAD02]) [n:127.0.0.1:65274_ ] o.a.s.c.ZkController Register node as live in ZooKeeper:/live_nodes/127.0.0.1:65274_
[junit4] 2> 139120 INFO (TEST-JdbcTest.doTest-seed#[E59B57130FBDAD02]) [n:127.0.0.1:65274_ ] o.a.s.c.c.SolrZkClient makePath: /live_nodes/127.0.0.1:65274_
[junit4] 2> 139128 INFO (TEST-JdbcTest.doTest-seed#[E59B57130FBDAD02]) [n:127.0.0.1:65274_ ] o.a.s.c.c.SolrZkClient makePath: /overseer_elect
[junit4] 2> 139131 INFO (TEST-JdbcTest.doTest-seed#[E59B57130FBDAD02]) [n:127.0.0.1:65274_ ] o.a.s.c.c.SolrZkClient makePath: /overseer_elect/election
[junit4] 2> 139136 INFO (TEST-JdbcTest.doTest-seed#[E59B57130FBDAD02]) [n:127.0.0.1:65274_ ] o.a.s.c.Overseer Overseer (id=null) closing
[junit4] 2> 139138 INFO (TEST-JdbcTest.doTest-seed#[E59B57130FBDAD02]) [n:127.0.0.1:65274_ ] o.a.s.c.LeaderElector Joined leadership election with path: /overseer_elect/election/94548388662214660-127.0.0.1:65274_-n_0000000000
[junit4] 2> 139142 INFO (TEST-JdbcTest.doTest-seed#[E59B57130FBDAD02]) [n:127.0.0.1:65274_ ] o.a.s.c.OverseerElectionContext I am going to be the leader 127.0.0.1:65274_
[junit4] 2> 139142 INFO (TEST-JdbcTest.doTest-seed#[E59B57130FBDAD02]) [n:127.0.0.1:65274_ ] o.a.s.c.c.SolrZkClient makePath: /overseer_elect/leader
[junit4] 2> 139145 INFO (TEST-JdbcTest.doTest-seed#[E59B57130FBDAD02]) [n:127.0.0.1:65274_ ] o.a.s.c.Overseer Overseer (id=94548388662214660-127.0.0.1:65274_-n_0000000000) starting
[junit4] 2> 139153 INFO (TEST-JdbcTest.doTest-seed#[E59B57130FBDAD02]) [n:127.0.0.1:65274_ ] o.a.s.c.c.SolrZkClient makePath: /overseer/queue-work
[junit4] 2> 139192 INFO (TEST-JdbcTest.doTest-seed#[E59B57130FBDAD02]) [n:127.0.0.1:65274_ ] o.a.s.c.OverseerAutoReplicaFailoverThread Starting OverseerAutoReplicaFailoverThread autoReplicaFailoverWorkLoopDelay=10000 autoReplicaFailoverWaitAfterExpiration=30000 autoReplicaFailoverBadNodeExpiration=60000
[junit4] 2> 139198 INFO (TEST-JdbcTest.doTest-seed#[E59B57130FBDAD02]) [n:127.0.0.1:65274_ ] o.a.s.c.c.ZkStateReader Updating cluster state from ZooKeeper...
[junit4] 2> 139198 INFO (OverseerCollectionConfigSetProcessor-94548388662214660-127.0.0.1:65274_-n_0000000000) [n:127.0.0.1:65274_ ] o.a.s.c.OverseerTaskProcessor Process current queue of overseer operations
[junit4] 2> 139204 INFO (OverseerStateUpdate-94548388662214660-127.0.0.1:65274_-n_0000000000) [n:127.0.0.1:65274_ ] o.a.s.c.Overseer Starting to work on the main queue
[junit4] 2> 139245 INFO (TEST-JdbcTest.doTest-seed#[E59B57130FBDAD02]) [n:127.0.0.1:65274_ ] o.a.s.c.CoreContainer Security conf doesn't exist. Skipping setup for authorization module.
[junit4] 2> 139245 INFO (TEST-JdbcTest.doTest-seed#[E59B57130FBDAD02]) [n:127.0.0.1:65274_ ] o.a.s.c.CoreContainer No authentication plugin used.
[junit4] 2> 139247 INFO (TEST-JdbcTest.doTest-seed#[E59B57130FBDAD02]) [n:127.0.0.1:65274_ ] o.a.s.c.CoresLocator Looking for core definitions underneath /export/home/jenkins/workspace/Lucene-Solr-trunk-Solaris/solr/build/solr-solrj/test/J1/../../../../../../../../../../export/home/jenkins/workspace/Lucene-Solr-trunk-Solaris/solr/build/solr-solrj/test/J1/temp/solr.client.solrj.io.sql.JdbcTest_E59B57130FBDAD02-001/control-001/cores
[junit4] 2> 139251 INFO (TEST-JdbcTest.doTest-seed#[E59B57130FBDAD02]) [n:127.0.0.1:65274_ ] o.a.s.c.SolrCore Created CoreDescriptor: {name=collection1, config=solrconfig.xml, transient=false, schema=schema.xml, loadOnStartup=true, configSetProperties=configsetprops.json, instanceDir=/export/home/jenkins/workspace/Lucene-Solr-trunk-Solaris/solr/build/solr-solrj/test/J1/../../../../../../../../../../export/home/jenkins/workspace/Lucene-Solr-trunk-Solaris/solr/build/solr-solrj/test/J1/temp/solr.client.solrj.io.sql.JdbcTest_E59B57130FBDAD02-001/control-001/cores/collection1, collection=control_collection, absoluteInstDir=/export/home/jenkins/workspace/Lucene-Solr-trunk-Solaris/solr/build/solr-solrj/test/J1/../../../../../../../../../../export/home/jenkins/workspace/Lucene-Solr-trunk-Solaris/solr/build/solr-solrj/test/J1/temp/solr.client.solrj.io.sql.JdbcTest_E59B57130FBDAD02-001/control-001/cores/collection1/, coreNodeName=, dataDir=data/, shard=}
[junit4] 2> 139251 INFO (TEST-JdbcTest.doTest-seed#[E59B57130FBDAD02]) [n:127.0.0.1:65274_ ] o.a.s.c.CoresLocator Found core collection1 in /export/home/jenkins/workspace/Lucene-Solr-trunk-Solaris/solr/build/solr-solrj/test/J1/../../../../../../../../../../export/home/jenkins/workspace/Lucene-Solr-trunk-Solaris/solr/build/solr-solrj/test/J1/temp/solr.client.solrj.io.sql.JdbcTest_E59B57130FBDAD02-001/control-001/cores/collection1/
[junit4] 2> 139251 INFO (TEST-JdbcTest.doTest-seed#[E59B57130FBDAD02]) [n:127.0.0.1:65274_ ] o.a.s.c.CoresLocator Found 1 core definitions
[junit4] 2> 139253 INFO (TEST-JdbcTest.doTest-seed#[E59B57130FBDAD02]) [n:127.0.0.1:65274_ ] o.a.s.s.SolrDispatchFilter user.dir=/export/home/jenkins/workspace/Lucene-Solr-trunk-Solaris/solr/build/solr-solrj/test/J1
[junit4] 2> 139253 INFO (TEST-JdbcTest.doTest-seed#[E59B57130FBDAD02]) [n:127.0.0.1:65274_ ] o.a.s.s.SolrDispatchFilter SolrDispatchFilter.init() done
[junit4] 2> 139254 INFO (coreLoadExecutor-319-thread-1-processing-n:127.0.0.1:65274_) [n:127.0.0.1:65274_ c:control_collection x:collection1] o.a.s.c.ZkController publishing state=down
[junit4] 2> 139255 INFO (coreLoadExecutor-319-thread-1-processing-n:127.0.0.1:65274_) [n:127.0.0.1:65274_ c:control_collection x:collection1] o.a.s.c.ZkController numShards not found on descriptor - reading it from system property
[junit4] 2> 139265 INFO (coreLoadExecutor-319-thread-1-processing-n:127.0.0.1:65274_) [n:127.0.0.1:65274_ c:control_collection x:collection1] o.a.s.c.ZkController look for our core node name
[junit4] 2> 139265 INFO (OverseerStateUpdate-94548388662214660-127.0.0.1:65274_-n_0000000000) [n:127.0.0.1:65274_ ] o.a.s.c.Overseer processMessage: queueSize: 1, message = {
[junit4] 2> "core":"collection1",
[junit4] 2> "roles":null,
[junit4] 2> "base_url":"http://127.0.0.1:65274",
[junit4] 2> "node_name":"127.0.0.1:65274_",
[junit4] 2> "numShards":"1",
[junit4] 2> "state":"down",
[junit4] 2> "shard":null,
[junit4] 2> "collection":"control_collection",
[junit4] 2> "operation":"state"} current state version: 0
[junit4] 2> 139276 INFO (OverseerStateUpdate-94548388662214660-127.0.0.1:65274_-n_0000000000) [n:127.0.0.1:65274_ ] o.a.s.c.o.ReplicaMutator Update state numShards=1 message={
[junit4] 2> "core":"collection1",
[junit4] 2> "roles":null,
[junit4] 2> "base_url":"http://127.0.0.1:65274",
[junit4] 2> "node_name":"127.0.0.1:65274_",
[junit4] 2> "numShards":"1",
[junit4] 2> "state":"down",
[junit4] 2> "shard":null,
[junit4] 2> "collection":"control_collection",
[junit4] 2> "operation":"state"}
[junit4] 2> 139278 INFO (OverseerStateUpdate-94548388662214660-127.0.0.1:65274_-n_0000000000) [n:127.0.0.1:65274_ ] o.a.s.c.o.ClusterStateMutator building a new cName: control_collection
[junit4] 2> 139289 INFO (OverseerStateUpdate-94548388662214660-127.0.0.1:65274_-n_0000000000) [n:127.0.0.1:65274_ ] o.a.s.c.o.ReplicaMutator Assigning new node to shard shard=shard1
[junit4] 2> 139296 INFO (zkCallback-42-thread-1-processing-n:127.0.0.1:65274_) [n:127.0.0.1:65274_ ] o.a.s.c.c.ZkStateReader A cluster state change: WatchedEvent state:SyncConnected type:NodeDataChanged path:/clusterstate.json, has occurred - updating... (live nodes size: 1)
[junit4] 2> 140266 INFO (coreLoadExecutor-319-thread-1-processing-n:127.0.0.1:65274_) [n:127.0.0.1:65274_ c:control_collection x:collection1] o.a.s.c.ZkController waiting to find shard id in clusterstate for collection1
[junit4] 2> 140266 INFO (coreLoadExecutor-319-thread-1-processing-n:127.0.0.1:65274_) [n:127.0.0.1:65274_ c:control_collection x:collection1] o.a.s.c.ZkController Check for collection zkNode:control_collection
[junit4] 2> 140267 INFO (coreLoadExecutor-319-thread-1-processing-n:127.0.0.1:65274_) [n:127.0.0.1:65274_ c:control_collection x:collection1] o.a.s.c.ZkController Collection zkNode exists
[junit4] 2> 140267 INFO (coreLoadExecutor-319-thread-1-processing-n:127.0.0.1:65274_) [n:127.0.0.1:65274_ c:control_collection x:collection1] o.a.s.c.c.ZkStateReader Load collection config from:/collections/control_collection
[junit4] 2> 140269 INFO (coreLoadExecutor-319-thread-1-processing-n:127.0.0.1:65274_) [n:127.0.0.1:65274_ c:control_collection x:collection1] o.a.s.c.c.ZkStateReader path=/collections/control_collection configName=conf1 specified config exists in ZooKeeper
[junit4] 2> 140269 INFO (coreLoadExecutor-319-thread-1-processing-n:127.0.0.1:65274_) [n:127.0.0.1:65274_ c:control_collection x:collection1] o.a.s.c.SolrResourceLoader new SolrResourceLoader for directory: '/export/home/jenkins/workspace/Lucene-Solr-trunk-Solaris/solr/build/solr-solrj/test/J1/../../../../../../../../../../export/home/jenkins/workspace/Lucene-Solr-trunk-Solaris/solr/build/solr-solrj/test/J1/temp/solr.client.solrj.io.sql.JdbcTest_E59B57130FBDAD02-001/control-001/cores/collection1/'
[junit4] 2> 140289 INFO (coreLoadExecutor-319-thread-1-processing-n:127.0.0.1:65274_) [n:127.0.0.1:65274_ c:control_collection x:collection1] o.a.s.c.Config loaded config solrconfig.xml with version 0
[junit4] 2> 140294 INFO (coreLoadExecutor-319-thread-1-processing-n:127.0.0.1:65274_) [n:127.0.0.1:65274_ c:control_collection x:collection1] o.a.s.c.SolrConfig current version of requestparams : -1
[junit4] 2> 140297 INFO (coreLoadExecutor-319-thread-1-processing-n:127.0.0.1:65274_) [n:127.0.0.1:65274_ c:control_collection x:collection1] o.a.s.c.SolrConfig Using Lucene MatchVersion: 6.0.0
[junit4] 2> 140327 INFO (coreLoadExecutor-319-thread-1-processing-n:127.0.0.1:65274_) [n:127.0.0.1:65274_ c:control_collection x:collection1] o.a.s.c.Config Loaded SolrConfig: solrconfig.xml
[junit4] 2> 140329 INFO (coreLoadExecutor-319-thread-1-processing-n:127.0.0.1:65274_) [n:127.0.0.1:65274_ c:control_collection x:collection1] o.a.s.s.IndexSchema Reading Solr Schema from /configs/conf1/schema.xml
[junit4] 2> 140334 INFO (coreLoadExecutor-319-thread-1-processing-n:127.0.0.1:65274_) [n:127.0.0.1:65274_ c:control_collection x:collection1] o.a.s.s.IndexSchema [collection1] Schema name=test
[junit4] 2> 140451 INFO (coreLoadExecutor-319-thread-1-processing-n:127.0.0.1:65274_) [n:127.0.0.1:65274_ c:control_collection x:collection1] o.a.s.s.IndexSchema default search field in schema is text
[junit4] 2> 140451 INFO (coreLoadExecutor-319-thread-1-processing-n:127.0.0.1:65274_) [n:127.0.0.1:65274_ c:control_collection x:collection1] o.a.s.s.IndexSchema unique key field: id
[junit4] 2> 140452 WARN (coreLoadExecutor-319-thread-1-processing-n:127.0.0.1:65274_) [n:127.0.0.1:65274_ c:control_collection x:collection1] o.a.s.s.IndexSchema Field lowerfilt1and2 is not multivalued and destination for multiple copyFields (2)
[junit4] 2> 140452 WARN (coreLoadExecutor-319-thread-1-processing-n:127.0.0.1:65274_) [n:127.0.0.1:65274_ c:control_collection x:collection1] o.a.s.s.IndexSchema Field text is not multivalued and destination for multiple copyFields (3)
[junit4] 2> 140461 INFO (coreLoadExecutor-319-thread-1-processing-n:127.0.0.1:65274_) [n:127.0.0.1:65274_ c:control_collection x:collection1] o.a.s.c.ConfigSetProperties Did not find ConfigSet properties, assuming default properties: Can't find resource 'configsetprops.json' in classpath or '/configs/conf1', cwd=/export/home/jenkins/workspace/Lucene-Solr-trunk-Solaris/solr/build/solr-solrj/test/J1
[junit4] 2> 140461 INFO (coreLoadExecutor-319-thread-1-processing-n:127.0.0.1:65274_) [n:127.0.0.1:65274_ c:control_collection x:collection1] o.a.s.c.CoreContainer Creating SolrCore 'collection1' using configuration from collection control_collection
[junit4] 2> 140461 INFO (coreLoadExecutor-319-thread-1-processing-n:127.0.0.1:65274_) [n:127.0.0.1:65274_ c:control_collection s:shard1 r:core_node1 x:collection1] o.a.s.c.SolrCore org.apache.solr.core.MockDirectoryFactory
[junit4] 2> 140462 INFO (coreLoadExecutor-319-thread-1-processing-n:127.0.0.1:65274_) [n:127.0.0.1:65274_ c:control_collection s:shard1 r:core_node1 x:collection1] o.a.s.c.SolrCore [[collection1] ] Opening new SolrCore at [/export/home/jenkins/workspace/Lucene-Solr-trunk-Solaris/solr/build/solr-solrj/test/J1/../../../../../../../../../../export/home/jenkins/workspace/Lucene-Solr-trunk-Solaris/solr/build/solr-solrj/test/J1/temp/solr.client.solrj.io.sql.JdbcTest_E59B57130FBDAD02-001/control-001/cores/collection1/], dataDir=[null]
[junit4] 2> 140462 INFO (coreLoadExecutor-319-thread-1-processing-n:127.0.0.1:65274_) [n:127.0.0.1:65274_ c:control_collection s:shard1 r:core_node1 x:collection1] o.a.s.c.SolrCore JMX monitoring not detected for core: collection1
[junit4] 2> 140463 INFO (coreLoadExecutor-319-thread-1-processing-n:127.0.0.1:65274_) [n:127.0.0.1:65274_ c:control_collection s:shard1 r:core_node1 x:collection1] o.a.s.c.CachingDirectoryFactory return new directory for /export/home/jenkins/workspace/Lucene-Solr-trunk-Solaris/solr/build/solr-solrj/test/J1/../../../../../../../../../../export/home/jenkins/workspace/Lucene-Solr-trunk-Solaris/solr/build/solr-solrj/test/J1/temp/solr.client.solrj.io.sql.JdbcTest_E59B57130FBDAD02-001/control-001/cores/collection1/data
[junit4] 2> 140463 INFO (coreLoadExecutor-319-thread-1-processing-n:127.0.0.1:65274_) [n:127.0.0.1:65274_ c:control_collection s:shard1 r:core_node1 x:collection1] o.a.s.c.SolrCore New index directory detected: old=null new=/export/home/jenkins/workspace/Lucene-Solr-trunk-Solaris/solr/build/solr-solrj/test/J1/../../../../../../../../../../export/home/jenkins/workspace/Lucene-Solr-trunk-Solaris/solr/build/solr-solrj/test/J1/temp/solr.client.solrj.io.sql.JdbcTest_E59B57130FBDAD02-001/control-001/cores/collection1/data/index/
[junit4] 2> 140463 WARN (coreLoadExecutor-319-thread-1-processing-n:127.0.0.1:65274_) [n:127.0.0.1:65274_ c:control_collection s:shard1 r:core_node1 x:collection1] o.a.s.c.SolrCore [collection1] Solr index directory '/export/home/jenkins/workspace/Lucene-Solr-trunk-Solaris/solr/build/solr-solrj/test/J1/../../../../../../../../../../export/home/jenkins/workspace/Lucene-Solr-trunk-Solaris/solr/build/solr-solrj/test/J1/temp/solr.client.solrj.io.sql.JdbcTest_E59B57130FBDAD02-001/control-001/cores/collection1/data/index' doesn't exist. Creating new index...
[junit4] 2> 140463 INFO (coreLoadExecutor-319-thread-1-processing-n:127.0.0.1:65274_) [n:127.0.0.1:65274_ c:control_collection s:shard1 r:core_node1 x:collection1] o.a.s.c.CachingDirectoryFactory return new directory for /export/home/jenkins/workspace/Lucene-Solr-trunk-Solaris/solr/build/solr-solrj/test/J1/../../../../../../../../../../export/home/jenkins/workspace/Lucene-Solr-trunk-Solaris/solr/build/solr-solrj/test/J1/temp/solr.client.solrj.io.sql.JdbcTest_E59B57130FBDAD02-001/control-001/cores/collection1/data/index
[junit4] 2> 140464 INFO (coreLoadExecutor-319-thread-1-processing-n:127.0.0.1:65274_) [n:127.0.0.1:65274_ c:control_collection s:shard1 r:core_node1 x:collection1] o.a.s.c.SolrCore SolrDeletionPolicy.onCommit: commits: num=1
[junit4] 2> commit{dir=MockDirectoryWrapper(RAMDirectory@2867c72d lockFactory=org.apache.lucene.store.SingleInstanceLockFactory@59b7c1cf),segFN=segments_1,generation=1}
[junit4] 2> 140464 INFO (coreLoadExecutor-319-thread-1-processing-n:127.0.0.1:65274_) [n:127.0.0.1:65274_ c:control_collection s:shard1 r:core_node1 x:collection1] o.a.s.c.SolrCore newest commit generation = 1
[junit4] 2> 140466 INFO (OldIndexDirectoryCleanupThreadForCore-collection1) [n:127.0.0.1:65274_ c:control_collection s:shard1 r:core_node1 x:collection1] o.a.s.c.SolrCore Looking for old index directories to cleanup for core collection1 in /export/home/jenkins/workspace/Lucene-Solr-trunk-Solaris/solr/build/solr-solrj/test/J1/../../../../../../../../../../export/home/jenkins/workspace/Lucene-Solr-trunk-Solaris/solr/build/solr-solrj/test/J1/temp/solr.client.solrj.io.sql.JdbcTest_E59B57130FBDAD02-001/control-001/cores/collection1/data/
[junit4] 2> 140466 WARN (OldIndexDirectoryCleanupThreadForCore-collection1) [n:127.0.0.1:65274_ c:control_collection s:shard1 r:core_node1 x:collection1] o.a.s.c.DirectoryFactory /export/home/jenkins/workspace/Lucene-Solr-trunk-Solaris/solr/build/solr-solrj/test/J1/../../../../../../../../../../export/home/jenkins/workspace/Lucene-Solr-trunk-Solaris/solr/build/solr-solrj/test/J1/temp/solr.client.solrj.io.sql.JdbcTest_E59B57130FBDAD02-001/control-001/cores/collection1/data/ does not point to a valid data directory; skipping clean-up of old index directories.
[junit4] 2> 140470 INFO (coreLoadExecutor-319-thread-1-processing-n:127.0.0.1:65274_) [n:127.0.0.1:65274_ c:control_collection s:shard1 r:core_node1 x:collection1] o.a.s.c.SolrCore no updateRequestProcessorChain defined as default, creating implicit default
[junit4] 2> 140474 INFO (coreLoadExecutor-319-thread-1-processing-n:127.0.0.1:65274_) [n:127.0.0.1:65274_ c:control_collection s:shard1 r:core_node1 x:collection1] o.a.s.h.l.XMLLoader xsltCacheLifetimeSeconds=60
[junit4] 2> 140475 INFO (coreLoadExecutor-319-thread-1-processing-n:127.0.0.1:65274_) [n:127.0.0.1:65274_ c:control_collection s:shard1 r:core_node1 x:collection1] o.a.s.h.l.XMLLoader xsltCacheLifetimeSeconds=60
[junit4] 2> 140476 INFO (coreLoadExecutor-319-thread-1-processing-n:127.0.0.1:65274_) [n:127.0.0.1:65274_ c:control_collection s:shard1 r:core_node1 x:collection1] o.a.s.h.l.XMLLoader xsltCacheLifetimeSeconds=60
[junit4] 2> 140477 INFO (coreLoadExecutor-319-thread-1-processing-n:127.0.0.1:65274_) [n:127.0.0.1:65274_ c:control_collection s:shard1 r:core_node1 x:collection1] o.a.s.h.l.XMLLoader xsltCacheLifetimeSeconds=60
[junit4] 2> 140477 INFO (coreLoadExecutor-319-thread-1-processing-n:127.0.0.1:65274_) [n:127.0.0.1:65274_ c:control_collection s:shard1 r:core_node1 x:collection1] o.a.s.c.PluginBag requestHandler : '/replication' created with startup=lazy
[junit4] 2> 140496 WARN (coreLoadExecutor-319-thread-1-processing-n:127.0.0.1:65274_) [n:127.0.0.1:65274_ c:control_collection s:shard1 r:core_node1 x:collection1] o.a.s.c.SolrResourceLoader Solr loaded a deprecated plugin/analysis class [org.apache.solr.handler.admin.AdminHandlers]. Please consult documentation how to replace it accordingly.
[junit4] 2> 140497 WARN (coreLoadExecutor-319-thread-1-processing-n:127.0.0.1:65274_) [n:127.0.0.1:65274_ c:control_collection s:shard1 r:core_node1 x:collection1] o.a.s.c.SolrResourceLoader Solr loaded a deprecated plugin/analysis class [org.apache.solr.handler.admin.AdminHandlers]. Please consult documentation how to replace it accordingly.
[junit4] 2> 140497 INFO (coreLoadExecutor-319-thread-1-processing-n:127.0.0.1:65274_) [n:127.0.0.1:65274_ c:control_collection s:shard1 r:core_node1 x:collection1] o.a.s.c.RequestHandlers Registered paths: /admin/mbeans,standard,,/update/json/docs,/admin/luke,/export,/get,/admin/properties,/update/json,/admin/threads,/update/csv,/sql,/admin/segments,/admin/system,/replication,/config,/stream,/schema,/admin/plugins,/admin/logging,/admin,/admin/ping,/update,/admin/file
[junit4] 2> 140497 INFO (coreLoadExecutor-319-thread-1-processing-n:127.0.0.1:65274_) [n:127.0.0.1:65274_ c:control_collection s:shard1 r:core_node1 x:collection1] o.a.s.c.SolrCore Using default statsCache cache: org.apache.solr.search.stats.LocalStatsCache
[junit4] 2> 140498 INFO (coreLoadExecutor-319-thread-1-processing-n:127.0.0.1:65274_) [n:127.0.0.1:65274_ c:control_collection s:shard1 r:core_node1 x:collection1] o.a.s.u.UpdateHandler Using UpdateLog implementation: org.apache.solr.update.UpdateLog
[junit4] 2> 140498 INFO (coreLoadExecutor-319-thread-1-processing-n:127.0.0.1:65274_) [n:127.0.0.1:65274_ c:control_collection s:shard1 r:core_node1 x:collection1] o.a.s.u.UpdateLog Initializing UpdateLog: dataDir= defaultSyncLevel=FLUSH numRecordsToKeep=100 maxNumLogsToKeep=10 numVersionBuckets=65536
[junit4] 2> 140499 INFO (coreLoadExecutor-319-thread-1-processing-n:127.0.0.1:65274_) [n:127.0.0.1:65274_ c:control_collection s:shard1 r:core_node1 x:collection1] o.a.s.c.SolrCore Hard AutoCommit: disabled
[junit4] 2> 140500 INFO (coreLoadExecutor-319-thread-1-processing-n:127.0.0.1:65274_) [n:127.0.0.1:65274_ c:control_collection s:shard1 r:core_node1 x:collection1] o.a.s.c.SolrCore Soft AutoCommit: disabled
[junit4] 2> 140500 INFO (coreLoadExecutor-319-thread-1-processing-n:127.0.0.1:65274_) [n:127.0.0.1:65274_ c:control_collection s:shard1 r:core_node1 x:collection1] o.a.s.c.SolrCore SolrDeletionPolicy.onInit: commits: num=1
[junit4] 2> commit{dir=MockDirectoryWrapper(RAMDirectory@2867c72d lockFactory=org.apache.lucene.store.SingleInstanceLockFactory@59b7c1cf),segFN=segments_1,generation=1}
[junit4] 2> 140500 INFO (coreLoadExecutor-319-thread-1-processing-n:127.0.0.1:65274_) [n:127.0.0.1:65274_ c:control_collection s:shard1 r:core_node1 x:collection1] o.a.s.c.SolrCore newest commit generation = 1
[junit4] 2> 140500 INFO (coreLoadExecutor-319-thread-1-processing-n:127.0.0.1:65274_) [n:127.0.0.1:65274_ c:control_collection s:shard1 r:core_node1 x:collection1] o.a.s.s.SolrIndexSearcher Opening Searcher@76a46e4c[collection1] main
[junit4] 2> 140501 INFO (coreLoadExecutor-319-thread-1-processing-n:127.0.0.1:65274_) [n:127.0.0.1:65274_ c:control_collection s:shard1 r:core_node1 x:collection1] o.a.s.c.c.ZkStateReader Load collection config from:/collections/control_collection
[junit4] 2> 140502 INFO (coreLoadExecutor-319-thread-1-processing-n:127.0.0.1:65274_) [n:127.0.0.1:65274_ c:control_collection s:shard1 r:core_node1 x:collection1] o.a.s.c.c.ZkStateReader path=/collections/control_collection configName=conf1 specified config exists in ZooKeeper
[junit4] 2> 140502 INFO (coreLoadExecutor-319-thread-1-processing-n:127.0.0.1:65274_) [n:127.0.0.1:65274_ c:control_collection s:shard1 r:core_node1 x:collection1] o.a.s.r.ManagedResourceStorage Setting up ZooKeeper-based storage for the RestManager with znodeBase: /configs/conf1
[junit4] 2> 140505 INFO (coreLoadExecutor-319-thread-1-processing-n:127.0.0.1:65274_) [n:127.0.0.1:65274_ c:control_collection s:shard1 r:core_node1 x:collection1] o.a.s.r.ManagedResourceStorage Configured ZooKeeperStorageIO with znodeBase: /configs/conf1
[junit4] 2> 140505 INFO (coreLoadExecutor-319-thread-1-processing-n:127.0.0.1:65274_) [n:127.0.0.1:65274_ c:control_collection s:shard1 r:core_node1 x:collection1] o.a.s.r.RestManager Initializing RestManager with initArgs: {}
[junit4] 2> 140505 INFO (coreLoadExecutor-319-thread-1-processing-n:127.0.0.1:65274_) [n:127.0.0.1:65274_ c:control_collection s:shard1 r:core_node1 x:collection1] o.a.s.r.ManagedResourceStorage Reading _rest_managed.json using ZooKeeperStorageIO:path=/configs/conf1
[junit4] 2> 140506 INFO (coreLoadExecutor-319-thread-1-processing-n:127.0.0.1:65274_) [n:127.0.0.1:65274_ c:control_collection s:shard1 r:core_node1 x:collection1] o.a.s.r.ManagedResourceStorage No data found for znode /configs/conf1/_rest_managed.json
[junit4] 2> 140507 INFO (coreLoadExecutor-319-thread-1-processing-n:127.0.0.1:65274_) [n:127.0.0.1:65274_ c:control_collection s:shard1 r:core_node1 x:collection1] o.a.s.r.ManagedResourceStorage Loaded null at path _rest_managed.json using ZooKeeperStorageIO:path=/configs/conf1
[junit4] 2> 140507 INFO (coreLoadExecutor-319-thread-1-processing-n:127.0.0.1:65274_) [n:127.0.0.1:65274_ c:control_collection s:shard1 r:core_node1 x:collection1] o.a.s.r.RestManager Initializing 0 registered ManagedResources
[junit4] 2> 140511 WARN (coreLoadExecutor-319-thread-1-processing-n:127.0.0.1:65274_) [n:127.0.0.1:65274_ c:control_collection s:shard1 r:core_node1 x:collection1] o.a.s.h.a.AdminHandlers <requestHandler name="/admin/"
[junit4] 2> class="solr.admin.AdminHandlers" /> is deprecated . It is not required anymore
[junit4] 2> 140511 INFO (coreLoadExecutor-319-thread-1-processing-n:127.0.0.1:65274_) [n:127.0.0.1:65274_ c:control_collection s:shard1 r:core_node1 x:collection1] o.a.s.u.UpdateLog Looking up max value of version field to seed version buckets
[junit4] 2> 140511 INFO (searcherExecutor-320-thread-1-processing-n:127.0.0.1:65274_ x:collection1 s:shard1 c:control_collection r:core_node1) [n:127.0.0.1:65274_ c:control_collection s:shard1 r:core_node1 x:collection1] o.a.s.c.SolrCore [collection1] Registered new searcher Searcher@76a46e4c[collection1] main{ExitableDirectoryReader(UninvertingDirectoryReader())}
[junit4] 2> 140511 INFO (coreLoadExecutor-319-thread-1-processing-n:127.0.0.1:65274_) [n:127.0.0.1:65274_ c:control_collection s:shard1 r:core_node1 x:collection1] o.a.s.u.VersionInfo Refreshing highest value of _version_ for 65536 version buckets from index
[junit4] 2> 140512 INFO (coreLoadExecutor-319-thread-1-processing-n:127.0.0.1:65274_) [n:127.0.0.1:65274_ c:control_collection s:shard1 r:core_node1 x:collection1] o.a.s.u.VersionInfo No terms found for _version_, cannot seed version bucket highest value from index
[junit4] 2> 140512 INFO (coreLoadExecutor-319-thread-1-processing-n:127.0.0.1:65274_) [n:127.0.0.1:65274_ c:control_collection s:shard1 r:core_node1 x:collection1] o.a.s.u.UpdateLog Could not find max version in index or recent updates, using new clock 1512774222723678208
[junit4] 2> 140514 INFO (coreLoadExecutor-319-thread-1-processing-n:127.0.0.1:65274_) [n:127.0.0.1:65274_ c:control_collection s:shard1 r:core_node1 x:collection1] o.a.s.u.UpdateLog Took 2.0ms to seed version buckets with highest version 1512774222723678208
[junit4] 2> 140516 INFO (coreLoadExecutor-319-thread-1-processing-n:127.0.0.1:65274_) [n:127.0.0.1:65274_ c:control_collection s:shard1 r:core_node1 x:collection1] o.a.s.c.ZkController watch zkdir /configs/conf1
[junit4] 2> 140520 INFO (coreLoadExecutor-319-thread-1-processing-n:127.0.0.1:65274_) [n:127.0.0.1:65274_ c:control_collection s:shard1 r:core_node1 x:collection1] o.a.s.c.CoreContainer registering core: collection1
[junit4] 2> 140524 INFO (coreZkRegister-313-thread-1-processing-n:127.0.0.1:65274_ x:collection1 s:shard1 c:control_collection r:core_node1) [n:127.0.0.1:65274_ c:control_collection s:shard1 r:core_node1 x:collection1] o.a.s.c.ZkController Register replica - core:collection1 address:http://127.0.0.1:65274 collection:control_collection shard:shard1
[junit4] 2> 140534 INFO (coreZkRegister-313-thread-1-processing-n:127.0.0.1:65274_ x:collection1 s:shard1 c:control_collection r:core_node1) [n:127.0.0.1:65274_ c:control_collection s:shard1 r:core_node1 x:collection1] o.a.s.c.c.SolrZkClient makePath: /collections/control_collection/leader_elect/shard1/election
[junit4] 2> 140544 INFO (coreZkRegister-313-thread-1-processing-n:127.0.0.1:65274_ x:collection1 s:shard1 c:control_collection r:core_node1) [n:127.0.0.1:65274_ c:control_collection s:shard1 r:core_node1 x:collection1] o.a.s.c.LeaderElector Joined leadership election with path: /collections/control_collection/leader_elect/shard1/election/94548388662214660-core_node1-n_0000000000
[junit4] 2> 140545 INFO (coreZkRegister-313-thread-1-processing-n:127.0.0.1:65274_ x:collection1 s:shard1 c:control_collection r:core_node1) [n:127.0.0.1:65274_ c:control_collection s:shard1 r:core_node1 x:collection1] o.a.s.c.ShardLeaderElectionContext Running the leader process for shard shard1
[junit4] 2> 140550 INFO (coreZkRegister-313-thread-1-processing-n:127.0.0.1:65274_ x:collection1 s:shard1 c:control_collection r:core_node1) [n:127.0.0.1:65274_ c:control_collection s:shard1 r:core_node1 x:collection1] o.a.s.c.ShardLeaderElectionContext Enough replicas found to continue.
[junit4] 2> 140551 INFO (coreZkRegister-313-thread-1-processing-n:127.0.0.1:65274_ x:collection1 s:shard1 c:control_collection r:core_node1) [n:127.0.0.1:65274_ c:control_collection s:shard1 r:core_node1 x:collection1] o.a.s.c.ShardLeaderElectionContext I may be the new leader - try and sync
[junit4] 2> 140551 INFO (OverseerStateUpdate-94548388662214660-127.0.0.1:65274_-n_0000000000) [n:127.0.0.1:65274_ ] o.a.s.c.Overseer processMessage: queueSize: 1, message = {
[junit4] 2> "operation":"leader",
[junit4] 2> "shard":"shard1",
[junit4] 2> "collection":"control_collection"} current state version: 1
[junit4] 2> 140553 INFO (coreZkRegister-313-thread-1-processing-n:127.0.0.1:65274_ x:collection1 s:shard1 c:control_collection r:core_node1) [n:127.0.0.1:65274_ c:control_collection s:shard1 r:core_node1 x:collection1] o.a.s.c.SyncStrategy Sync replicas to http://127.0.0.1:65274/collection1/
[junit4] 2> 140553 INFO (coreZkRegister-313-thread-1-processing-n:127.0.0.1:65274_ x:collection1 s:shard1 c:control_collection r:core_node1) [n:127.0.0.1:65274_ c:control_collection s:shard1 r:core_node1 x:collection1] o.a.s.c.SyncStrategy Sync Success - now sync replicas to me
[junit4] 2> 140553 INFO (coreZkRegister-313-thread-1-processing-n:127.0.0.1:65274_ x:collection1 s:shard1 c:control_collection r:core_node1) [n:127.0.0.1:65274_ c:control_collection s:shard1 r:core_node1 x:collection1] o.a.s.c.SyncStrategy http://127.0.0.1:65274/collection1/ has no replicas
[junit4] 2> 140554 INFO (coreZkRegister-313-thread-1-processing-n:127.0.0.1:65274_ x:collection1 s:shard1 c:control_collection r:core_node1) [n:127.0.0.1:65274_ c:control_collection s:shard1 r:core_node1 x:collection1] o.a.s.c.ShardLeaderElectionContext I am the new leader: http://127.0.0.1:65274/collection1/ shard1
[junit4] 2> 140561 INFO (coreZkRegister-313-thread-1-processing-n:127.0.0.1:65274_ x:collection1 s:shard1 c:control_collection r:core_node1) [n:127.0.0.1:65274_ c:control_collection s:shard1 r:core_node1 x:collection1] o.a.s.c.c.SolrZkClient makePath: /collections/control_collection/leaders/shard1
[junit4] 2> 140572 INFO (coreZkRegister-313-thread-1-processing-n:127.0.0.1:65274_ x:collection1 s:shard1 c:control_collection r:core_node1) [n:127.0.0.1:65274_ c:control_collection s:shard1 r:core_node1 x:collection1] o.a.s.c.ShardLeaderElectionContextBase Creating leader registration node
[junit4] 2> 140599 INFO (OverseerStateUpdate-94548388662214660-127.0.0.1:65274_-n_0000000000) [n:127.0.0.1:65274_ ] o.a.s.c.Overseer processMessage: queueSize: 1, message = {
[junit4] 2> "operation":"leader",
[junit4] 2> "shard":"shard1",
[junit4] 2> "collection":"control_collection",
[junit4] 2> "base_url":"http://127.0.0.1:65274",
[junit4] 2> "core":"collection1",
[junit4] 2> "state":"active"} current state version: 1
[junit4] 2> 140706 INFO (zkCallback-42-thread-1-processing-n:127.0.0.1:65274_) [n:127.0.0.1:65274_ ] o.a.s.c.c.ZkStateReader A cluster state change: WatchedEvent state:SyncConnected type:NodeDataChanged path:/clusterstate.json, has occurred - updating... (live nodes size: 1)
[junit4] 2> 140753 INFO (coreZkRegister-313-thread-1-processing-n:127.0.0.1:65274_ x:collection1 s:shard1 c:control_collection r:core_node1) [n:127.0.0.1:65274_ c:control_collection s:shard1 r:core_node1 x:collection1] o.a.s.c.ZkController We are http://127.0.0.1:65274/collection1/ and leader is http://127.0.0.1:65274/collection1/
[junit4] 2> 140753 INFO (coreZkRegister-313-thread-1-processing-n:127.0.0.1:65274_ x:collection1 s:shard1 c:control_collection r:core_node1) [n:127.0.0.1:65274_ c:control_collection s:shard1 r:core_node1 x:collection1] o.a.s.c.ZkController No LogReplay needed for core=collection1 baseURL=http://127.0.0.1:65274
[junit4] 2> 140753 INFO (coreZkRegister-313-thread-1-processing-n:127.0.0.1:65274_ x:collection1 s:shard1 c:control_collection r:core_node1) [n:127.0.0.1:65274_ c:control_collection s:shard1 r:core_node1 x:collection1] o.a.s.c.ZkController I am the leader, no recovery necessary
[junit4] 2> 140753 INFO (coreZkRegister-313-thread-1-processing-n:127.0.0.1:65274_ x:collection1 s:shard1 c:control_collection r:core_node1) [n:127.0.0.1:65274_ c:control_collection s:shard1 r:core_node1 x:collection1] o.a.s.c.ZkController publishing state=active
[junit4] 2> 140753 INFO (coreZkRegister-313-thread-1-processing-n:127.0.0.1:65274_ x:collection1 s:shard1 c:control_collection r:core_node1) [n:127.0.0.1:65274_ c:control_collection s:shard1 r:core_node1 x:collection1] o.a.s.c.ZkController numShards not found on descriptor - reading it from system property
[junit4] 2> 140758 INFO (OverseerStateUpdate-94548388662214660-127.0.0.1:65274_-n_0000000000) [n:127.0.0.1:65274_ ] o.a.s.c.Overseer processMessage: queueSize: 1, message = {
[junit4] 2> "core":"collection1",
[junit4] 2> "core_node_name":"core_node1",
[junit4] 2> "roles":null,
[junit4] 2> "base_url":"http://127.0.0.1:65274",
[junit4] 2> "node_name":"127.0.0.1:65274_",
[junit4] 2> "numShards":"1",
[junit4] 2> "state":"active",
[junit4] 2> "shard":"shard1",
[junit4] 2> "collection":"control_collection",
[junit4] 2> "operation":"state"} current state version: 2
[junit4] 2> 140762 INFO (OverseerStateUpdate-94548388662214660-127.0.0.1:65274_-n_0000000000) [n:127.0.0.1:65274_ ] o.a.s.c.o.ReplicaMutator Update state numShards=1 message={
[junit4] 2> "core":"collection1",
[junit4] 2> "core_node_name":"core_node1",
[junit4] 2> "roles":null,
[junit4] 2> "base_url":"http://127.0.0.1:65274",
[junit4] 2> "node_name":"127.0.0.1:65274_",
[junit4] 2> "numShards":"1",
[junit4] 2> "state":"active",
[junit4] 2> "shard":"shard1",
[junit4] 2> "collection":"control_collection",
[junit4] 2> "operation":"state"}
[junit4] 2> 140763 INFO (TEST-JdbcTest.doTest-seed#[E59B57130FBDAD02]) [ ] o.a.s.c.c.SolrZkClient Using default ZkCredentialsProvider
[junit4] 2> 140764 INFO (TEST-JdbcTest.doTest-seed#[E59B57130FBDAD02]) [ ] o.a.s.c.c.ConnectionManager Waiting for client to connect to ZooKeeper
[junit4] 2> 140769 INFO (zkCallback-44-thread-1) [ ] o.a.s.c.c.ConnectionManager Watcher org.apache.solr.common.cloud.ConnectionManager@6a0885f6 name:ZooKeeperConnection Watcher:127.0.0.1:55479/solr got event WatchedEvent state:SyncConnected type:None path:null path:null type:None
[junit4] 2> 140769 INFO (TEST-JdbcTest.doTest-seed#[E59B57130FBDAD02]) [ ] o.a.s.c.c.ConnectionManager Client is connected to ZooKeeper
[junit4] 2> 140770 INFO (TEST-JdbcTest.doTest-seed#[E59B57130FBDAD02]) [ ] o.a.s.c.c.SolrZkClient Using default ZkACLProvider
[junit4] 2> 140770 INFO (TEST-JdbcTest.doTest-seed#[E59B57130FBDAD02]) [ ] o.a.s.c.c.ZkStateReader Updating cluster state from ZooKeeper...
[junit4] 2> 140778 INFO (TEST-JdbcTest.doTest-seed#[E59B57130FBDAD02]) [ ] o.a.s.c.ChaosMonkey monkey: init - expire sessions:false cause connection loss:false
[junit4] 2> 140778 INFO (TEST-JdbcTest.doTest-seed#[E59B57130FBDAD02]) [ ] o.a.s.c.AbstractFullDistribZkTestBase Creating collection1 with stateFormat=2
[junit4] 2> 140778 INFO (TEST-JdbcTest.doTest-seed#[E59B57130FBDAD02]) [ ] o.a.s.c.c.SolrZkClient Using default ZkCredentialsProvider
[junit4] 2> 140778 INFO (TEST-JdbcTest.doTest-seed#[E59B57130FBDAD02]) [ ] o.a.s.c.c.ConnectionManager Waiting for client to connect to ZooKeeper
[junit4] 2> 140782 INFO (zkCallback-45-thread-1) [ ] o.a.s.c.c.ConnectionManager Watcher org.apache.solr.common.cloud.ConnectionManager@b8ce712 name:ZooKeeperConnection Watcher:127.0.0.1:55479/solr got event WatchedEvent state:SyncConnected type:None path:null path:null type:None
[junit4] 2> 140782 INFO (TEST-JdbcTest.doTest-seed#[E59B57130FBDAD02]) [ ] o.a.s.c.c.ConnectionManager Client is connected to ZooKeeper
[junit4] 2> 140782 INFO (TEST-JdbcTest.doTest-seed#[E59B57130FBDAD02]) [ ] o.a.s.c.c.SolrZkClient Using default ZkACLProvider
[junit4] 2> 140788 WARN (NIOServerCxn.Factory:0.0.0.0/0.0.0.0:0) [ ] o.a.z.s.NIOServerCnxn caught end of stream exception
[junit4] 2> EndOfStreamException: Unable to read additional data from client sessionid 0x14fe742304c0006, likely client has closed socket
[junit4] 2> at org.apache.zookeeper.server.NIOServerCnxn.doIO(NIOServerCnxn.java:228)
[junit4] 2> at org.apache.zookeeper.server.NIOServerCnxnFactory.run(NIOServerCnxnFactory.java:208)
[junit4] 2> at java.lang.Thread.run(Thread.java:745)
[junit4] 2> 140789 INFO (OverseerStateUpdate-94548388662214660-127.0.0.1:65274_-n_0000000000) [n:127.0.0.1:65274_ ] o.a.s.c.Overseer processMessage: queueSize: 1, message = {
[junit4] 2> "operation":"create",
[junit4] 2> "name":"collection1",
[junit4] 2> "numShards":"2",
[junit4] 2> "stateFormat":"2"} current state version: 2
[junit4] 2> 140789 INFO (OverseerStateUpdate-94548388662214660-127.0.0.1:65274_-n_0000000000) [n:127.0.0.1:65274_ ] o.a.s.c.o.ClusterStateMutator building a new cName: collection1
[junit4] 2> 140791 INFO (zkCallback-42-thread-1-processing-n:127.0.0.1:65274_) [n:127.0.0.1:65274_ ] o.a.s.c.c.ZkStateReader A cluster state change: WatchedEvent state:SyncConnected type:NodeDataChanged path:/clusterstate.json, has occurred - updating... (live nodes size: 1)
[junit4] 2> 140791 INFO (zkCallback-44-thread-1) [ ] o.a.s.c.c.ZkStateReader A cluster state change: WatchedEvent state:SyncConnected type:NodeDataChanged path:/clusterstate.json, has occurred - updating... (live nodes size: 1)
[junit4] 2> 140815 INFO (TEST-JdbcTest.doTest-seed#[E59B57130FBDAD02]) [ ] o.a.s.SolrTestCaseJ4 Writing core.properties file to /export/home/jenkins/workspace/Lucene-Solr-trunk-Solaris/solr/build/solr-solrj/test/J1/temp/solr.client.solrj.io.sql.JdbcTest_E59B57130FBDAD02-001/shard-1-001/cores/collection1
[junit4] 2> 140816 INFO (TEST-JdbcTest.doTest-seed#[E59B57130FBDAD02]) [ ] o.a.s.c.AbstractFullDistribZkTestBase create jetty 1 in directory /export/home/jenkins/workspace/Lucene-Solr-trunk-Solaris/solr/build/solr-solrj/test/J1/temp/solr.client.solrj.io.sql.JdbcTest_E59B57130FBDAD02-001/shard-1-001
[junit4] 2> 140817 INFO (TEST-JdbcTest.doTest-seed#[E59B57130FBDAD02]) [ ] o.e.j.s.Server jetty-9.2.13.v20150730
[junit4] 2> 140820 INFO (TEST-JdbcTest.doTest-seed#[E59B57130FBDAD02]) [ ] o.e.j.s.h.ContextHandler Started o.e.j.s.ServletContextHandler@7cda6596{/,null,AVAILABLE}
[junit4] 2> 140821 INFO (TEST-JdbcTest.doTest-seed#[E59B57130FBDAD02]) [ ] o.e.j.s.ServerConnector Started ServerConnector@3f15697{HTTP/1.1}{127.0.0.1:61996}
[junit4] 2> 140821 INFO (TEST-JdbcTest.doTest-seed#[E59B57130FBDAD02]) [ ] o.e.j.s.Server Started @148911ms
[junit4] 2> 140821 INFO (TEST-JdbcTest.doTest-seed#[E59B57130FBDAD02]) [ ] o.a.s.c.s.e.JettySolrRunner Jetty properties: {solr.data.dir=/export/home/jenkins/workspace/Lucene-Solr-trunk-Solaris/solr/build/solr-solrj/test/J1/temp/solr.client.solrj.io.sql.JdbcTest_E59B57130FBDAD02-001/tempDir-001/jetty1, solrconfig=solrconfig.xml, hostContext=/, hostPort=61996, coreRootDirectory=/export/home/jenkins/workspace/Lucene-Solr-trunk-Solaris/solr/build/solr-solrj/test/J1/temp/solr.client.solrj.io.sql.JdbcTest_E59B57130FBDAD02-001/shard-1-001/cores}
[junit4] 2> 140821 INFO (TEST-JdbcTest.doTest-seed#[E59B57130FBDAD02]) [ ] o.a.s.s.SolrDispatchFilter SolrDispatchFilter.init(): sun.misc.Launcher$AppClassLoader@15db9742
[junit4] 2> 140821 INFO (TEST-JdbcTest.doTest-seed#[E59B57130FBDAD02]) [ ] o.a.s.c.SolrResourceLoader new SolrResourceLoader for directory: '/export/home/jenkins/workspace/Lucene-Solr-trunk-Solaris/solr/build/solr-solrj/test/J1/temp/solr.client.solrj.io.sql.JdbcTest_E59B57130FBDAD02-001/shard-1-001/'
[junit4] 2> 140835 INFO (TEST-JdbcTest.doTest-seed#[E59B57130FBDAD02]) [ ] o.a.s.c.c.SolrZkClient Using default ZkCredentialsProvider
[junit4] 2> 140835 INFO (TEST-JdbcTest.doTest-seed#[E59B57130FBDAD02]) [ ] o.a.s.c.c.ConnectionManager Waiting for client to connect to ZooKeeper
[junit4] 2> 140839 INFO (zkCallback-46-thread-1) [ ] o.a.s.c.c.ConnectionManager Watcher org.apache.solr.common.cloud.ConnectionManager@55cfeb82 name:ZooKeeperConnection Watcher:127.0.0.1:55479/solr got event WatchedEvent state:SyncConnected type:None path:null path:null type:None
[junit4] 2> 140839 INFO (TEST-JdbcTest.doTest-seed#[E59B57130FBDAD02]) [ ] o.a.s.c.c.ConnectionManager Client is connected to ZooKeeper
[junit4] 2> 140839 INFO (TEST-JdbcTest.doTest-seed#[E59B57130FBDAD02]) [ ] o.a.s.c.c.SolrZkClient Using default ZkACLProvider
[junit4] 2> 140842 INFO (TEST-JdbcTest.doTest-seed#[E59B57130FBDAD02]) [ ] o.a.s.s.SolrDispatchFilter Loading solr.xml from SolrHome (not found in ZooKeeper)
[junit4] 2> 140842 INFO (TEST-JdbcTest.doTest-seed#[E59B57130FBDAD02]) [ ] o.a.s.c.SolrXmlConfig Loading container configuration from /export/home/jenkins/workspace/Lucene-Solr-trunk-Solaris/solr/build/solr-solrj/test/J1/temp/solr.client.solrj.io.sql.JdbcTest_E59B57130FBDAD02-001/shard-1-001/solr.xml
[junit4] 2> 140847 INFO (TEST-JdbcTest.doTest-seed#[E59B57130FBDAD02]) [ ] o.a.s.c.CoresLocator Config-defined core root directory: /export/home/jenkins/workspace/Lucene-Solr-trunk-Solaris/solr/build/solr-solrj/test/J1/temp/solr.client.solrj.io.sql.JdbcTest_E59B57130FBDAD02-001/shard-1-001/cores
[junit4] 2> 140847 INFO (TEST-JdbcTest.doTest-seed#[E59B57130FBDAD02]) [ ] o.a.s.c.CoreContainer New CoreContainer 1096453240
[junit4] 2> 140847 INFO (TEST-JdbcTest.doTest-seed#[E59B57130FBDAD02]) [ ] o.a.s.c.CoreContainer Loading cores into CoreContainer [instanceDir=/export/home/jenkins/workspace/Lucene-Solr-trunk-Solaris/solr/build/solr-solrj/test/J1/temp/solr.client.solrj.io.sql.JdbcTest_E59B57130FBDAD02-001/shard-1-001/]
[junit4] 2> 140847 INFO (TEST-JdbcTest.doTest-seed#[E59B57130FBDAD02]) [ ] o.a.s.c.CoreContainer loading shared library: /export/home/jenkins/workspace/Lucene-Solr-trunk-Solaris/solr/build/solr-solrj/test/J1/temp/solr.client.solrj.io.sql.JdbcTest_E59B57130FBDAD02-001/shard-1-001/lib
[junit4] 2> 140848 WARN (TEST-JdbcTest.doTest-seed#[E59B57130FBDAD02]) [ ] o.a.s.c.SolrResourceLoader Can't find (or read) directory to add to classloader: lib (resolved as: /export/home/jenkins/workspace/Lucene-Solr-trunk-Solaris/solr/build/solr-solrj/test/J1/temp/solr.client.solrj.io.sql.JdbcTest_E59B57130FBDAD02-001/shard-1-001/lib).
[junit4] 2> 140855 INFO (TEST-JdbcTest.doTest-seed#[E59B57130FBDAD02]) [ ] o.a.s.h.c.HttpShardHandlerFactory created with socketTimeout : 90000,urlScheme : ,connTimeout : 15000,maxConnectionsPerHost : 20,maxConnections : 10000,corePoolSize : 0,maximumPoolSize : 2147483647,maxThreadIdleTime : 5,sizeOfQueue : -1,fairnessPolicy : false,useRetries : false,
[junit4] 2> 140855 INFO (TEST-JdbcTest.doTest-seed#[E59B57130FBDAD02]) [ ] o.a.s.u.UpdateShardHandler Creating UpdateShardHandler HTTP client with params: socketTimeout=340000&connTimeout=45000&retry=true
[junit4] 2> 140856 INFO (TEST-JdbcTest.doTest-seed#[E59B57130FBDAD02]) [ ] o.a.s.l.LogWatcher SLF4J impl is org.slf4j.impl.Log4jLoggerFactory
[junit4] 2> 140856 INFO (TEST-JdbcTest.doTest-seed#[E59B57130FBDAD02]) [ ] o.a.s.l.LogWatcher Registering Log Listener [Log4j (org.slf4j.impl.Log4jLoggerFactory)]
[junit4] 2> 140856 INFO (TEST-JdbcTest.doTest-seed#[E59B57130FBDAD02]) [ ] o.a.s.c.ZkContainer Zookeeper client=127.0.0.1:55479/solr
[junit4] 2> 140856 INFO (TEST-JdbcTest.doTest-seed#[E59B57130FBDAD02]) [ ] o.a.s.c.ZkController zkHost includes chroot
[junit4] 2> 140856 INFO (TEST-JdbcTest.doTest-seed#[E59B57130FBDAD02]) [ ] o.a.s.c.c.SolrZkClient Using default ZkCredentialsProvider
[junit4] 2> 140857 INFO (TEST-JdbcTest.doTest-seed#[E59B57130FBDAD02]) [ ] o.a.s.c.c.ConnectionManager Waiting for client to connect to ZooKeeper
[junit4] 2> 140860 INFO (zkCallback-48-thread-1) [ ] o.a.s.c.c.ConnectionManager Watcher org.apache.solr.common.cloud.ConnectionManager@400f27b0 name:ZooKeeperConnection Watcher:127.0.0.1:55479 got event WatchedEvent state:SyncConnected type:None path:null path:null type:None
[junit4] 2> 140861 INFO (TEST-JdbcTest.doTest-seed#[E59B57130FBDAD02]) [ ] o.a.s.c.c.ConnectionManager Client is connected to ZooKeeper
[junit4] 2> 140861 INFO (TEST-JdbcTest.doTest-seed#[E59B57130FBDAD02]) [ ] o.a.s.c.c.SolrZkClient Using default ZkACLProvider
[junit4] 2> 140865 INFO (TEST-JdbcTest.doTest-seed#[E59B57130FBDAD02]) [n:127.0.0.1:61996_ ] o.a.s.c.c.ConnectionManager Waiting for client to connect to ZooKeeper
[junit4] 2> 140867 INFO (zkCallback-49-thread-1-processing-n:127.0.0.1:61996_) [n:127.0.0.1:61996_ ] o.a.s.c.c.ConnectionManager Watcher org.apache.solr.common.cloud.ConnectionManager@47cb326b name:ZooKeeperConnection Watcher:127.0.0.1:55479/solr got event WatchedEvent state:SyncConnected type:None path:null path:null type:None
[junit4] 2> 140868 INFO (TEST-JdbcTest.doTest-seed#[E59B57130FBDAD02]) [n:127.0.0.1:61996_ ] o.a.s.c.c.ConnectionManager Client is connected to ZooKeeper
[junit4] 2> 140880 INFO (TEST-JdbcTest.doTest-seed#[E59B57130FBDAD02]) [n:127.0.0.1:61996_ ] o.a.s.c.c.ZkStateReader Updating cluster state from ZooKeeper...
[junit4] 2> 140899 INFO (OverseerStateUpdate-94548388662214660-127.0.0.1:65274_-n_0000000000) [n:127.0.0.1:65274_ ] o.a.s.c.o.ZkStateWriter going to create_collection /collections/collection1/state.json
[junit4] 2> 141893 INFO (TEST-JdbcTest.doTest-seed#[E59B57130FBDAD02]) [n:127.0.0.1:61996_ ] o.a.s.c.ZkController Register node as live in ZooKeeper:/live_nodes/127.0.0.1:61996_
[junit4] 2> 141894 INFO (TEST-JdbcTest.doTest-seed#[E59B57130FBDAD02]) [n:127.0.0.1:61996_ ] o.a.s.c.c.SolrZkClient makePath: /live_nodes/127.0.0.1:61996_
[junit4] 2> 141897 INFO (zkCallback-44-thread-1) [ ] o.a.s.c.c.ZkStateReader A live node change: WatchedEvent state:SyncConnected type:NodeChildrenChanged path:/live_nodes, has occurred - updating... (live nodes size: 1)
[junit4] 2> 141897 INFO (zkCallback-42-thread-1-processing-n:127.0.0.1:65274_) [n:127.0.0.1:65274_ ] o.a.s.c.c.ZkStateReader A live node change: WatchedEvent state:SyncConnected type:NodeChildrenChanged path:/live_nodes, has occurred - updating... (live nodes size: 1)
[junit4] 2> 141898 INFO (zkCallback-49-thread-1-processing-n:127.0.0.1:61996_) [n:127.0.0.1:61996_ ] o.a.s.c.c.ZkStateReader A live node change: WatchedEvent state:SyncConnected type:NodeChildrenChanged path:/live_nodes, has occurred - updating... (live nodes size: 1)
[junit4] 2> 141901 INFO (TEST-JdbcTest.doTest-seed#[E59B57130FBDAD02]) [n:127.0.0.1:61996_ ] o.a.s.c.Overseer Overseer (id=null) closing
[junit4] 2> 141902 INFO (TEST-JdbcTest.doTest-seed#[E59B57130FBDAD02]) [n:127.0.0.1:61996_ ] o.a.s.c.LeaderElector Joined leadership election with path: /overseer_elect/election/94548388662214665-127.0.0.1:61996_-n_0000000001
[junit4] 2> 141905 INFO (TEST-JdbcTest.doTest-seed#[E59B57130FBDAD02]) [n:127.0.0.1:61996_ ] o.a.s.c.LeaderElector Watching path /overseer_elect/election/94548388662214660-127.0.0.1:65274_-n_0000000000 to know if I could be the leader
[junit4] 2> 141908 INFO (TEST-JdbcTest.doTest-seed#[E59B57130FBDAD02]) [n:127.0.0.1:61996_ ] o.a.s.c.CoreContainer Security conf doesn't exist. Skipping setup for authorization module.
[junit4] 2> 141908 INFO (TEST-JdbcTest.doTest-seed#[E59B57130FBDAD02]) [n:127.0.0.1:61996_ ] o.a.s.c.CoreContainer No authentication plugin used.
[junit4] 2> 141909 INFO (TEST-JdbcTest.doTest-seed#[E59B57130FBDAD02]) [n:127.0.0.1:61996_ ] o.a.s.c.CoresLocator Looking for core definitions underneath /export/home/jenkins/workspace/Lucene-Solr-trunk-Solaris/solr/build/solr-solrj/test/J1/temp/solr.client.solrj.io.sql.JdbcTest_E59B57130FBDAD02-001/shard-1-001/cores
[junit4] 2> 141910 INFO (TEST-JdbcTest.doTest-seed#[E59B57130FBDAD02]) [n:127.0.0.1:61996_ ] o.a.s.c.SolrCore Created CoreDescriptor: {name=collection1, config=solrconfig.xml, transient=false, schema=schema.xml, loadOnStartup=true, configSetProperties=configsetprops.json, instanceDir=/export/home/jenkins/workspace/Lucene-Solr-trunk-Solaris/solr/build/solr-solrj/test/J1/temp/solr.client.solrj.io.sql.JdbcTest_E59B57130FBDAD02-001/shard-1-001/cores/collection1, collection=collection1, absoluteInstDir=/export/home/jenkins/workspace/Lucene-Solr-trunk-Solaris/solr/build/solr-solrj/test/J1/temp/solr.client.solrj.io.sql.JdbcTest_E59B57130FBDAD02-001/shard-1-001/cores/collection1/, coreNodeName=, dataDir=data/, shard=}
[junit4] 2> 141910 INFO (TEST-JdbcTest.doTest-seed#[E59B57130FBDAD02]) [n:127.0.0.1:61996_ ] o.a.s.c.CoresLocator Found core collection1 in /export/home/jenkins/workspace/Lucene-Solr-trunk-Solaris/solr/build/solr-solrj/test/J1/temp/solr.client.solrj.io.sql.JdbcTest_E59B57130FBDAD02-001/shard-1-001/cores/collection1/
[junit4] 2> 141910 INFO (TEST-JdbcTest.doTest-seed#[E59B57130FBDAD02]) [n:127.0.0.1:61996_ ] o.a.s.c.CoresLocator Found 1 core definitions
[junit4] 2> 141912 INFO (TEST-JdbcTest.doTest-seed#[E59B57130FBDAD02]) [n:127.0.0.1:61996_ ] o.a.s.s.SolrDispatchFilter user.dir=/export/home/jenkins/workspace/Lucene-Solr-trunk-Solaris/solr/build/solr-solrj/test/J1
[junit4] 2> 141912 INFO (TEST-JdbcTest.doTest-seed#[E59B57130FBDAD02]) [n:127.0.0.1:61996_ ] o.a.s.s.SolrDispatchFilter SolrDispatchFilter.init() done
[junit4] 2> 141913 INFO (coreLoadExecutor-329-thread-1-processing-n:127.0.0.1:61996_) [n:127.0.0.1:61996_ c:collection1 x:collection1] o.a.s.c.ZkController publishing state=down
[junit4] 2> 141913 INFO (coreLoadExecutor-329-thread-1-processing-n:127.0.0.1:61996_) [n:127.0.0.1:61996_ c:collection1 x:collection1] o.a.s.c.ZkController numShards not found on descriptor - reading it from system property
[junit4] 2> 141916 INFO (coreLoadExecutor-329-thread-1-processing-n:127.0.0.1:61996_) [n:127.0.0.1:61996_ c:collection1 x:collection1] o.a.s.c.ZkController Registering watch for collection collection1
[junit4] 2> 141916 INFO (coreLoadExecutor-329-thread-1-processing-n:127.0.0.1:61996_) [n:127.0.0.1:61996_ c:collection1 x:collection1] o.a.s.c.c.ZkStateReader addZkWatch collection1
[junit4] 2> 141917 INFO (OverseerStateUpdate-94548388662214660-127.0.0.1:65274_-n_0000000000) [n:127.0.0.1:65274_ ] o.a.s.c.Overseer processMessage: queueSize: 1, message = {
[junit4] 2> "core":"collection1",
[junit4] 2> "roles":null,
[junit4] 2> "base_url":"http://127.0.0.1:61996",
[junit4] 2> "node_name":"127.0.0.1:61996_",
[junit4] 2> "numShards":"2",
[junit4] 2> "state":"down",
[junit4] 2> "shard":null,
[junit4] 2> "collection":"collection1",
[junit4] 2> "operation":"state"} current state version: 3
[junit4] 2> 141918 INFO (OverseerStateUpdate-94548388662214660-127.0.0.1:65274_-n_0000000000) [n:127.0.0.1:65274_ ] o.a.s.c.o.ReplicaMutator Update state numShards=2 message={
[junit4] 2> "core":"collection1",
[junit4] 2> "roles":null,
[junit4] 2> "base_url"
[...truncated too long message...]
Task(ThreadPoolExecutor.java:1066)
[junit4] > at java.util.concurrent.ThreadPoolExecutor.runWorker(ThreadPoolExecutor.java:1127)
[junit4] > at java.util.concurrent.ThreadPoolExecutor$Worker.run(ThreadPoolExecutor.java:617)
[junit4] > at java.lang.Thread.run(Thread.java:745)
[junit4] > 3) Thread[id=836, name=zkCallback-65-thread-2, state=TIMED_WAITING, group=TGRP-JdbcTest]
[junit4] > at sun.misc.Unsafe.park(Native Method)
[junit4] > at java.util.concurrent.locks.LockSupport.parkNanos(LockSupport.java:215)
[junit4] > at java.util.concurrent.SynchronousQueue$TransferStack.awaitFulfill(SynchronousQueue.java:460)
[junit4] > at java.util.concurrent.SynchronousQueue$TransferStack.transfer(SynchronousQueue.java:362)
[junit4] > at java.util.concurrent.SynchronousQueue.poll(SynchronousQueue.java:941)
[junit4] > at java.util.concurrent.ThreadPoolExecutor.getTask(ThreadPoolExecutor.java:1066)
[junit4] > at java.util.concurrent.ThreadPoolExecutor.runWorker(ThreadPoolExecutor.java:1127)
[junit4] > at java.util.concurrent.ThreadPoolExecutor$Worker.run(ThreadPoolExecutor.java:617)
[junit4] > at java.lang.Thread.run(Thread.java:745)
[junit4] > 4) Thread[id=838, name=zkCallback-65-thread-4, state=TIMED_WAITING, group=TGRP-JdbcTest]
[junit4] > at sun.misc.Unsafe.park(Native Method)
[junit4] > at java.util.concurrent.locks.LockSupport.parkNanos(LockSupport.java:215)
[junit4] > at java.util.concurrent.SynchronousQueue$TransferStack.awaitFulfill(SynchronousQueue.java:460)
[junit4] > at java.util.concurrent.SynchronousQueue$TransferStack.transfer(SynchronousQueue.java:362)
[junit4] > at java.util.concurrent.SynchronousQueue.poll(SynchronousQueue.java:941)
[junit4] > at java.util.concurrent.ThreadPoolExecutor.getTask(ThreadPoolExecutor.java:1066)
[junit4] > at java.util.concurrent.ThreadPoolExecutor.runWorker(ThreadPoolExecutor.java:1127)
[junit4] > at java.util.concurrent.ThreadPoolExecutor$Worker.run(ThreadPoolExecutor.java:617)
[junit4] > at java.lang.Thread.run(Thread.java:745)
[junit4] > 5) Thread[id=796, name=TEST-JdbcTest.doTest-seed#[E59B57130FBDAD02]-SendThread(127.0.0.1:55479), state=TIMED_WAITING, group=TGRP-JdbcTest]
[junit4] > at java.lang.Thread.sleep(Native Method)
[junit4] > at org.apache.zookeeper.client.StaticHostProvider.next(StaticHostProvider.java:101)
[junit4] > at org.apache.zookeeper.ClientCnxn$SendThread.startConnect(ClientCnxn.java:940)
[junit4] > at org.apache.zookeeper.ClientCnxn$SendThread.run(ClientCnxn.java:1003)
[junit4] > 6) Thread[id=837, name=zkCallback-65-thread-3, state=TIMED_WAITING, group=TGRP-JdbcTest]
[junit4] > at sun.misc.Unsafe.park(Native Method)
[junit4] > at java.util.concurrent.locks.LockSupport.parkNanos(LockSupport.java:215)
[junit4] > at java.util.concurrent.SynchronousQueue$TransferStack.awaitFulfill(SynchronousQueue.java:460)
[junit4] > at java.util.concurrent.SynchronousQueue$TransferStack.transfer(SynchronousQueue.java:362)
[junit4] > at java.util.concurrent.SynchronousQueue.poll(SynchronousQueue.java:941)
[junit4] > at java.util.concurrent.ThreadPoolExecutor.getTask(ThreadPoolExecutor.java:1066)
[junit4] > at java.util.concurrent.ThreadPoolExecutor.runWorker(ThreadPoolExecutor.java:1127)
[junit4] > at java.util.concurrent.ThreadPoolExecutor$Worker.run(ThreadPoolExecutor.java:617)
[junit4] > at java.lang.Thread.run(Thread.java:745)
[junit4] > at __randomizedtesting.SeedInfo.seed([E59B57130FBDAD02]:0)Throwable #2: com.carrotsearch.randomizedtesting.ThreadLeakError: There are still zombie threads that couldn't be terminated:
[junit4] > 1) Thread[id=798, name=zkCallback-65-thread-1, state=TIMED_WAITING, group=TGRP-JdbcTest]
[junit4] > at sun.misc.Unsafe.park(Native Method)
[junit4] > at java.util.concurrent.locks.LockSupport.parkNanos(LockSupport.java:215)
[junit4] > at java.util.concurrent.SynchronousQueue$TransferStack.awaitFulfill(SynchronousQueue.java:460)
[junit4] > at java.util.concurrent.SynchronousQueue$TransferStack.transfer(SynchronousQueue.java:362)
[junit4] > at java.util.concurrent.SynchronousQueue.poll(SynchronousQueue.java:941)
[junit4] > at java.util.concurrent.ThreadPoolExecutor.getTask(ThreadPoolExecutor.java:1066)
[junit4] > at java.util.concurrent.ThreadPoolExecutor.runWorker(ThreadPoolExecutor.java:1127)
[junit4] > at java.util.concurrent.ThreadPoolExecutor$Worker.run(ThreadPoolExecutor.java:617)
[junit4] > at java.lang.Thread.run(Thread.java:745)
[junit4] > 2) Thread[id=836, name=zkCallback-65-thread-2, state=TIMED_WAITING, group=TGRP-JdbcTest]
[junit4] > at sun.misc.Unsafe.park(Native Method)
[junit4] > at java.util.concurrent.locks.LockSupport.parkNanos(LockSupport.java:215)
[junit4] > at java.util.concurrent.SynchronousQueue$TransferStack.awaitFulfill(SynchronousQueue.java:460)
[junit4] > at java.util.concurrent.SynchronousQueue$TransferStack.transfer(SynchronousQueue.java:362)
[junit4] > at java.util.concurrent.SynchronousQueue.poll(SynchronousQueue.java:941)
[junit4] > at java.util.concurrent.ThreadPoolExecutor.getTask(ThreadPoolExecutor.java:1066)
[junit4] > at java.util.concurrent.ThreadPoolExecutor.runWorker(ThreadPoolExecutor.java:1127)
[junit4] > at java.util.concurrent.ThreadPoolExecutor$Worker.run(ThreadPoolExecutor.java:617)
[junit4] > at java.lang.Thread.run(Thread.java:745)
[junit4] > 3) Thread[id=838, name=zkCallback-65-thread-4, state=TIMED_WAITING, group=TGRP-JdbcTest]
[junit4] > at sun.misc.Unsafe.park(Native Method)
[junit4] > at java.util.concurrent.locks.LockSupport.parkNanos(LockSupport.java:215)
[junit4] > at java.util.concurrent.SynchronousQueue$TransferStack.awaitFulfill(SynchronousQueue.java:460)
[junit4] > at java.util.concurrent.SynchronousQueue$TransferStack.transfer(SynchronousQueue.java:362)
[junit4] > at java.util.concurrent.SynchronousQueue.poll(SynchronousQueue.java:941)
[junit4] > at java.util.concurrent.ThreadPoolExecutor.getTask(ThreadPoolExecutor.java:1066)
[junit4] > at java.util.concurrent.ThreadPoolExecutor.runWorker(ThreadPoolExecutor.java:1127)
[junit4] > at java.util.concurrent.ThreadPoolExecutor$Worker.run(ThreadPoolExecutor.java:617)
[junit4] > at java.lang.Thread.run(Thread.java:745)
[junit4] > 4) Thread[id=796, name=TEST-JdbcTest.doTest-seed#[E59B57130FBDAD02]-SendThread(127.0.0.1:55479), state=TIMED_WAITING, group=TGRP-JdbcTest]
[junit4] > at java.lang.Thread.sleep(Native Method)
[junit4] > at org.apache.zookeeper.client.StaticHostProvider.next(StaticHostProvider.java:101)
[junit4] > at org.apache.zookeeper.ClientCnxn$SendThread.startConnect(ClientCnxn.java:940)
[junit4] > at org.apache.zookeeper.ClientCnxn$SendThread.run(ClientCnxn.java:1003)
[junit4] > 5) Thread[id=837, name=zkCallback-65-thread-3, state=TIMED_WAITING, group=TGRP-JdbcTest]
[junit4] > at sun.misc.Unsafe.park(Native Method)
[junit4] > at java.util.concurrent.locks.LockSupport.parkNanos(LockSupport.java:215)
[junit4] > at java.util.concurrent.SynchronousQueue$TransferStack.awaitFulfill(SynchronousQueue.java:460)
[junit4] > at java.util.concurrent.SynchronousQueue$TransferStack.transfer(SynchronousQueue.java:362)
[junit4] > at java.util.concurrent.SynchronousQueue.poll(SynchronousQueue.java:941)
[junit4] > at java.util.concurrent.ThreadPoolExecutor.getTask(ThreadPoolExecutor.java:1066)
[junit4] > at java.util.concurrent.ThreadPoolExecutor.runWorker(ThreadPoolExecutor.java:1127)
[junit4] > at java.util.concurrent.ThreadPoolExecutor$Worker.run(ThreadPoolExecutor.java:617)
[junit4] > at java.lang.Thread.run(Thread.java:745)
[junit4] > at __randomizedtesting.SeedInfo.seed([E59B57130FBDAD02]:0)
[junit4] Completed [58/68] on J1 in 48.36s, 1 test, 1 failure, 2 errors <<< FAILURES!
[...truncated 41 lines...]
BUILD FAILED
/export/home/jenkins/workspace/Lucene-Solr-trunk-Solaris/build.xml:775: The following error occurred while executing this line:
/export/home/jenkins/workspace/Lucene-Solr-trunk-Solaris/build.xml:719: The following error occurred while executing this line:
/export/home/jenkins/workspace/Lucene-Solr-trunk-Solaris/build.xml:59: The following error occurred while executing this line:
/export/home/jenkins/workspace/Lucene-Solr-trunk-Solaris/solr/build.xml:246: The following error occurred while executing this line:
/export/home/jenkins/workspace/Lucene-Solr-trunk-Solaris/solr/common-build.xml:514: The following error occurred while executing this line:
/export/home/jenkins/workspace/Lucene-Solr-trunk-Solaris/lucene/common-build.xml:1432: The following error occurred while executing this line:
/export/home/jenkins/workspace/Lucene-Solr-trunk-Solaris/lucene/common-build.xml:987: There were test failures: 68 suites, 468 tests, 2 suite-level errors, 1 failure, 70 ignored
Total time: 76 minutes 45 seconds
Build step 'Invoke Ant' marked build as failure
Archiving artifacts
[WARNINGS] Skipping publisher since build result is FAILURE
Recording test results
Email was triggered for: Failure - Any
Sending email for trigger: Failure - Any
[JENKINS] Lucene-Solr-trunk-Solaris (64bit/jdk1.8.0) - Build # 65 -
Still Failing!
Posted by Policeman Jenkins Server <je...@thetaphi.de>.
Build: http://jenkins.thetaphi.de/job/Lucene-Solr-trunk-Solaris/65/
Java: 64bit/jdk1.8.0 -XX:-UseCompressedOops -XX:+UseG1GC
5 tests failed.
FAILED: org.apache.solr.cloud.MigrateRouteKeyTest.test
Error Message:
java.util.concurrent.TimeoutException: Could not connect to ZooKeeper 127.0.0.1:64052 within 30000 ms
Stack Trace:
org.apache.solr.common.SolrException: java.util.concurrent.TimeoutException: Could not connect to ZooKeeper 127.0.0.1:64052 within 30000 ms
at __randomizedtesting.SeedInfo.seed([F20DB7A1514425B7:7A59887BFFB8484F]:0)
at org.apache.solr.common.cloud.SolrZkClient.<init>(SolrZkClient.java:181)
at org.apache.solr.common.cloud.SolrZkClient.<init>(SolrZkClient.java:115)
at org.apache.solr.common.cloud.SolrZkClient.<init>(SolrZkClient.java:110)
at org.apache.solr.common.cloud.SolrZkClient.<init>(SolrZkClient.java:97)
at org.apache.solr.cloud.AbstractDistribZkTestBase.printLayout(AbstractDistribZkTestBase.java:260)
at org.apache.solr.cloud.AbstractFullDistribZkTestBase.distribTearDown(AbstractFullDistribZkTestBase.java:1475)
at org.apache.solr.cloud.BasicDistributedZkTest.distribTearDown(BasicDistributedZkTest.java:1123)
at org.apache.solr.BaseDistributedSearchTestCase$ShardsRepeatRule$ShardsStatement.evaluate(BaseDistributedSearchTestCase.java:940)
at com.carrotsearch.randomizedtesting.rules.SystemPropertiesRestoreRule$1.evaluate(SystemPropertiesRestoreRule.java:57)
at org.apache.lucene.util.TestRuleSetupTeardownChained$1.evaluate(TestRuleSetupTeardownChained.java:50)
at org.apache.lucene.util.AbstractBeforeAfterRule$1.evaluate(AbstractBeforeAfterRule.java:46)
at org.apache.lucene.util.TestRuleThreadAndTestName$1.evaluate(TestRuleThreadAndTestName.java:49)
at org.apache.lucene.util.TestRuleIgnoreAfterMaxFailures$1.evaluate(TestRuleIgnoreAfterMaxFailures.java:65)
at org.apache.lucene.util.TestRuleMarkFailure$1.evaluate(TestRuleMarkFailure.java:48)
at com.carrotsearch.randomizedtesting.rules.StatementAdapter.evaluate(StatementAdapter.java:36)
at com.carrotsearch.randomizedtesting.ThreadLeakControl$StatementRunner.run(ThreadLeakControl.java:365)
at com.carrotsearch.randomizedtesting.ThreadLeakControl.forkTimeoutingTask(ThreadLeakControl.java:798)
at com.carrotsearch.randomizedtesting.ThreadLeakControl$3.evaluate(ThreadLeakControl.java:458)
at com.carrotsearch.randomizedtesting.RandomizedRunner.runSingleTest(RandomizedRunner.java:845)
at com.carrotsearch.randomizedtesting.RandomizedRunner$3.evaluate(RandomizedRunner.java:747)
at com.carrotsearch.randomizedtesting.RandomizedRunner$4.evaluate(RandomizedRunner.java:781)
at com.carrotsearch.randomizedtesting.RandomizedRunner$5.evaluate(RandomizedRunner.java:792)
at com.carrotsearch.randomizedtesting.rules.StatementAdapter.evaluate(StatementAdapter.java:36)
at com.carrotsearch.randomizedtesting.rules.SystemPropertiesRestoreRule$1.evaluate(SystemPropertiesRestoreRule.java:57)
at org.apache.lucene.util.AbstractBeforeAfterRule$1.evaluate(AbstractBeforeAfterRule.java:46)
at com.carrotsearch.randomizedtesting.rules.StatementAdapter.evaluate(StatementAdapter.java:36)
at org.apache.lucene.util.TestRuleStoreClassName$1.evaluate(TestRuleStoreClassName.java:42)
at com.carrotsearch.randomizedtesting.rules.NoShadowingOrOverridesOnMethodsRule$1.evaluate(NoShadowingOrOverridesOnMethodsRule.java:39)
at com.carrotsearch.randomizedtesting.rules.NoShadowingOrOverridesOnMethodsRule$1.evaluate(NoShadowingOrOverridesOnMethodsRule.java:39)
at com.carrotsearch.randomizedtesting.rules.StatementAdapter.evaluate(StatementAdapter.java:36)
at com.carrotsearch.randomizedtesting.rules.StatementAdapter.evaluate(StatementAdapter.java:36)
at com.carrotsearch.randomizedtesting.rules.StatementAdapter.evaluate(StatementAdapter.java:36)
at org.apache.lucene.util.TestRuleAssertionsRequired$1.evaluate(TestRuleAssertionsRequired.java:54)
at org.apache.lucene.util.TestRuleMarkFailure$1.evaluate(TestRuleMarkFailure.java:48)
at org.apache.lucene.util.TestRuleIgnoreAfterMaxFailures$1.evaluate(TestRuleIgnoreAfterMaxFailures.java:65)
at org.apache.lucene.util.TestRuleIgnoreTestSuites$1.evaluate(TestRuleIgnoreTestSuites.java:55)
at com.carrotsearch.randomizedtesting.rules.StatementAdapter.evaluate(StatementAdapter.java:36)
at com.carrotsearch.randomizedtesting.ThreadLeakControl$StatementRunner.run(ThreadLeakControl.java:365)
at java.lang.Thread.run(Thread.java:745)
Caused by: java.util.concurrent.TimeoutException: Could not connect to ZooKeeper 127.0.0.1:64052 within 30000 ms
at org.apache.solr.common.cloud.ConnectionManager.waitForConnected(ConnectionManager.java:208)
at org.apache.solr.common.cloud.SolrZkClient.<init>(SolrZkClient.java:173)
... 38 more
FAILED: junit.framework.TestSuite.org.apache.solr.cloud.MigrateRouteKeyTest
Error Message:
68 threads leaked from SUITE scope at org.apache.solr.cloud.MigrateRouteKeyTest: 1) Thread[id=11216, name=NIOServerCxn.Factory:0.0.0.0/0.0.0.0:0, state=RUNNABLE, group=TGRP-MigrateRouteKeyTest] at sun.nio.ch.DevPollArrayWrapper.poll0(Native Method) at sun.nio.ch.DevPollArrayWrapper.poll(DevPollArrayWrapper.java:223) at sun.nio.ch.DevPollSelectorImpl.doSelect(DevPollSelectorImpl.java:84) at sun.nio.ch.SelectorImpl.lockAndDoSelect(SelectorImpl.java:86) at sun.nio.ch.SelectorImpl.select(SelectorImpl.java:97) at org.apache.zookeeper.server.NIOServerCnxnFactory.run(NIOServerCnxnFactory.java:178) at java.lang.Thread.run(Thread.java:745) 2) Thread[id=11298, name=qtp1959989137-11298-acceptor-0@4134c43-ServerConnector@549d1215{HTTP/1.1}{127.0.0.1:64052}, state=RUNNABLE, group=TGRP-MigrateRouteKeyTest] at sun.nio.ch.ServerSocketChannelImpl.accept0(Native Method) at sun.nio.ch.ServerSocketChannelImpl.accept(ServerSocketChannelImpl.java:422) at sun.nio.ch.ServerSocketChannelImpl.accept(ServerSocketChannelImpl.java:250) at org.eclipse.jetty.server.ServerConnector.accept(ServerConnector.java:377) at org.eclipse.jetty.server.AbstractConnector$Acceptor.run(AbstractConnector.java:500) at org.eclipse.jetty.util.thread.QueuedThreadPool.runJob(QueuedThreadPool.java:635) at org.eclipse.jetty.util.thread.QueuedThreadPool$3.run(QueuedThreadPool.java:555) at java.lang.Thread.run(Thread.java:745) 3) Thread[id=11317, name=qtp455219478-11317-selector-ServerConnectorManager@463ae160/0, state=RUNNABLE, group=TGRP-MigrateRouteKeyTest] at sun.nio.ch.DevPollArrayWrapper.poll0(Native Method) at sun.nio.ch.DevPollArrayWrapper.poll(DevPollArrayWrapper.java:223) at sun.nio.ch.DevPollSelectorImpl.doSelect(DevPollSelectorImpl.java:84) at sun.nio.ch.SelectorImpl.lockAndDoSelect(SelectorImpl.java:86) at sun.nio.ch.SelectorImpl.select(SelectorImpl.java:97) at sun.nio.ch.SelectorImpl.select(SelectorImpl.java:101) at org.eclipse.jetty.io.SelectorManager$ManagedSelector.select(SelectorManager.java:600) at org.eclipse.jetty.io.SelectorManager$ManagedSelector.run(SelectorManager.java:549) at org.eclipse.jetty.util.thread.NonBlockingThread.run(NonBlockingThread.java:52) at org.eclipse.jetty.util.thread.QueuedThreadPool.runJob(QueuedThreadPool.java:635) at org.eclipse.jetty.util.thread.QueuedThreadPool$3.run(QueuedThreadPool.java:555) at java.lang.Thread.run(Thread.java:745) 4) Thread[id=11335, name=qtp527120189-11335, state=TIMED_WAITING, group=TGRP-MigrateRouteKeyTest] at sun.misc.Unsafe.park(Native Method) at java.util.concurrent.locks.LockSupport.parkNanos(LockSupport.java:215) at java.util.concurrent.locks.AbstractQueuedSynchronizer$ConditionObject.awaitNanos(AbstractQueuedSynchronizer.java:2078) at org.eclipse.jetty.util.BlockingArrayQueue.poll(BlockingArrayQueue.java:389) at org.eclipse.jetty.util.thread.QueuedThreadPool.idleJobPoll(QueuedThreadPool.java:531) at org.eclipse.jetty.util.thread.QueuedThreadPool.access$700(QueuedThreadPool.java:47) at org.eclipse.jetty.util.thread.QueuedThreadPool$3.run(QueuedThreadPool.java:590) at java.lang.Thread.run(Thread.java:745) 5) Thread[id=11240, name=qtp1549077534-11240, state=TIMED_WAITING, group=TGRP-MigrateRouteKeyTest] at sun.misc.Unsafe.park(Native Method) at java.util.concurrent.locks.LockSupport.parkNanos(LockSupport.java:215) at java.util.concurrent.locks.AbstractQueuedSynchronizer$ConditionObject.awaitNanos(AbstractQueuedSynchronizer.java:2078) at org.eclipse.jetty.util.BlockingArrayQueue.poll(BlockingArrayQueue.java:389) at org.eclipse.jetty.util.thread.QueuedThreadPool.idleJobPoll(QueuedThreadPool.java:531) at org.eclipse.jetty.util.thread.QueuedThreadPool.access$700(QueuedThreadPool.java:47) at org.eclipse.jetty.util.thread.QueuedThreadPool$3.run(QueuedThreadPool.java:590) at java.lang.Thread.run(Thread.java:745) 6) Thread[id=11308, name=Scheduler-1330973845, state=TIMED_WAITING, group=TGRP-MigrateRouteKeyTest] at sun.misc.Unsafe.park(Native Method) at java.util.concurrent.locks.LockSupport.parkNanos(LockSupport.java:215) at java.util.concurrent.locks.AbstractQueuedSynchronizer$ConditionObject.awaitNanos(AbstractQueuedSynchronizer.java:2078) at java.util.concurrent.ScheduledThreadPoolExecutor$DelayedWorkQueue.take(ScheduledThreadPoolExecutor.java:1093) at java.util.concurrent.ScheduledThreadPoolExecutor$DelayedWorkQueue.take(ScheduledThreadPoolExecutor.java:809) at java.util.concurrent.ThreadPoolExecutor.getTask(ThreadPoolExecutor.java:1067) at java.util.concurrent.ThreadPoolExecutor.runWorker(ThreadPoolExecutor.java:1127) at java.util.concurrent.ThreadPoolExecutor$Worker.run(ThreadPoolExecutor.java:617) at java.lang.Thread.run(Thread.java:745) 7) Thread[id=11260, name=TEST-MigrateRouteKeyTest.test-seed#[F20DB7A1514425B7]-SendThread(127.0.0.1:64052), state=RUNNABLE, group=TGRP-MigrateRouteKeyTest] at sun.nio.ch.DevPollArrayWrapper.poll0(Native Method) at sun.nio.ch.DevPollArrayWrapper.poll(DevPollArrayWrapper.java:223) at sun.nio.ch.DevPollSelectorImpl.doSelect(DevPollSelectorImpl.java:84) at sun.nio.ch.SelectorImpl.lockAndDoSelect(SelectorImpl.java:86) at sun.nio.ch.SelectorImpl.select(SelectorImpl.java:97) at org.apache.zookeeper.ClientCnxnSocketNIO.doTransport(ClientCnxnSocketNIO.java:349) at org.apache.zookeeper.ClientCnxn$SendThread.run(ClientCnxn.java:1081) 8) Thread[id=11251, name=OverseerHdfsCoreFailoverThread-94550356689485828-127.0.0.1:36280_-n_0000000000, state=TIMED_WAITING, group=Overseer Hdfs SolrCore Failover Thread.] at java.lang.Thread.sleep(Native Method) at org.apache.solr.cloud.OverseerAutoReplicaFailoverThread.run(OverseerAutoReplicaFailoverThread.java:139) at java.lang.Thread.run(Thread.java:745) 9) Thread[id=11234, name=qtp1549077534-11234, state=TIMED_WAITING, group=TGRP-MigrateRouteKeyTest] at sun.misc.Unsafe.park(Native Method) at java.util.concurrent.locks.LockSupport.parkNanos(LockSupport.java:215) at java.util.concurrent.locks.AbstractQueuedSynchronizer$ConditionObject.awaitNanos(AbstractQueuedSynchronizer.java:2078) at org.eclipse.jetty.util.BlockingArrayQueue.poll(BlockingArrayQueue.java:389) at org.eclipse.jetty.util.thread.QueuedThreadPool.idleJobPoll(QueuedThreadPool.java:531) at org.eclipse.jetty.util.thread.QueuedThreadPool.access$700(QueuedThreadPool.java:47) at org.eclipse.jetty.util.thread.QueuedThreadPool$3.run(QueuedThreadPool.java:590) at java.lang.Thread.run(Thread.java:745) 10) Thread[id=11302, name=qtp1959989137-11302, state=TIMED_WAITING, group=TGRP-MigrateRouteKeyTest] at sun.misc.Unsafe.park(Native Method) at java.util.concurrent.locks.LockSupport.parkNanos(LockSupport.java:215) at java.util.concurrent.locks.AbstractQueuedSynchronizer$ConditionObject.awaitNanos(AbstractQueuedSynchronizer.java:2078) at org.eclipse.jetty.util.BlockingArrayQueue.poll(BlockingArrayQueue.java:389) at org.eclipse.jetty.util.thread.QueuedThreadPool.idleJobPoll(QueuedThreadPool.java:531) at org.eclipse.jetty.util.thread.QueuedThreadPool.access$700(QueuedThreadPool.java:47) at org.eclipse.jetty.util.thread.QueuedThreadPool$3.run(QueuedThreadPool.java:590) at java.lang.Thread.run(Thread.java:745) 11) Thread[id=11215, name=Thread-4899, state=WAITING, group=TGRP-MigrateRouteKeyTest] at java.lang.Object.wait(Native Method) at java.lang.Thread.join(Thread.java:1245) at java.lang.Thread.join(Thread.java:1319) at org.apache.zookeeper.server.NIOServerCnxnFactory.join(NIOServerCnxnFactory.java:302) at org.apache.solr.cloud.ZkTestServer$ZKServerMain.runFromConfig(ZkTestServer.java:310) at org.apache.solr.cloud.ZkTestServer$2.run(ZkTestServer.java:491) 12) Thread[id=11285, name=TEST-MigrateRouteKeyTest.test-seed#[F20DB7A1514425B7]-EventThread, state=WAITING, group=TGRP-MigrateRouteKeyTest] at sun.misc.Unsafe.park(Native Method) at java.util.concurrent.locks.LockSupport.park(LockSupport.java:175) at java.util.concurrent.locks.AbstractQueuedSynchronizer$ConditionObject.await(AbstractQueuedSynchronizer.java:2039) at java.util.concurrent.LinkedBlockingQueue.take(LinkedBlockingQueue.java:442) at org.apache.zookeeper.ClientCnxn$EventThread.run(ClientCnxn.java:494) 13) Thread[id=11250, name=OverseerCollectionConfigSetProcessor-94550356689485828-127.0.0.1:36280_-n_0000000000, state=TIMED_WAITING, group=Overseer collection creation process.] at sun.misc.Unsafe.park(Native Method) at java.util.concurrent.locks.LockSupport.parkNanos(LockSupport.java:215) at java.util.concurrent.locks.AbstractQueuedSynchronizer$ConditionObject.awaitNanos(AbstractQueuedSynchronizer.java:2078) at org.apache.solr.cloud.DistributedQueue.getChildren(DistributedQueue.java:343) at org.apache.solr.cloud.OverseerTaskQueue.peekTopN(OverseerTaskQueue.java:210) at org.apache.solr.cloud.OverseerTaskProcessor.run(OverseerTaskProcessor.java:197) at java.lang.Thread.run(Thread.java:745) 14) Thread[id=11314, name=qtp455219478-11314, state=TIMED_WAITING, group=TGRP-MigrateRouteKeyTest] at sun.misc.Unsafe.park(Native Method) at java.util.concurrent.locks.LockSupport.parkNanos(LockSupport.java:215) at java.util.concurrent.locks.AbstractQueuedSynchronizer$ConditionObject.awaitNanos(AbstractQueuedSynchronizer.java:2078) at org.eclipse.jetty.util.BlockingArrayQueue.poll(BlockingArrayQueue.java:389) at org.eclipse.jetty.util.thread.QueuedThreadPool.idleJobPoll(QueuedThreadPool.java:531) at org.eclipse.jetty.util.thread.QueuedThreadPool.access$700(QueuedThreadPool.java:47) at org.eclipse.jetty.util.thread.QueuedThreadPool$3.run(QueuedThreadPool.java:590) at java.lang.Thread.run(Thread.java:745) 15) Thread[id=11297, name=qtp1959989137-11297, state=TIMED_WAITING, group=TGRP-MigrateRouteKeyTest] at sun.misc.Unsafe.park(Native Method) at java.util.concurrent.locks.LockSupport.parkNanos(LockSupport.java:215) at java.util.concurrent.locks.AbstractQueuedSynchronizer$ConditionObject.awaitNanos(AbstractQueuedSynchronizer.java:2078) at org.eclipse.jetty.util.BlockingArrayQueue.poll(BlockingArrayQueue.java:389) at org.eclipse.jetty.util.thread.QueuedThreadPool.idleJobPoll(QueuedThreadPool.java:531) at org.eclipse.jetty.util.thread.QueuedThreadPool.access$700(QueuedThreadPool.java:47) at org.eclipse.jetty.util.thread.QueuedThreadPool$3.run(QueuedThreadPool.java:590) at java.lang.Thread.run(Thread.java:745) 16) Thread[id=11217, name=SessionTracker, state=TIMED_WAITING, group=TGRP-MigrateRouteKeyTest] at java.lang.Object.wait(Native Method) at org.apache.zookeeper.server.SessionTrackerImpl.run(SessionTrackerImpl.java:146) 17) Thread[id=11299, name=qtp1959989137-11299, state=TIMED_WAITING, group=TGRP-MigrateRouteKeyTest] at sun.misc.Unsafe.park(Native Method) at java.util.concurrent.locks.LockSupport.parkNanos(LockSupport.java:215) at java.util.concurrent.locks.AbstractQueuedSynchronizer$ConditionObject.awaitNanos(AbstractQueuedSynchronizer.java:2078) at org.eclipse.jetty.util.BlockingArrayQueue.poll(BlockingArrayQueue.java:389) at org.eclipse.jetty.util.thread.QueuedThreadPool.idleJobPoll(QueuedThreadPool.java:531) at org.eclipse.jetty.util.thread.QueuedThreadPool.access$700(QueuedThreadPool.java:47) at org.eclipse.jetty.util.thread.QueuedThreadPool$3.run(QueuedThreadPool.java:590) at java.lang.Thread.run(Thread.java:745) 18) Thread[id=11231, name=qtp1549077534-11231, state=TIMED_WAITING, group=TGRP-MigrateRouteKeyTest] at sun.misc.Unsafe.park(Native Method) at java.util.concurrent.locks.LockSupport.parkNanos(LockSupport.java:215) at java.util.concurrent.locks.AbstractQueuedSynchronizer$ConditionObject.awaitNanos(AbstractQueuedSynchronizer.java:2078) at org.eclipse.jetty.util.BlockingArrayQueue.poll(BlockingArrayQueue.java:389) at org.eclipse.jetty.util.thread.QueuedThreadPool.idleJobPoll(QueuedThreadPool.java:531) at org.eclipse.jetty.util.thread.QueuedThreadPool.access$700(QueuedThreadPool.java:47) at org.eclipse.jetty.util.thread.QueuedThreadPool$3.run(QueuedThreadPool.java:590) at java.lang.Thread.run(Thread.java:745) 19) Thread[id=11269, name=qtp1492821566-11269-acceptor-0@56e5340-ServerConnector@7e337d03{HTTP/1.1}{127.0.0.1:35731}, state=RUNNABLE, group=TGRP-MigrateRouteKeyTest] at sun.nio.ch.ServerSocketChannelImpl.accept0(Native Method) at sun.nio.ch.ServerSocketChannelImpl.accept(ServerSocketChannelImpl.java:422) at sun.nio.ch.ServerSocketChannelImpl.accept(ServerSocketChannelImpl.java:250) at org.eclipse.jetty.server.ServerConnector.accept(ServerConnector.java:377) at org.eclipse.jetty.server.AbstractConnector$Acceptor.run(AbstractConnector.java:500) at org.eclipse.jetty.util.thread.QueuedThreadPool.runJob(QueuedThreadPool.java:635) at org.eclipse.jetty.util.thread.QueuedThreadPool$3.run(QueuedThreadPool.java:555) at java.lang.Thread.run(Thread.java:745) 20) Thread[id=11273, name=qtp1492821566-11273, state=TIMED_WAITING, group=TGRP-MigrateRouteKeyTest] at sun.misc.Unsafe.park(Native Method) at java.util.concurrent.locks.LockSupport.parkNanos(LockSupport.java:215) at java.util.concurrent.locks.AbstractQueuedSynchronizer$ConditionObject.awaitNanos(AbstractQueuedSynchronizer.java:2078) at org.eclipse.jetty.util.BlockingArrayQueue.poll(BlockingArrayQueue.java:389) at org.eclipse.jetty.util.thread.QueuedThreadPool.idleJobPoll(QueuedThreadPool.java:531) at org.eclipse.jetty.util.thread.QueuedThreadPool.access$700(QueuedThreadPool.java:47) at org.eclipse.jetty.util.thread.QueuedThreadPool$3.run(QueuedThreadPool.java:590) at java.lang.Thread.run(Thread.java:745) 21) Thread[id=11236, name=org.eclipse.jetty.server.session.HashSessionManager@7f3ec93cTimer, state=TIMED_WAITING, group=TGRP-MigrateRouteKeyTest] at sun.misc.Unsafe.park(Native Method) at java.util.concurrent.locks.LockSupport.parkNanos(LockSupport.java:215) at java.util.concurrent.locks.AbstractQueuedSynchronizer$ConditionObject.awaitNanos(AbstractQueuedSynchronizer.java:2078) at java.util.concurrent.ScheduledThreadPoolExecutor$DelayedWorkQueue.take(ScheduledThreadPoolExecutor.java:1093) at java.util.concurrent.ScheduledThreadPoolExecutor$DelayedWorkQueue.take(ScheduledThreadPoolExecutor.java:809) at java.util.concurrent.ThreadPoolExecutor.getTask(ThreadPoolExecutor.java:1067) at java.util.concurrent.ThreadPoolExecutor.runWorker(ThreadPoolExecutor.java:1127) at java.util.concurrent.ThreadPoolExecutor$Worker.run(ThreadPoolExecutor.java:617) at java.lang.Thread.run(Thread.java:745) 22) Thread[id=11301, name=qtp1959989137-11301, state=TIMED_WAITING, group=TGRP-MigrateRouteKeyTest] at sun.misc.Unsafe.park(Native Method) at java.util.concurrent.locks.LockSupport.parkNanos(LockSupport.java:215) at java.util.concurrent.locks.AbstractQueuedSynchronizer$ConditionObject.awaitNanos(AbstractQueuedSynchronizer.java:2078) at org.eclipse.jetty.util.BlockingArrayQueue.poll(BlockingArrayQueue.java:389) at org.eclipse.jetty.util.thread.QueuedThreadPool.idleJobPoll(QueuedThreadPool.java:531) at org.eclipse.jetty.util.thread.QueuedThreadPool.access$700(QueuedThreadPool.java:47) at org.eclipse.jetty.util.thread.QueuedThreadPool$3.run(QueuedThreadPool.java:590) at java.lang.Thread.run(Thread.java:745) 23) Thread[id=11276, name=Scheduler-650354673, state=TIMED_WAITING, group=TGRP-MigrateRouteKeyTest] at sun.misc.Unsafe.park(Native Method) at java.util.concurrent.locks.LockSupport.parkNanos(LockSupport.java:215) at java.util.concurrent.locks.AbstractQueuedSynchronizer$ConditionObject.awaitNanos(AbstractQueuedSynchronizer.java:2078) at java.util.concurrent.ScheduledThreadPoolExecutor$DelayedWorkQueue.take(ScheduledThreadPoolExecutor.java:1093) at java.util.concurrent.ScheduledThreadPoolExecutor$DelayedWorkQueue.take(ScheduledThreadPoolExecutor.java:809) at java.util.concurrent.ThreadPoolExecutor.getTask(ThreadPoolExecutor.java:1067) at java.util.concurrent.ThreadPoolExecutor.runWorker(ThreadPoolExecutor.java:1127) at java.util.concurrent.ThreadPoolExecutor$Worker.run(ThreadPoolExecutor.java:617) at java.lang.Thread.run(Thread.java:745) 24) Thread[id=11268, name=qtp1492821566-11268-selector-ServerConnectorManager@36920755/0, state=RUNNABLE, group=TGRP-MigrateRouteKeyTest] at sun.nio.ch.DevPollArrayWrapper.poll0(Native Method) at sun.nio.ch.DevPollArrayWrapper.poll(DevPollArrayWrapper.java:223) at sun.nio.ch.DevPollSelectorImpl.doSelect(DevPollSelectorImpl.java:84) at sun.nio.ch.SelectorImpl.lockAndDoSelect(SelectorImpl.java:86) at sun.nio.ch.SelectorImpl.select(SelectorImpl.java:97) at sun.nio.ch.SelectorImpl.select(SelectorImpl.java:101) at org.eclipse.jetty.io.SelectorManager$ManagedSelector.select(SelectorManager.java:600) at org.eclipse.jetty.io.SelectorManager$ManagedSelector.run(SelectorManager.java:549) at org.eclipse.jetty.util.thread.NonBlockingThread.run(NonBlockingThread.java:52) at org.eclipse.jetty.util.thread.QueuedThreadPool.runJob(QueuedThreadPool.java:635) at org.eclipse.jetty.util.thread.QueuedThreadPool$3.run(QueuedThreadPool.java:555) at java.lang.Thread.run(Thread.java:745) 25) Thread[id=11313, name=qtp455219478-11313, state=TIMED_WAITING, group=TGRP-MigrateRouteKeyTest] at sun.misc.Unsafe.park(Native Method) at java.util.concurrent.locks.LockSupport.parkNanos(LockSupport.java:215) at java.util.concurrent.locks.AbstractQueuedSynchronizer$ConditionObject.awaitNanos(AbstractQueuedSynchronizer.java:2078) at org.eclipse.jetty.util.BlockingArrayQueue.poll(BlockingArrayQueue.java:389) at org.eclipse.jetty.util.thread.QueuedThreadPool.idleJobPoll(QueuedThreadPool.java:531) at org.eclipse.jetty.util.thread.QueuedThreadPool.access$700(QueuedThreadPool.java:47) at org.eclipse.jetty.util.thread.QueuedThreadPool$3.run(QueuedThreadPool.java:590) at java.lang.Thread.run(Thread.java:745) 26) Thread[id=11316, name=qtp455219478-11316, state=TIMED_WAITING, group=TGRP-MigrateRouteKeyTest] at sun.misc.Unsafe.park(Native Method) at java.util.concurrent.locks.LockSupport.parkNanos(LockSupport.java:215) at java.util.concurrent.locks.AbstractQueuedSynchronizer$ConditionObject.awaitNanos(AbstractQueuedSynchronizer.java:2078) at org.eclipse.jetty.util.BlockingArrayQueue.poll(BlockingArrayQueue.java:389) at org.eclipse.jetty.util.thread.QueuedThreadPool.idleJobPoll(QueuedThreadPool.java:531) at org.eclipse.jetty.util.thread.QueuedThreadPool.access$700(QueuedThreadPool.java:47) at org.eclipse.jetty.util.thread.QueuedThreadPool$3.run(QueuedThreadPool.java:590) at java.lang.Thread.run(Thread.java:745) 27) Thread[id=11329, name=qtp527120189-11329, state=TIMED_WAITING, group=TGRP-MigrateRouteKeyTest] at sun.misc.Unsafe.park(Native Method) at java.util.concurrent.locks.LockSupport.parkNanos(LockSupport.java:215) at java.util.concurrent.locks.AbstractQueuedSynchronizer$ConditionObject.awaitNanos(AbstractQueuedSynchronizer.java:2078) at org.eclipse.jetty.util.BlockingArrayQueue.poll(BlockingArrayQueue.java:389) at org.eclipse.jetty.util.thread.QueuedThreadPool.idleJobPoll(QueuedThreadPool.java:531) at org.eclipse.jetty.util.thread.QueuedThreadPool.access$700(QueuedThreadPool.java:47) at org.eclipse.jetty.util.thread.QueuedThreadPool$3.run(QueuedThreadPool.java:590) at java.lang.Thread.run(Thread.java:745) 28) Thread[id=11300, name=qtp1959989137-11300, state=TIMED_WAITING, group=TGRP-MigrateRouteKeyTest] at sun.misc.Unsafe.park(Native Method) at java.util.concurrent.locks.LockSupport.parkNanos(LockSupport.java:215) at java.util.concurrent.locks.AbstractQueuedSynchronizer$ConditionObject.awaitNanos(AbstractQueuedSynchronizer.java:2078) at org.eclipse.jetty.util.BlockingArrayQueue.poll(BlockingArrayQueue.java:389) at org.eclipse.jetty.util.thread.QueuedThreadPool.idleJobPoll(QueuedThreadPool.java:531) at org.eclipse.jetty.util.thread.QueuedThreadPool.access$700(QueuedThreadPool.java:47) at org.eclipse.jetty.util.thread.QueuedThreadPool$3.run(QueuedThreadPool.java:590) at java.lang.Thread.run(Thread.java:745) 29) Thread[id=11284, name=TEST-MigrateRouteKeyTest.test-seed#[F20DB7A1514425B7]-SendThread(127.0.0.1:64052), state=RUNNABLE, group=TGRP-MigrateRouteKeyTest] at sun.nio.ch.DevPollArrayWrapper.poll0(Native Method) at sun.nio.ch.DevPollArrayWrapper.poll(DevPollArrayWrapper.java:223) at sun.nio.ch.DevPollSelectorImpl.doSelect(DevPollSelectorImpl.java:84) at sun.nio.ch.SelectorImpl.lockAndDoSelect(SelectorImpl.java:86) at sun.nio.ch.SelectorImpl.select(SelectorImpl.java:97) at org.apache.zookeeper.ClientCnxnSocketNIO.doTransport(ClientCnxnSocketNIO.java:349) at org.apache.zookeeper.ClientCnxn$SendThread.run(ClientCnxn.java:1081) 30) Thread[id=11232, name=qtp1549077534-11232, state=TIMED_WAITING, group=TGRP-MigrateRouteKeyTest] at sun.misc.Unsafe.park(Native Method) at java.util.concurrent.locks.LockSupport.parkNanos(LockSupport.java:215) at java.util.concurrent.locks.AbstractQueuedSynchronizer$ConditionObject.awaitNanos(AbstractQueuedSynchronizer.java:2078) at org.eclipse.jetty.util.BlockingArrayQueue.poll(BlockingArrayQueue.java:389) at org.eclipse.jetty.util.thread.QueuedThreadPool.idleJobPoll(QueuedThreadPool.java:531) at org.eclipse.jetty.util.thread.QueuedThreadPool.access$700(QueuedThreadPool.java:47) at org.eclipse.jetty.util.thread.QueuedThreadPool$3.run(QueuedThreadPool.java:590) at java.lang.Thread.run(Thread.java:745) 31) Thread[id=11288, name=Thread-4925, state=WAITING, group=TGRP-MigrateRouteKeyTest] at java.lang.Object.wait(Native Method) at java.lang.Object.wait(Object.java:502) at org.apache.solr.core.CloserThread.run(CoreContainer.java:1153) 32) Thread[id=11247, name=TEST-MigrateRouteKeyTest.test-seed#[F20DB7A1514425B7]-EventThread, state=WAITING, group=TGRP-MigrateRouteKeyTest] at sun.misc.Unsafe.park(Native Method) at java.util.concurrent.locks.LockSupport.park(LockSupport.java:175) at java.util.concurrent.locks.AbstractQueuedSynchronizer$ConditionObject.await(AbstractQueuedSynchronizer.java:2039) at java.util.concurrent.LinkedBlockingQueue.take(LinkedBlockingQueue.java:442) at org.apache.zookeeper.ClientCnxn$EventThread.run(ClientCnxn.java:494) 33) Thread[id=11272, name=qtp1492821566-11272, state=TIMED_WAITING, group=TGRP-MigrateRouteKeyTest] at sun.misc.Unsafe.park(Native Method) at java.util.concurrent.locks.LockSupport.parkNanos(LockSupport.java:215) at java.util.concurrent.locks.AbstractQueuedSynchronizer$ConditionObject.awaitNanos(AbstractQueuedSynchronizer.java:2078) at org.eclipse.jetty.util.BlockingArrayQueue.poll(BlockingArrayQueue.java:389) at org.eclipse.jetty.util.thread.QueuedThreadPool.idleJobPoll(QueuedThreadPool.java:531) at org.eclipse.jetty.util.thread.QueuedThreadPool.access$700(QueuedThreadPool.java:47) at org.eclipse.jetty.util.thread.QueuedThreadPool$3.run(QueuedThreadPool.java:590) at java.lang.Thread.run(Thread.java:745) 34) Thread[id=11318, name=Scheduler-1096462778, state=TIMED_WAITING, group=TGRP-MigrateRouteKeyTest] at sun.misc.Unsafe.park(Native Method) at java.util.concurrent.locks.LockSupport.parkNanos(LockSupport.java:215) at java.util.concurrent.locks.AbstractQueuedSynchronizer$ConditionObject.awaitNanos(AbstractQueuedSynchronizer.java:2078) at java.util.concurrent.ScheduledThreadPoolExecutor$DelayedWorkQueue.take(ScheduledThreadPoolExecutor.java:1093) at java.util.concurrent.ScheduledThreadPoolExecutor$DelayedWorkQueue.take(ScheduledThreadPoolExecutor.java:809) at java.util.concurrent.ThreadPoolExecutor.getTask(ThreadPoolExecutor.java:1067) at java.util.concurrent.ThreadPoolExecutor.runWorker(ThreadPoolExecutor.java:1127) at java.util.concurrent.ThreadPoolExecutor$Worker.run(ThreadPoolExecutor.java:617) at java.lang.Thread.run(Thread.java:745) 35) Thread[id=11319, name=org.eclipse.jetty.server.session.HashSessionManager@46e0651Timer, state=TIMED_WAITING, group=TGRP-MigrateRouteKeyTest] at sun.misc.Unsafe.park(Native Method) at java.util.concurrent.locks.LockSupport.parkNanos(LockSupport.java:215) at java.util.concurrent.locks.AbstractQueuedSynchronizer$ConditionObject.awaitNanos(AbstractQueuedSynchronizer.java:2078) at java.util.concurrent.ScheduledThreadPoolExecutor$DelayedWorkQueue.take(ScheduledThreadPoolExecutor.java:1093) at java.util.concurrent.ScheduledThreadPoolExecutor$DelayedWorkQueue.take(ScheduledThreadPoolExecutor.java:809) at java.util.concurrent.ThreadPoolExecutor.getTask(ThreadPoolExecutor.java:1067) at java.util.concurrent.ThreadPoolExecutor.runWorker(ThreadPoolExecutor.java:1127) at java.util.concurrent.ThreadPoolExecutor$Worker.run(ThreadPoolExecutor.java:617) at java.lang.Thread.run(Thread.java:745) 36) Thread[id=11326, name=qtp527120189-11326, state=TIMED_WAITING, group=TGRP-MigrateRouteKeyTest] at sun.misc.Unsafe.park(Native Method) at java.util.concurrent.locks.LockSupport.parkNanos(LockSupport.java:215) at java.util.concurrent.locks.AbstractQueuedSynchronizer$ConditionObject.awaitNanos(AbstractQueuedSynchronizer.java:2078) at org.eclipse.jetty.util.BlockingArrayQueue.poll(BlockingArrayQueue.java:389) at org.eclipse.jetty.util.thread.QueuedThreadPool.idleJobPoll(QueuedThreadPool.java:531) at org.eclipse.jetty.util.thread.QueuedThreadPool.access$700(QueuedThreadPool.java:47) at org.eclipse.jetty.util.thread.QueuedThreadPool$3.run(QueuedThreadPool.java:590) at java.lang.Thread.run(Thread.java:745) 37) Thread[id=11275, name=qtp1492821566-11275, state=TIMED_WAITING, group=TGRP-MigrateRouteKeyTest] at sun.misc.Unsafe.park(Native Method) at java.util.concurrent.locks.LockSupport.parkNanos(LockSupport.java:215) at java.util.concurrent.locks.AbstractQueuedSynchronizer$ConditionObject.awaitNanos(AbstractQueuedSynchronizer.java:2078) at org.eclipse.jetty.util.BlockingArrayQueue.poll(BlockingArrayQueue.java:389) at org.eclipse.jetty.util.thread.QueuedThreadPool.idleJobPoll(QueuedThreadPool.java:531) at org.eclipse.jetty.util.thread.QueuedThreadPool.access$700(QueuedThreadPool.java:47) at org.eclipse.jetty.util.thread.QueuedThreadPool$3.run(QueuedThreadPool.java:590) at java.lang.Thread.run(Thread.java:745) 38) Thread[id=11292, name=searcherExecutor-4204-thread-1, state=WAITING, group=TGRP-MigrateRouteKeyTest] at sun.misc.Unsafe.park(Native Method) at java.util.concurrent.locks.LockSupport.park(LockSupport.java:175) at java.util.concurrent.locks.AbstractQueuedSynchronizer$ConditionObject.await(AbstractQueuedSynchronizer.java:2039) at java.util.concurrent.LinkedBlockingQueue.take(LinkedBlockingQueue.java:442) at java.util.concurrent.ThreadPoolExecutor.getTask(ThreadPoolExecutor.java:1067) at java.util.concurrent.ThreadPoolExecutor.runWorker(ThreadPoolExecutor.java:1127) at java.util.concurrent.ThreadPoolExecutor$Worker.run(ThreadPoolExecutor.java:617) at java.lang.Thread.run(Thread.java:745) 39) Thread[id=11303, name=qtp1959989137-11303-selector-ServerConnectorManager@4c2af6bd/0, state=RUNNABLE, group=TGRP-MigrateRouteKeyTest] at sun.nio.ch.DevPollArrayWrapper.poll0(Native Method) at sun.nio.ch.DevPollArrayWrapper.poll(DevPollArrayWrapper.java:223) at sun.nio.ch.DevPollSelectorImpl.doSelect(DevPollSelectorImpl.java:84) at sun.nio.ch.SelectorImpl.lockAndDoSelect(SelectorImpl.java:86) at sun.nio.ch.SelectorImpl.select(SelectorImpl.java:97) at sun.nio.ch.SelectorImpl.select(SelectorImpl.java:101) at org.eclipse.jetty.io.SelectorManager$ManagedSelector.select(SelectorManager.java:600) at org.eclipse.jetty.io.SelectorManager$ManagedSelector.run(SelectorManager.java:549) at org.eclipse.jetty.util.thread.NonBlockingThread.run(NonBlockingThread.java:52) at org.eclipse.jetty.util.thread.QueuedThreadPool.runJob(QueuedThreadPool.java:635) at org.eclipse.jetty.util.thread.QueuedThreadPool$3.run(QueuedThreadPool.java:555) at java.lang.Thread.run(Thread.java:745) 40) Thread[id=11304, name=Scheduler-76003184, state=TIMED_WAITING, group=TGRP-MigrateRouteKeyTest] at sun.misc.Unsafe.park(Native Method) at java.util.concurrent.locks.LockSupport.parkNanos(LockSupport.java:215) at java.util.concurrent.locks.AbstractQueuedSynchronizer$ConditionObject.awaitNanos(AbstractQueuedSynchronizer.java:2078) at java.util.concurrent.ScheduledThreadPoolExecutor$DelayedWorkQueue.take(ScheduledThreadPoolExecutor.java:1093) at java.util.concurrent.ScheduledThreadPoolExecutor$DelayedWorkQueue.take(ScheduledThreadPoolExecutor.java:809) at java.util.concurrent.ThreadPoolExecutor.getTask(ThreadPoolExecutor.java:1067) at java.util.concurrent.ThreadPoolExecutor.runWorker(ThreadPoolExecutor.java:1127) at java.util.concurrent.ThreadPoolExecutor$Worker.run(ThreadPoolExecutor.java:617) at java.lang.Thread.run(Thread.java:745) 41) Thread[id=11228, name=qtp1549077534-11228-acceptor-0@5308704c-ServerConnector@169629f8{HTTP/1.1}{127.0.0.1:36280}, state=RUNNABLE, group=TGRP-MigrateRouteKeyTest] at sun.nio.ch.ServerSocketChannelImpl.accept0(Native Method) at sun.nio.ch.ServerSocketChannelImpl.accept(ServerSocketChannelImpl.java:422) at sun.nio.ch.ServerSocketChannelImpl.accept(ServerSocketChannelImpl.java:250) at org.eclipse.jetty.server.ServerConnector.accept(ServerConnector.java:377) at org.eclipse.jetty.server.AbstractConnector$Acceptor.run(AbstractConnector.java:500) at org.eclipse.jetty.util.thread.QueuedThreadPool.runJob(QueuedThreadPool.java:635) at org.eclipse.jetty.util.thread.QueuedThreadPool$3.run(QueuedThreadPool.java:555) at java.lang.Thread.run(Thread.java:745) 42) Thread[id=11333, name=qtp527120189-11333-acceptor-0@67c06a64-ServerConnector@6ea09a24{HTTP/1.1}{127.0.0.1:44921}, state=RUNNABLE, group=TGRP-MigrateRouteKeyTest] at sun.nio.ch.ServerSocketChannelImpl.accept0(Native Method) at sun.nio.ch.ServerSocketChannelImpl.accept(ServerSocketChannelImpl.java:422) at sun.nio.ch.ServerSocketChannelImpl.accept(ServerSocketChannelImpl.java:250) at org.eclipse.jetty.server.ServerConnector.accept(ServerConnector.java:377) at org.eclipse.jetty.server.AbstractConnector$Acceptor.run(AbstractConnector.java:500) at org.eclipse.jetty.util.thread.QueuedThreadPool.runJob(QueuedThreadPool.java:635) at org.eclipse.jetty.util.thread.QueuedThreadPool$3.run(QueuedThreadPool.java:555) at java.lang.Thread.run(Thread.java:745) 43) Thread[id=11328, name=qtp527120189-11328, state=TIMED_WAITING, group=TGRP-MigrateRouteKeyTest] at sun.misc.Unsafe.park(Native Method) at java.util.concurrent.locks.LockSupport.parkNanos(LockSupport.java:215) at java.util.concurrent.locks.AbstractQueuedSynchronizer$ConditionObject.awaitNanos(AbstractQueuedSynchronizer.java:2078) at org.eclipse.jetty.util.BlockingArrayQueue.poll(BlockingArrayQueue.java:389) at org.eclipse.jetty.util.thread.QueuedThreadPool.idleJobPoll(QueuedThreadPool.java:531) at org.eclipse.jetty.util.thread.QueuedThreadPool.access$700(QueuedThreadPool.java:47) at org.eclipse.jetty.util.thread.QueuedThreadPool$3.run(QueuedThreadPool.java:590) at java.lang.Thread.run(Thread.java:745) 44) Thread[id=11332, name=org.eclipse.jetty.server.session.HashSessionManager@40fb02a4Timer, state=TIMED_WAITING, group=TGRP-MigrateRouteKeyTest] at sun.misc.Unsafe.park(Native Method) at java.util.concurrent.locks.LockSupport.parkNanos(LockSupport.java:215) at java.util.concurrent.locks.AbstractQueuedSynchronizer$ConditionObject.awaitNanos(AbstractQueuedSynchronizer.java:2078) at java.util.concurrent.ScheduledThreadPoolExecutor$DelayedWorkQueue.take(ScheduledThreadPoolExecutor.java:1093) at java.util.concurrent.ScheduledThreadPoolExecutor$DelayedWorkQueue.take(ScheduledThreadPoolExecutor.java:809) at java.util.concurrent.ThreadPoolExecutor.getTask(ThreadPoolExecutor.java:1067) at java.util.concurrent.ThreadPoolExecutor.runWorker(ThreadPoolExecutor.java:1127) at java.util.concurrent.ThreadPoolExecutor$Worker.run(ThreadPoolExecutor.java:617) at java.lang.Thread.run(Thread.java:745) 45) Thread[id=11315, name=qtp455219478-11315, state=TIMED_WAITING, group=TGRP-MigrateRouteKeyTest] at sun.misc.Unsafe.park(Native Method) at java.util.concurrent.locks.LockSupport.parkNanos(LockSupport.java:215) at java.util.concurrent.locks.AbstractQueuedSynchronizer$ConditionObject.awaitNanos(AbstractQueuedSynchronizer.java:2078) at org.eclipse.jetty.util.BlockingArrayQueue.poll(BlockingArrayQueue.java:389) at org.eclipse.jetty.util.thread.QueuedThreadPool.idleJobPoll(QueuedThreadPool.java:531) at org.eclipse.jetty.util.thread.QueuedThreadPool.access$700(QueuedThreadPool.java:47) at org.eclipse.jetty.util.thread.QueuedThreadPool$3.run(QueuedThreadPool.java:590) at java.lang.Thread.run(Thread.java:745) 46) Thread[id=11312, name=qtp455219478-11312, state=TIMED_WAITING, group=TGRP-MigrateRouteKeyTest] at sun.misc.Unsafe.park(Native Method) at java.util.concurrent.locks.LockSupport.parkNanos(LockSupport.java:215) at java.util.concurrent.locks.AbstractQueuedSynchronizer$ConditionObject.awaitNanos(AbstractQueuedSynchronizer.java:2078) at org.eclipse.jetty.util.BlockingArrayQueue.poll(BlockingArrayQueue.java:389) at org.eclipse.jetty.util.thread.QueuedThreadPool.idleJobPoll(QueuedThreadPool.java:531) at org.eclipse.jetty.util.thread.QueuedThreadPool.access$700(QueuedThreadPool.java:47) at org.eclipse.jetty.util.thread.QueuedThreadPool$3.run(QueuedThreadPool.java:590) at java.lang.Thread.run(Thread.java:745) 47) Thread[id=11271, name=qtp1492821566-11271, state=TIMED_WAITING, group=TGRP-MigrateRouteKeyTest] at sun.misc.Unsafe.park(Native Method) at java.util.concurrent.locks.LockSupport.parkNanos(LockSupport.java:215) at java.util.concurrent.locks.AbstractQueuedSynchronizer$ConditionObject.awaitNanos(AbstractQueuedSynchronizer.java:2078) at org.eclipse.jetty.util.BlockingArrayQueue.poll(BlockingArrayQueue.java:389) at org.eclipse.jetty.util.thread.QueuedThreadPool.idleJobPoll(QueuedThreadPool.java:531) at org.eclipse.jetty.util.thread.QueuedThreadPool.access$700(QueuedThreadPool.java:47) at org.eclipse.jetty.util.thread.QueuedThreadPool$3.run(QueuedThreadPool.java:590) at java.lang.Thread.run(Thread.java:745) 48) Thread[id=11257, name=searcherExecutor-4193-thread-1, state=WAITING, group=TGRP-MigrateRouteKeyTest] at sun.misc.Unsafe.park(Native Method) at java.util.concurrent.locks.LockSupport.park(LockSupport.java:175) at java.util.concurrent.locks.AbstractQueuedSynchronizer$ConditionObject.await(AbstractQueuedSynchronizer.java:2039) at java.util.concurrent.LinkedBlockingQueue.take(LinkedBlockingQueue.java:442) at java.util.concurrent.ThreadPoolExecutor.getTask(ThreadPoolExecutor.java:1067) at java.util.concurrent.ThreadPoolExecutor.runWorker(ThreadPoolExecutor.java:1127) at java.util.concurrent.ThreadPoolExecutor$Worker.run(ThreadPoolExecutor.java:617) at java.lang.Thread.run(Thread.java:745) 49) Thread[id=11270, name=qtp1492821566-11270, state=TIMED_WAITING, group=TGRP-MigrateRouteKeyTest] at sun.misc.Unsafe.park(Native Method) at java.util.concurrent.locks.LockSupport.parkNanos(LockSupport.java:215) at java.util.concurrent.locks.AbstractQueuedSynchronizer$ConditionObject.awaitNanos(AbstractQueuedSynchronizer.java:2078) at org.eclipse.jetty.util.BlockingArrayQueue.poll(BlockingArrayQueue.java:389) at org.eclipse.jetty.util.thread.QueuedThreadPool.idleJobPoll(QueuedThreadPool.java:531) at org.eclipse.jetty.util.thread.QueuedThreadPool.access$700(QueuedThreadPool.java:47) at org.eclipse.jetty.util.thread.QueuedThreadPool$3.run(QueuedThreadPool.java:590) at java.lang.Thread.run(Thread.java:745) 50) Thread[id=11325, name=qtp527120189-11325-selector-ServerConnectorManager@5a471e42/0, state=RUNNABLE, group=TGRP-MigrateRouteKeyTest] at sun.nio.ch.DevPollArrayWrapper.poll0(Native Method) at sun.nio.ch.DevPollArrayWrapper.poll(DevPollArrayWrapper.java:223) at sun.nio.ch.DevPollSelectorImpl.doSelect(DevPollSelectorImpl.java:84) at sun.nio.ch.SelectorImpl.lockAndDoSelect(SelectorImpl.java:86) at sun.nio.ch.SelectorImpl.select(SelectorImpl.java:97) at sun.nio.ch.SelectorImpl.select(SelectorImpl.java:101) at org.eclipse.jetty.io.SelectorManager$ManagedSelector.select(SelectorManager.java:600) at org.eclipse.jetty.io.SelectorManager$ManagedSelector.run(SelectorManager.java:549) at org.eclipse.jetty.util.thread.NonBlockingThread.run(NonBlockingThread.java:52) at org.eclipse.jetty.util.thread.QueuedThreadPool.runJob(QueuedThreadPool.java:635) at org.eclipse.jetty.util.thread.QueuedThreadPool$3.run(QueuedThreadPool.java:555) at java.lang.Thread.run(Thread.java:745) 51) Thread[id=11277, name=org.eclipse.jetty.server.session.HashSessionManager@23a8d1c0Timer, state=TIMED_WAITING, group=TGRP-MigrateRouteKeyTest] at sun.misc.Unsafe.park(Native Method) at java.util.concurrent.locks.LockSupport.parkNanos(LockSupport.java:215) at java.util.concurrent.locks.AbstractQueuedSynchronizer$ConditionObject.awaitNanos(AbstractQueuedSynchronizer.java:2078) at java.util.concurrent.ScheduledThreadPoolExecutor$DelayedWorkQueue.take(ScheduledThreadPoolExecutor.java:1093) at java.util.concurrent.ScheduledThreadPoolExecutor$DelayedWorkQueue.take(ScheduledThreadPoolExecutor.java:809) at java.util.concurrent.ThreadPoolExecutor.getTask(ThreadPoolExecutor.java:1067) at java.util.concurrent.ThreadPoolExecutor.runWorker(ThreadPoolExecutor.java:1127) at java.util.concurrent.ThreadPoolExecutor$Worker.run(ThreadPoolExecutor.java:617) at java.lang.Thread.run(Thread.java:745) 52) Thread[id=11331, name=Scheduler-1219865042, state=TIMED_WAITING, group=TGRP-MigrateRouteKeyTest] at sun.misc.Unsafe.park(Native Method) at java.util.concurrent.locks.LockSupport.parkNanos(LockSupport.java:215) at java.util.concurrent.locks.AbstractQueuedSynchronizer$ConditionObject.awaitNanos(AbstractQueuedSynchronizer.java:2078) at java.util.concurrent.ScheduledThreadPoolExecutor$DelayedWorkQueue.take(ScheduledThreadPoolExecutor.java:1093) at java.util.concurrent.ScheduledThreadPoolExecutor$DelayedWorkQueue.take(ScheduledThreadPoolExecutor.java:809) at java.util.concurrent.ThreadPoolExecutor.getTask(ThreadPoolExecutor.java:1067) at java.util.concurrent.ThreadPoolExecutor.runWorker(ThreadPoolExecutor.java:1127) at java.util.concurrent.ThreadPoolExecutor$Worker.run(ThreadPoolExecutor.java:617) at java.lang.Thread.run(Thread.java:745) 53) Thread[id=11233, name=qtp1549077534-11233, state=TIMED_WAITING, group=TGRP-MigrateRouteKeyTest] at sun.misc.Unsafe.park(Native Method) at java.util.concurrent.locks.LockSupport.parkNanos(LockSupport.java:215) at java.util.concurrent.locks.AbstractQueuedSynchronizer$ConditionObject.awaitNanos(AbstractQueuedSynchronizer.java:2078) at org.eclipse.jetty.util.BlockingArrayQueue.poll(BlockingArrayQueue.java:389) at org.eclipse.jetty.util.thread.QueuedThreadPool.idleJobPoll(QueuedThreadPool.java:531) at org.eclipse.jetty.util.thread.QueuedThreadPool.access$700(QueuedThreadPool.java:47) at org.eclipse.jetty.util.thread.QueuedThreadPool$3.run(QueuedThreadPool.java:590) at java.lang.Thread.run(Thread.java:745) 54) Thread[id=11274, name=qtp1492821566-11274, state=TIMED_WAITING, group=TGRP-MigrateRouteKeyTest] at sun.misc.Unsafe.park(Native Method) at java.util.concurrent.locks.LockSupport.parkNanos(LockSupport.java:215) at java.util.concurrent.locks.AbstractQueuedSynchronizer$ConditionObject.awaitNanos(AbstractQueuedSynchronizer.java:2078) at org.eclipse.jetty.util.BlockingArrayQueue.poll(BlockingArrayQueue.java:389) at org.eclipse.jetty.util.thread.QueuedThreadPool.idleJobPoll(QueuedThreadPool.java:531) at org.eclipse.jetty.util.thread.QueuedThreadPool.access$700(QueuedThreadPool.java:47) at org.eclipse.jetty.util.thread.QueuedThreadPool$3.run(QueuedThreadPool.java:590) at java.lang.Thread.run(Thread.java:745) 55) Thread[id=11305, name=org.eclipse.jetty.server.session.HashSessionManager@13a1853fTimer, state=TIMED_WAITING, group=TGRP-MigrateRouteKeyTest] at sun.misc.Unsafe.park(Native Method) at java.util.concurrent.locks.LockSupport.parkNanos(LockSupport.java:215) at java.util.concurrent.locks.AbstractQueuedSynchronizer$ConditionObject.awaitNanos(AbstractQueuedSynchronizer.java:2078) at java.util.concurrent.ScheduledThreadPoolExecutor$DelayedWorkQueue.take(ScheduledThreadPoolExecutor.java:1093) at java.util.concurrent.ScheduledThreadPoolExecutor$DelayedWorkQueue.take(ScheduledThreadPoolExecutor.java:809) at java.util.concurrent.ThreadPoolExecutor.getTask(ThreadPoolExecutor.java:1067) at java.util.concurrent.ThreadPoolExecutor.runWorker(ThreadPoolExecutor.java:1127) at java.util.concurrent.ThreadPoolExecutor$Worker.run(ThreadPoolExecutor.java:617) at java.lang.Thread.run(Thread.java:745) 56) Thread[id=11261, name=TEST-MigrateRouteKeyTest.test-seed#[F20DB7A1514425B7]-EventThread, state=WAITING, group=TGRP-MigrateRouteKeyTest] at sun.misc.Unsafe.park(Native Method) at java.util.concurrent.locks.LockSupport.park(LockSupport.java:175) at java.util.concurrent.locks.AbstractQueuedSynchronizer$ConditionObject.await(AbstractQueuedSynchronizer.java:2039) at java.util.concurrent.LinkedBlockingQueue.take(LinkedBlockingQueue.java:442) at org.apache.zookeeper.ClientCnxn$EventThread.run(ClientCnxn.java:494) 57) Thread[id=11327, name=qtp527120189-11327, state=TIMED_WAITING, group=TGRP-MigrateRouteKeyTest] at sun.misc.Unsafe.park(Native Method) at java.util.concurrent.locks.LockSupport.parkNanos(LockSupport.java:215) at java.util.concurrent.locks.AbstractQueuedSynchronizer$ConditionObject.awaitNanos(AbstractQueuedSynchronizer.java:2078) at org.eclipse.jetty.util.BlockingArrayQueue.poll(BlockingArrayQueue.java:389) at org.eclipse.jetty.util.thread.QueuedThreadPool.idleJobPoll(QueuedThreadPool.java:531) at org.eclipse.jetty.util.thread.QueuedThreadPool.access$700(QueuedThreadPool.java:47) at org.eclipse.jetty.util.thread.QueuedThreadPool$3.run(QueuedThreadPool.java:590) at java.lang.Thread.run(Thread.java:745) 58) Thread[id=11235, name=Scheduler-533146129, state=TIMED_WAITING, group=TGRP-MigrateRouteKeyTest] at sun.misc.Unsafe.park(Native Method) at java.util.concurrent.locks.LockSupport.parkNanos(LockSupport.java:215) at java.util.concurrent.locks.AbstractQueuedSynchronizer$ConditionObject.awaitNanos(AbstractQueuedSynchronizer.java:2078) at java.util.concurrent.ScheduledThreadPoolExecutor$DelayedWorkQueue.take(ScheduledThreadPoolExecutor.java:1093) at java.util.concurrent.ScheduledThreadPoolExecutor$DelayedWorkQueue.take(ScheduledThreadPoolExecutor.java:809) at java.util.concurrent.ThreadPoolExecutor.getTask(ThreadPoolExecutor.java:1067) at java.util.concurrent.ThreadPoolExecutor.runWorker(ThreadPoolExecutor.java:1127) at java.util.concurrent.ThreadPoolExecutor$Worker.run(ThreadPoolExecutor.java:617) at java.lang.Thread.run(Thread.java:745) 59) Thread[id=11253, name=Thread-4912, state=WAITING, group=TGRP-MigrateRouteKeyTest] at java.lang.Object.wait(Native Method) at java.lang.Object.wait(Object.java:502) at org.apache.solr.core.CloserThread.run(CoreContainer.java:1153) 60) Thread[id=11229, name=qtp1549077534-11229, state=TIMED_WAITING, group=TGRP-MigrateRouteKeyTest] at sun.misc.Unsafe.park(Native Method) at java.util.concurrent.locks.LockSupport.parkNanos(LockSupport.java:215) at java.util.concurrent.locks.AbstractQueuedSynchronizer$ConditionObject.awaitNanos(AbstractQueuedSynchronizer.java:2078) at org.eclipse.jetty.util.BlockingArrayQueue.poll(BlockingArrayQueue.java:389) at org.eclipse.jetty.util.thread.QueuedThreadPool.idleJobPoll(QueuedThreadPool.java:531) at org.eclipse.jetty.util.thread.QueuedThreadPool.access$700(QueuedThreadPool.java:47) at org.eclipse.jetty.util.thread.QueuedThreadPool$3.run(QueuedThreadPool.java:590) at java.lang.Thread.run(Thread.java:745) 61) Thread[id=11296, name=qtp1959989137-11296, state=TIMED_WAITING, group=TGRP-MigrateRouteKeyTest] at sun.misc.Unsafe.park(Native Method) at java.util.concurrent.locks.LockSupport.parkNanos(LockSupport.java:215) at java.util.concurrent.locks.AbstractQueuedSynchronizer$ConditionObject.awaitNanos(AbstractQueuedSynchronizer.java:2078) at org.eclipse.jetty.util.BlockingArrayQueue.poll(BlockingArrayQueue.java:389) at org.eclipse.jetty.util.thread.QueuedThreadPool.idleJobPoll(QueuedThreadPool.java:531) at org.eclipse.jetty.util.thread.QueuedThreadPool.access$700(QueuedThreadPool.java:47) at org.eclipse.jetty.util.thread.QueuedThreadPool$3.run(QueuedThreadPool.java:590) at java.lang.Thread.run(Thread.java:745) 62) Thread[id=11249, name=OverseerStateUpdate-94550356689485828-127.0.0.1:36280_-n_0000000000, state=TIMED_WAITING, group=Overseer state updater.] at sun.misc.Unsafe.park(Native Method) at java.util.concurrent.locks.LockSupport.parkNanos(LockSupport.java:215) at java.util.concurrent.locks.AbstractQueuedSynchronizer$ConditionObject.awaitNanos(AbstractQueuedSynchronizer.java:2078) at org.apache.solr.cloud.DistributedQueue.peek(DistributedQueue.java:169) at org.apache.solr.cloud.DistributedQueue.peek(DistributedQueue.java:143) at org.apache.solr.cloud.Overseer$ClusterStateUpdater.run(Overseer.java:193) at java.lang.Thread.run(Thread.java:745) 63) Thread[id=11330, name=qtp527120189-11330, state=TIMED_WAITING, group=TGRP-MigrateRouteKeyTest] at sun.misc.Unsafe.park(Native Method) at java.util.concurrent.locks.LockSupport.parkNanos(LockSupport.java:215) at java.util.concurrent.locks.AbstractQueuedSynchronizer$ConditionObject.awaitNanos(AbstractQueuedSynchronizer.java:2078) at org.eclipse.jetty.util.BlockingArrayQueue.poll(BlockingArrayQueue.java:389) at org.eclipse.jetty.util.thread.QueuedThreadPool.idleJobPoll(QueuedThreadPool.java:531) at org.eclipse.jetty.util.thread.QueuedThreadPool.access$700(QueuedThreadPool.java:47) at org.eclipse.jetty.util.thread.QueuedThreadPool$3.run(QueuedThreadPool.java:590) at java.lang.Thread.run(Thread.java:745) 64) Thread[id=11310, name=qtp455219478-11310-acceptor-0@784f4b29-ServerConnector@9a6fbaf{HTTP/1.1}{127.0.0.1:57122}, state=RUNNABLE, group=TGRP-MigrateRouteKeyTest] at sun.nio.ch.ServerSocketChannelImpl.accept0(Native Method) at sun.nio.ch.ServerSocketChannelImpl.accept(ServerSocketChannelImpl.java:422) at sun.nio.ch.ServerSocketChannelImpl.accept(ServerSocketChannelImpl.java:250) at org.eclipse.jetty.server.ServerConnector.accept(ServerConnector.java:377) at org.eclipse.jetty.server.AbstractConnector$Acceptor.run(AbstractConnector.java:500) at org.eclipse.jetty.util.thread.QueuedThreadPool.runJob(QueuedThreadPool.java:635) at org.eclipse.jetty.util.thread.QueuedThreadPool$3.run(QueuedThreadPool.java:555) at java.lang.Thread.run(Thread.java:745) 65) Thread[id=11246, name=TEST-MigrateRouteKeyTest.test-seed#[F20DB7A1514425B7]-SendThread(127.0.0.1:64052), state=RUNNABLE, group=TGRP-MigrateRouteKeyTest] at sun.nio.ch.DevPollArrayWrapper.poll0(Native Method) at sun.nio.ch.DevPollArrayWrapper.poll(DevPollArrayWrapper.java:223) at sun.nio.ch.DevPollSelectorImpl.doSelect(DevPollSelectorImpl.java:84) at sun.nio.ch.SelectorImpl.lockAndDoSelect(SelectorImpl.java:86) at sun.nio.ch.SelectorImpl.select(SelectorImpl.java:97) at org.apache.zookeeper.ClientCnxnSocketNIO.doTransport(ClientCnxnSocketNIO.java:349) at org.apache.zookeeper.ClientCnxn$SendThread.run(ClientCnxn.java:1081) 66) Thread[id=11227, name=qtp1549077534-11227-selector-ServerConnectorManager@6273df80/0, state=RUNNABLE, group=TGRP-MigrateRouteKeyTest] at sun.nio.ch.DevPollArrayWrapper.poll0(Native Method) at sun.nio.ch.DevPollArrayWrapper.poll(DevPollArrayWrapper.java:223) at sun.nio.ch.DevPollSelectorImpl.doSelect(DevPollSelectorImpl.java:84) at sun.nio.ch.SelectorImpl.lockAndDoSelect(SelectorImpl.java:86) at sun.nio.ch.SelectorImpl.select(SelectorImpl.java:97) at sun.nio.ch.SelectorImpl.select(SelectorImpl.java:101) at org.eclipse.jetty.io.SelectorManager$ManagedSelector.select(SelectorManager.java:600) at org.eclipse.jetty.io.SelectorManager$ManagedSelector.run(SelectorManager.java:549) at org.eclipse.jetty.util.thread.NonBlockingThread.run(NonBlockingThread.java:52) at org.eclipse.jetty.util.thread.QueuedThreadPool.runJob(QueuedThreadPool.java:635) at org.eclipse.jetty.util.thread.QueuedThreadPool$3.run(QueuedThreadPool.java:555) at java.lang.Thread.run(Thread.java:745) 67) Thread[id=11219, name=ProcessThread(sid:0 cport:-1):, state=WAITING, group=TGRP-MigrateRouteKeyTest] at sun.misc.Unsafe.park(Native Method) at java.util.concurrent.locks.LockSupport.park(LockSupport.java:175) at java.util.concurrent.locks.AbstractQueuedSynchronizer$ConditionObject.await(AbstractQueuedSynchronizer.java:2039) at java.util.concurrent.LinkedBlockingQueue.take(LinkedBlockingQueue.java:442) at org.apache.zookeeper.server.PrepRequestProcessor.run(PrepRequestProcessor.java:120) 68) Thread[id=11311, name=qtp455219478-11311, state=TIMED_WAITING, group=TGRP-MigrateRouteKeyTest] at sun.misc.Unsafe.park(Native Method) at java.util.concurrent.locks.LockSupport.parkNanos(LockSupport.java:215) at java.util.concurrent.locks.AbstractQueuedSynchronizer$ConditionObject.awaitNanos(AbstractQueuedSynchronizer.java:2078) at org.eclipse.jetty.util.BlockingArrayQueue.poll(BlockingArrayQueue.java:389) at org.eclipse.jetty.util.thread.QueuedThreadPool.idleJobPoll(QueuedThreadPool.java:531) at org.eclipse.jetty.util.thread.QueuedThreadPool.access$700(QueuedThreadPool.java:47) at org.eclipse.jetty.util.thread.QueuedThreadPool$3.run(QueuedThreadPool.java:590) at java.lang.Thread.run(Thread.java:745)
Stack Trace:
com.carrotsearch.randomizedtesting.ThreadLeakError: 68 threads leaked from SUITE scope at org.apache.solr.cloud.MigrateRouteKeyTest:
1) Thread[id=11216, name=NIOServerCxn.Factory:0.0.0.0/0.0.0.0:0, state=RUNNABLE, group=TGRP-MigrateRouteKeyTest]
at sun.nio.ch.DevPollArrayWrapper.poll0(Native Method)
at sun.nio.ch.DevPollArrayWrapper.poll(DevPollArrayWrapper.java:223)
at sun.nio.ch.DevPollSelectorImpl.doSelect(DevPollSelectorImpl.java:84)
at sun.nio.ch.SelectorImpl.lockAndDoSelect(SelectorImpl.java:86)
at sun.nio.ch.SelectorImpl.select(SelectorImpl.java:97)
at org.apache.zookeeper.server.NIOServerCnxnFactory.run(NIOServerCnxnFactory.java:178)
at java.lang.Thread.run(Thread.java:745)
2) Thread[id=11298, name=qtp1959989137-11298-acceptor-0@4134c43-ServerConnector@549d1215{HTTP/1.1}{127.0.0.1:64052}, state=RUNNABLE, group=TGRP-MigrateRouteKeyTest]
at sun.nio.ch.ServerSocketChannelImpl.accept0(Native Method)
at sun.nio.ch.ServerSocketChannelImpl.accept(ServerSocketChannelImpl.java:422)
at sun.nio.ch.ServerSocketChannelImpl.accept(ServerSocketChannelImpl.java:250)
at org.eclipse.jetty.server.ServerConnector.accept(ServerConnector.java:377)
at org.eclipse.jetty.server.AbstractConnector$Acceptor.run(AbstractConnector.java:500)
at org.eclipse.jetty.util.thread.QueuedThreadPool.runJob(QueuedThreadPool.java:635)
at org.eclipse.jetty.util.thread.QueuedThreadPool$3.run(QueuedThreadPool.java:555)
at java.lang.Thread.run(Thread.java:745)
3) Thread[id=11317, name=qtp455219478-11317-selector-ServerConnectorManager@463ae160/0, state=RUNNABLE, group=TGRP-MigrateRouteKeyTest]
at sun.nio.ch.DevPollArrayWrapper.poll0(Native Method)
at sun.nio.ch.DevPollArrayWrapper.poll(DevPollArrayWrapper.java:223)
at sun.nio.ch.DevPollSelectorImpl.doSelect(DevPollSelectorImpl.java:84)
at sun.nio.ch.SelectorImpl.lockAndDoSelect(SelectorImpl.java:86)
at sun.nio.ch.SelectorImpl.select(SelectorImpl.java:97)
at sun.nio.ch.SelectorImpl.select(SelectorImpl.java:101)
at org.eclipse.jetty.io.SelectorManager$ManagedSelector.select(SelectorManager.java:600)
at org.eclipse.jetty.io.SelectorManager$ManagedSelector.run(SelectorManager.java:549)
at org.eclipse.jetty.util.thread.NonBlockingThread.run(NonBlockingThread.java:52)
at org.eclipse.jetty.util.thread.QueuedThreadPool.runJob(QueuedThreadPool.java:635)
at org.eclipse.jetty.util.thread.QueuedThreadPool$3.run(QueuedThreadPool.java:555)
at java.lang.Thread.run(Thread.java:745)
4) Thread[id=11335, name=qtp527120189-11335, state=TIMED_WAITING, group=TGRP-MigrateRouteKeyTest]
at sun.misc.Unsafe.park(Native Method)
at java.util.concurrent.locks.LockSupport.parkNanos(LockSupport.java:215)
at java.util.concurrent.locks.AbstractQueuedSynchronizer$ConditionObject.awaitNanos(AbstractQueuedSynchronizer.java:2078)
at org.eclipse.jetty.util.BlockingArrayQueue.poll(BlockingArrayQueue.java:389)
at org.eclipse.jetty.util.thread.QueuedThreadPool.idleJobPoll(QueuedThreadPool.java:531)
at org.eclipse.jetty.util.thread.QueuedThreadPool.access$700(QueuedThreadPool.java:47)
at org.eclipse.jetty.util.thread.QueuedThreadPool$3.run(QueuedThreadPool.java:590)
at java.lang.Thread.run(Thread.java:745)
5) Thread[id=11240, name=qtp1549077534-11240, state=TIMED_WAITING, group=TGRP-MigrateRouteKeyTest]
at sun.misc.Unsafe.park(Native Method)
at java.util.concurrent.locks.LockSupport.parkNanos(LockSupport.java:215)
at java.util.concurrent.locks.AbstractQueuedSynchronizer$ConditionObject.awaitNanos(AbstractQueuedSynchronizer.java:2078)
at org.eclipse.jetty.util.BlockingArrayQueue.poll(BlockingArrayQueue.java:389)
at org.eclipse.jetty.util.thread.QueuedThreadPool.idleJobPoll(QueuedThreadPool.java:531)
at org.eclipse.jetty.util.thread.QueuedThreadPool.access$700(QueuedThreadPool.java:47)
at org.eclipse.jetty.util.thread.QueuedThreadPool$3.run(QueuedThreadPool.java:590)
at java.lang.Thread.run(Thread.java:745)
6) Thread[id=11308, name=Scheduler-1330973845, state=TIMED_WAITING, group=TGRP-MigrateRouteKeyTest]
at sun.misc.Unsafe.park(Native Method)
at java.util.concurrent.locks.LockSupport.parkNanos(LockSupport.java:215)
at java.util.concurrent.locks.AbstractQueuedSynchronizer$ConditionObject.awaitNanos(AbstractQueuedSynchronizer.java:2078)
at java.util.concurrent.ScheduledThreadPoolExecutor$DelayedWorkQueue.take(ScheduledThreadPoolExecutor.java:1093)
at java.util.concurrent.ScheduledThreadPoolExecutor$DelayedWorkQueue.take(ScheduledThreadPoolExecutor.java:809)
at java.util.concurrent.ThreadPoolExecutor.getTask(ThreadPoolExecutor.java:1067)
at java.util.concurrent.ThreadPoolExecutor.runWorker(ThreadPoolExecutor.java:1127)
at java.util.concurrent.ThreadPoolExecutor$Worker.run(ThreadPoolExecutor.java:617)
at java.lang.Thread.run(Thread.java:745)
7) Thread[id=11260, name=TEST-MigrateRouteKeyTest.test-seed#[F20DB7A1514425B7]-SendThread(127.0.0.1:64052), state=RUNNABLE, group=TGRP-MigrateRouteKeyTest]
at sun.nio.ch.DevPollArrayWrapper.poll0(Native Method)
at sun.nio.ch.DevPollArrayWrapper.poll(DevPollArrayWrapper.java:223)
at sun.nio.ch.DevPollSelectorImpl.doSelect(DevPollSelectorImpl.java:84)
at sun.nio.ch.SelectorImpl.lockAndDoSelect(SelectorImpl.java:86)
at sun.nio.ch.SelectorImpl.select(SelectorImpl.java:97)
at org.apache.zookeeper.ClientCnxnSocketNIO.doTransport(ClientCnxnSocketNIO.java:349)
at org.apache.zookeeper.ClientCnxn$SendThread.run(ClientCnxn.java:1081)
8) Thread[id=11251, name=OverseerHdfsCoreFailoverThread-94550356689485828-127.0.0.1:36280_-n_0000000000, state=TIMED_WAITING, group=Overseer Hdfs SolrCore Failover Thread.]
at java.lang.Thread.sleep(Native Method)
at org.apache.solr.cloud.OverseerAutoReplicaFailoverThread.run(OverseerAutoReplicaFailoverThread.java:139)
at java.lang.Thread.run(Thread.java:745)
9) Thread[id=11234, name=qtp1549077534-11234, state=TIMED_WAITING, group=TGRP-MigrateRouteKeyTest]
at sun.misc.Unsafe.park(Native Method)
at java.util.concurrent.locks.LockSupport.parkNanos(LockSupport.java:215)
at java.util.concurrent.locks.AbstractQueuedSynchronizer$ConditionObject.awaitNanos(AbstractQueuedSynchronizer.java:2078)
at org.eclipse.jetty.util.BlockingArrayQueue.poll(BlockingArrayQueue.java:389)
at org.eclipse.jetty.util.thread.QueuedThreadPool.idleJobPoll(QueuedThreadPool.java:531)
at org.eclipse.jetty.util.thread.QueuedThreadPool.access$700(QueuedThreadPool.java:47)
at org.eclipse.jetty.util.thread.QueuedThreadPool$3.run(QueuedThreadPool.java:590)
at java.lang.Thread.run(Thread.java:745)
10) Thread[id=11302, name=qtp1959989137-11302, state=TIMED_WAITING, group=TGRP-MigrateRouteKeyTest]
at sun.misc.Unsafe.park(Native Method)
at java.util.concurrent.locks.LockSupport.parkNanos(LockSupport.java:215)
at java.util.concurrent.locks.AbstractQueuedSynchronizer$ConditionObject.awaitNanos(AbstractQueuedSynchronizer.java:2078)
at org.eclipse.jetty.util.BlockingArrayQueue.poll(BlockingArrayQueue.java:389)
at org.eclipse.jetty.util.thread.QueuedThreadPool.idleJobPoll(QueuedThreadPool.java:531)
at org.eclipse.jetty.util.thread.QueuedThreadPool.access$700(QueuedThreadPool.java:47)
at org.eclipse.jetty.util.thread.QueuedThreadPool$3.run(QueuedThreadPool.java:590)
at java.lang.Thread.run(Thread.java:745)
11) Thread[id=11215, name=Thread-4899, state=WAITING, group=TGRP-MigrateRouteKeyTest]
at java.lang.Object.wait(Native Method)
at java.lang.Thread.join(Thread.java:1245)
at java.lang.Thread.join(Thread.java:1319)
at org.apache.zookeeper.server.NIOServerCnxnFactory.join(NIOServerCnxnFactory.java:302)
at org.apache.solr.cloud.ZkTestServer$ZKServerMain.runFromConfig(ZkTestServer.java:310)
at org.apache.solr.cloud.ZkTestServer$2.run(ZkTestServer.java:491)
12) Thread[id=11285, name=TEST-MigrateRouteKeyTest.test-seed#[F20DB7A1514425B7]-EventThread, state=WAITING, group=TGRP-MigrateRouteKeyTest]
at sun.misc.Unsafe.park(Native Method)
at java.util.concurrent.locks.LockSupport.park(LockSupport.java:175)
at java.util.concurrent.locks.AbstractQueuedSynchronizer$ConditionObject.await(AbstractQueuedSynchronizer.java:2039)
at java.util.concurrent.LinkedBlockingQueue.take(LinkedBlockingQueue.java:442)
at org.apache.zookeeper.ClientCnxn$EventThread.run(ClientCnxn.java:494)
13) Thread[id=11250, name=OverseerCollectionConfigSetProcessor-94550356689485828-127.0.0.1:36280_-n_0000000000, state=TIMED_WAITING, group=Overseer collection creation process.]
at sun.misc.Unsafe.park(Native Method)
at java.util.concurrent.locks.LockSupport.parkNanos(LockSupport.java:215)
at java.util.concurrent.locks.AbstractQueuedSynchronizer$ConditionObject.awaitNanos(AbstractQueuedSynchronizer.java:2078)
at org.apache.solr.cloud.DistributedQueue.getChildren(DistributedQueue.java:343)
at org.apache.solr.cloud.OverseerTaskQueue.peekTopN(OverseerTaskQueue.java:210)
at org.apache.solr.cloud.OverseerTaskProcessor.run(OverseerTaskProcessor.java:197)
at java.lang.Thread.run(Thread.java:745)
14) Thread[id=11314, name=qtp455219478-11314, state=TIMED_WAITING, group=TGRP-MigrateRouteKeyTest]
at sun.misc.Unsafe.park(Native Method)
at java.util.concurrent.locks.LockSupport.parkNanos(LockSupport.java:215)
at java.util.concurrent.locks.AbstractQueuedSynchronizer$ConditionObject.awaitNanos(AbstractQueuedSynchronizer.java:2078)
at org.eclipse.jetty.util.BlockingArrayQueue.poll(BlockingArrayQueue.java:389)
at org.eclipse.jetty.util.thread.QueuedThreadPool.idleJobPoll(QueuedThreadPool.java:531)
at org.eclipse.jetty.util.thread.QueuedThreadPool.access$700(QueuedThreadPool.java:47)
at org.eclipse.jetty.util.thread.QueuedThreadPool$3.run(QueuedThreadPool.java:590)
at java.lang.Thread.run(Thread.java:745)
15) Thread[id=11297, name=qtp1959989137-11297, state=TIMED_WAITING, group=TGRP-MigrateRouteKeyTest]
at sun.misc.Unsafe.park(Native Method)
at java.util.concurrent.locks.LockSupport.parkNanos(LockSupport.java:215)
at java.util.concurrent.locks.AbstractQueuedSynchronizer$ConditionObject.awaitNanos(AbstractQueuedSynchronizer.java:2078)
at org.eclipse.jetty.util.BlockingArrayQueue.poll(BlockingArrayQueue.java:389)
at org.eclipse.jetty.util.thread.QueuedThreadPool.idleJobPoll(QueuedThreadPool.java:531)
at org.eclipse.jetty.util.thread.QueuedThreadPool.access$700(QueuedThreadPool.java:47)
at org.eclipse.jetty.util.thread.QueuedThreadPool$3.run(QueuedThreadPool.java:590)
at java.lang.Thread.run(Thread.java:745)
16) Thread[id=11217, name=SessionTracker, state=TIMED_WAITING, group=TGRP-MigrateRouteKeyTest]
at java.lang.Object.wait(Native Method)
at org.apache.zookeeper.server.SessionTrackerImpl.run(SessionTrackerImpl.java:146)
17) Thread[id=11299, name=qtp1959989137-11299, state=TIMED_WAITING, group=TGRP-MigrateRouteKeyTest]
at sun.misc.Unsafe.park(Native Method)
at java.util.concurrent.locks.LockSupport.parkNanos(LockSupport.java:215)
at java.util.concurrent.locks.AbstractQueuedSynchronizer$ConditionObject.awaitNanos(AbstractQueuedSynchronizer.java:2078)
at org.eclipse.jetty.util.BlockingArrayQueue.poll(BlockingArrayQueue.java:389)
at org.eclipse.jetty.util.thread.QueuedThreadPool.idleJobPoll(QueuedThreadPool.java:531)
at org.eclipse.jetty.util.thread.QueuedThreadPool.access$700(QueuedThreadPool.java:47)
at org.eclipse.jetty.util.thread.QueuedThreadPool$3.run(QueuedThreadPool.java:590)
at java.lang.Thread.run(Thread.java:745)
18) Thread[id=11231, name=qtp1549077534-11231, state=TIMED_WAITING, group=TGRP-MigrateRouteKeyTest]
at sun.misc.Unsafe.park(Native Method)
at java.util.concurrent.locks.LockSupport.parkNanos(LockSupport.java:215)
at java.util.concurrent.locks.AbstractQueuedSynchronizer$ConditionObject.awaitNanos(AbstractQueuedSynchronizer.java:2078)
at org.eclipse.jetty.util.BlockingArrayQueue.poll(BlockingArrayQueue.java:389)
at org.eclipse.jetty.util.thread.QueuedThreadPool.idleJobPoll(QueuedThreadPool.java:531)
at org.eclipse.jetty.util.thread.QueuedThreadPool.access$700(QueuedThreadPool.java:47)
at org.eclipse.jetty.util.thread.QueuedThreadPool$3.run(QueuedThreadPool.java:590)
at java.lang.Thread.run(Thread.java:745)
19) Thread[id=11269, name=qtp1492821566-11269-acceptor-0@56e5340-ServerConnector@7e337d03{HTTP/1.1}{127.0.0.1:35731}, state=RUNNABLE, group=TGRP-MigrateRouteKeyTest]
at sun.nio.ch.ServerSocketChannelImpl.accept0(Native Method)
at sun.nio.ch.ServerSocketChannelImpl.accept(ServerSocketChannelImpl.java:422)
at sun.nio.ch.ServerSocketChannelImpl.accept(ServerSocketChannelImpl.java:250)
at org.eclipse.jetty.server.ServerConnector.accept(ServerConnector.java:377)
at org.eclipse.jetty.server.AbstractConnector$Acceptor.run(AbstractConnector.java:500)
at org.eclipse.jetty.util.thread.QueuedThreadPool.runJob(QueuedThreadPool.java:635)
at org.eclipse.jetty.util.thread.QueuedThreadPool$3.run(QueuedThreadPool.java:555)
at java.lang.Thread.run(Thread.java:745)
20) Thread[id=11273, name=qtp1492821566-11273, state=TIMED_WAITING, group=TGRP-MigrateRouteKeyTest]
at sun.misc.Unsafe.park(Native Method)
at java.util.concurrent.locks.LockSupport.parkNanos(LockSupport.java:215)
at java.util.concurrent.locks.AbstractQueuedSynchronizer$ConditionObject.awaitNanos(AbstractQueuedSynchronizer.java:2078)
at org.eclipse.jetty.util.BlockingArrayQueue.poll(BlockingArrayQueue.java:389)
at org.eclipse.jetty.util.thread.QueuedThreadPool.idleJobPoll(QueuedThreadPool.java:531)
at org.eclipse.jetty.util.thread.QueuedThreadPool.access$700(QueuedThreadPool.java:47)
at org.eclipse.jetty.util.thread.QueuedThreadPool$3.run(QueuedThreadPool.java:590)
at java.lang.Thread.run(Thread.java:745)
21) Thread[id=11236, name=org.eclipse.jetty.server.session.HashSessionManager@7f3ec93cTimer, state=TIMED_WAITING, group=TGRP-MigrateRouteKeyTest]
at sun.misc.Unsafe.park(Native Method)
at java.util.concurrent.locks.LockSupport.parkNanos(LockSupport.java:215)
at java.util.concurrent.locks.AbstractQueuedSynchronizer$ConditionObject.awaitNanos(AbstractQueuedSynchronizer.java:2078)
at java.util.concurrent.ScheduledThreadPoolExecutor$DelayedWorkQueue.take(ScheduledThreadPoolExecutor.java:1093)
at java.util.concurrent.ScheduledThreadPoolExecutor$DelayedWorkQueue.take(ScheduledThreadPoolExecutor.java:809)
at java.util.concurrent.ThreadPoolExecutor.getTask(ThreadPoolExecutor.java:1067)
at java.util.concurrent.ThreadPoolExecutor.runWorker(ThreadPoolExecutor.java:1127)
at java.util.concurrent.ThreadPoolExecutor$Worker.run(ThreadPoolExecutor.java:617)
at java.lang.Thread.run(Thread.java:745)
22) Thread[id=11301, name=qtp1959989137-11301, state=TIMED_WAITING, group=TGRP-MigrateRouteKeyTest]
at sun.misc.Unsafe.park(Native Method)
at java.util.concurrent.locks.LockSupport.parkNanos(LockSupport.java:215)
at java.util.concurrent.locks.AbstractQueuedSynchronizer$ConditionObject.awaitNanos(AbstractQueuedSynchronizer.java:2078)
at org.eclipse.jetty.util.BlockingArrayQueue.poll(BlockingArrayQueue.java:389)
at org.eclipse.jetty.util.thread.QueuedThreadPool.idleJobPoll(QueuedThreadPool.java:531)
at org.eclipse.jetty.util.thread.QueuedThreadPool.access$700(QueuedThreadPool.java:47)
at org.eclipse.jetty.util.thread.QueuedThreadPool$3.run(QueuedThreadPool.java:590)
at java.lang.Thread.run(Thread.java:745)
23) Thread[id=11276, name=Scheduler-650354673, state=TIMED_WAITING, group=TGRP-MigrateRouteKeyTest]
at sun.misc.Unsafe.park(Native Method)
at java.util.concurrent.locks.LockSupport.parkNanos(LockSupport.java:215)
at java.util.concurrent.locks.AbstractQueuedSynchronizer$ConditionObject.awaitNanos(AbstractQueuedSynchronizer.java:2078)
at java.util.concurrent.ScheduledThreadPoolExecutor$DelayedWorkQueue.take(ScheduledThreadPoolExecutor.java:1093)
at java.util.concurrent.ScheduledThreadPoolExecutor$DelayedWorkQueue.take(ScheduledThreadPoolExecutor.java:809)
at java.util.concurrent.ThreadPoolExecutor.getTask(ThreadPoolExecutor.java:1067)
at java.util.concurrent.ThreadPoolExecutor.runWorker(ThreadPoolExecutor.java:1127)
at java.util.concurrent.ThreadPoolExecutor$Worker.run(ThreadPoolExecutor.java:617)
at java.lang.Thread.run(Thread.java:745)
24) Thread[id=11268, name=qtp1492821566-11268-selector-ServerConnectorManager@36920755/0, state=RUNNABLE, group=TGRP-MigrateRouteKeyTest]
at sun.nio.ch.DevPollArrayWrapper.poll0(Native Method)
at sun.nio.ch.DevPollArrayWrapper.poll(DevPollArrayWrapper.java:223)
at sun.nio.ch.DevPollSelectorImpl.doSelect(DevPollSelectorImpl.java:84)
at sun.nio.ch.SelectorImpl.lockAndDoSelect(SelectorImpl.java:86)
at sun.nio.ch.SelectorImpl.select(SelectorImpl.java:97)
at sun.nio.ch.SelectorImpl.select(SelectorImpl.java:101)
at org.eclipse.jetty.io.SelectorManager$ManagedSelector.select(SelectorManager.java:600)
at org.eclipse.jetty.io.SelectorManager$ManagedSelector.run(SelectorManager.java:549)
at org.eclipse.jetty.util.thread.NonBlockingThread.run(NonBlockingThread.java:52)
at org.eclipse.jetty.util.thread.QueuedThreadPool.runJob(QueuedThreadPool.java:635)
at org.eclipse.jetty.util.thread.QueuedThreadPool$3.run(QueuedThreadPool.java:555)
at java.lang.Thread.run(Thread.java:745)
25) Thread[id=11313, name=qtp455219478-11313, state=TIMED_WAITING, group=TGRP-MigrateRouteKeyTest]
at sun.misc.Unsafe.park(Native Method)
at java.util.concurrent.locks.LockSupport.parkNanos(LockSupport.java:215)
at java.util.concurrent.locks.AbstractQueuedSynchronizer$ConditionObject.awaitNanos(AbstractQueuedSynchronizer.java:2078)
at org.eclipse.jetty.util.BlockingArrayQueue.poll(BlockingArrayQueue.java:389)
at org.eclipse.jetty.util.thread.QueuedThreadPool.idleJobPoll(QueuedThreadPool.java:531)
at org.eclipse.jetty.util.thread.QueuedThreadPool.access$700(QueuedThreadPool.java:47)
at org.eclipse.jetty.util.thread.QueuedThreadPool$3.run(QueuedThreadPool.java:590)
at java.lang.Thread.run(Thread.java:745)
26) Thread[id=11316, name=qtp455219478-11316, state=TIMED_WAITING, group=TGRP-MigrateRouteKeyTest]
at sun.misc.Unsafe.park(Native Method)
at java.util.concurrent.locks.LockSupport.parkNanos(LockSupport.java:215)
at java.util.concurrent.locks.AbstractQueuedSynchronizer$ConditionObject.awaitNanos(AbstractQueuedSynchronizer.java:2078)
at org.eclipse.jetty.util.BlockingArrayQueue.poll(BlockingArrayQueue.java:389)
at org.eclipse.jetty.util.thread.QueuedThreadPool.idleJobPoll(QueuedThreadPool.java:531)
at org.eclipse.jetty.util.thread.QueuedThreadPool.access$700(QueuedThreadPool.java:47)
at org.eclipse.jetty.util.thread.QueuedThreadPool$3.run(QueuedThreadPool.java:590)
at java.lang.Thread.run(Thread.java:745)
27) Thread[id=11329, name=qtp527120189-11329, state=TIMED_WAITING, group=TGRP-MigrateRouteKeyTest]
at sun.misc.Unsafe.park(Native Method)
at java.util.concurrent.locks.LockSupport.parkNanos(LockSupport.java:215)
at java.util.concurrent.locks.AbstractQueuedSynchronizer$ConditionObject.awaitNanos(AbstractQueuedSynchronizer.java:2078)
at org.eclipse.jetty.util.BlockingArrayQueue.poll(BlockingArrayQueue.java:389)
at org.eclipse.jetty.util.thread.QueuedThreadPool.idleJobPoll(QueuedThreadPool.java:531)
at org.eclipse.jetty.util.thread.QueuedThreadPool.access$700(QueuedThreadPool.java:47)
at org.eclipse.jetty.util.thread.QueuedThreadPool$3.run(QueuedThreadPool.java:590)
at java.lang.Thread.run(Thread.java:745)
28) Thread[id=11300, name=qtp1959989137-11300, state=TIMED_WAITING, group=TGRP-MigrateRouteKeyTest]
at sun.misc.Unsafe.park(Native Method)
at java.util.concurrent.locks.LockSupport.parkNanos(LockSupport.java:215)
at java.util.concurrent.locks.AbstractQueuedSynchronizer$ConditionObject.awaitNanos(AbstractQueuedSynchronizer.java:2078)
at org.eclipse.jetty.util.BlockingArrayQueue.poll(BlockingArrayQueue.java:389)
at org.eclipse.jetty.util.thread.QueuedThreadPool.idleJobPoll(QueuedThreadPool.java:531)
at org.eclipse.jetty.util.thread.QueuedThreadPool.access$700(QueuedThreadPool.java:47)
at org.eclipse.jetty.util.thread.QueuedThreadPool$3.run(QueuedThreadPool.java:590)
at java.lang.Thread.run(Thread.java:745)
29) Thread[id=11284, name=TEST-MigrateRouteKeyTest.test-seed#[F20DB7A1514425B7]-SendThread(127.0.0.1:64052), state=RUNNABLE, group=TGRP-MigrateRouteKeyTest]
at sun.nio.ch.DevPollArrayWrapper.poll0(Native Method)
at sun.nio.ch.DevPollArrayWrapper.poll(DevPollArrayWrapper.java:223)
at sun.nio.ch.DevPollSelectorImpl.doSelect(DevPollSelectorImpl.java:84)
at sun.nio.ch.SelectorImpl.lockAndDoSelect(SelectorImpl.java:86)
at sun.nio.ch.SelectorImpl.select(SelectorImpl.java:97)
at org.apache.zookeeper.ClientCnxnSocketNIO.doTransport(ClientCnxnSocketNIO.java:349)
at org.apache.zookeeper.ClientCnxn$SendThread.run(ClientCnxn.java:1081)
30) Thread[id=11232, name=qtp1549077534-11232, state=TIMED_WAITING, group=TGRP-MigrateRouteKeyTest]
at sun.misc.Unsafe.park(Native Method)
at java.util.concurrent.locks.LockSupport.parkNanos(LockSupport.java:215)
at java.util.concurrent.locks.AbstractQueuedSynchronizer$ConditionObject.awaitNanos(AbstractQueuedSynchronizer.java:2078)
at org.eclipse.jetty.util.BlockingArrayQueue.poll(BlockingArrayQueue.java:389)
at org.eclipse.jetty.util.thread.QueuedThreadPool.idleJobPoll(QueuedThreadPool.java:531)
at org.eclipse.jetty.util.thread.QueuedThreadPool.access$700(QueuedThreadPool.java:47)
at org.eclipse.jetty.util.thread.QueuedThreadPool$3.run(QueuedThreadPool.java:590)
at java.lang.Thread.run(Thread.java:745)
31) Thread[id=11288, name=Thread-4925, state=WAITING, group=TGRP-MigrateRouteKeyTest]
at java.lang.Object.wait(Native Method)
at java.lang.Object.wait(Object.java:502)
at org.apache.solr.core.CloserThread.run(CoreContainer.java:1153)
32) Thread[id=11247, name=TEST-MigrateRouteKeyTest.test-seed#[F20DB7A1514425B7]-EventThread, state=WAITING, group=TGRP-MigrateRouteKeyTest]
at sun.misc.Unsafe.park(Native Method)
at java.util.concurrent.locks.LockSupport.park(LockSupport.java:175)
at java.util.concurrent.locks.AbstractQueuedSynchronizer$ConditionObject.await(AbstractQueuedSynchronizer.java:2039)
at java.util.concurrent.LinkedBlockingQueue.take(LinkedBlockingQueue.java:442)
at org.apache.zookeeper.ClientCnxn$EventThread.run(ClientCnxn.java:494)
33) Thread[id=11272, name=qtp1492821566-11272, state=TIMED_WAITING, group=TGRP-MigrateRouteKeyTest]
at sun.misc.Unsafe.park(Native Method)
at java.util.concurrent.locks.LockSupport.parkNanos(LockSupport.java:215)
at java.util.concurrent.locks.AbstractQueuedSynchronizer$ConditionObject.awaitNanos(AbstractQueuedSynchronizer.java:2078)
at org.eclipse.jetty.util.BlockingArrayQueue.poll(BlockingArrayQueue.java:389)
at org.eclipse.jetty.util.thread.QueuedThreadPool.idleJobPoll(QueuedThreadPool.java:531)
at org.eclipse.jetty.util.thread.QueuedThreadPool.access$700(QueuedThreadPool.java:47)
at org.eclipse.jetty.util.thread.QueuedThreadPool$3.run(QueuedThreadPool.java:590)
at java.lang.Thread.run(Thread.java:745)
34) Thread[id=11318, name=Scheduler-1096462778, state=TIMED_WAITING, group=TGRP-MigrateRouteKeyTest]
at sun.misc.Unsafe.park(Native Method)
at java.util.concurrent.locks.LockSupport.parkNanos(LockSupport.java:215)
at java.util.concurrent.locks.AbstractQueuedSynchronizer$ConditionObject.awaitNanos(AbstractQueuedSynchronizer.java:2078)
at java.util.concurrent.ScheduledThreadPoolExecutor$DelayedWorkQueue.take(ScheduledThreadPoolExecutor.java:1093)
at java.util.concurrent.ScheduledThreadPoolExecutor$DelayedWorkQueue.take(ScheduledThreadPoolExecutor.java:809)
at java.util.concurrent.ThreadPoolExecutor.getTask(ThreadPoolExecutor.java:1067)
at java.util.concurrent.ThreadPoolExecutor.runWorker(ThreadPoolExecutor.java:1127)
at java.util.concurrent.ThreadPoolExecutor$Worker.run(ThreadPoolExecutor.java:617)
at java.lang.Thread.run(Thread.java:745)
35) Thread[id=11319, name=org.eclipse.jetty.server.session.HashSessionManager@46e0651Timer, state=TIMED_WAITING, group=TGRP-MigrateRouteKeyTest]
at sun.misc.Unsafe.park(Native Method)
at java.util.concurrent.locks.LockSupport.parkNanos(LockSupport.java:215)
at java.util.concurrent.locks.AbstractQueuedSynchronizer$ConditionObject.awaitNanos(AbstractQueuedSynchronizer.java:2078)
at java.util.concurrent.ScheduledThreadPoolExecutor$DelayedWorkQueue.take(ScheduledThreadPoolExecutor.java:1093)
at java.util.concurrent.ScheduledThreadPoolExecutor$DelayedWorkQueue.take(ScheduledThreadPoolExecutor.java:809)
at java.util.concurrent.ThreadPoolExecutor.getTask(ThreadPoolExecutor.java:1067)
at java.util.concurrent.ThreadPoolExecutor.runWorker(ThreadPoolExecutor.java:1127)
at java.util.concurrent.ThreadPoolExecutor$Worker.run(ThreadPoolExecutor.java:617)
at java.lang.Thread.run(Thread.java:745)
36) Thread[id=11326, name=qtp527120189-11326, state=TIMED_WAITING, group=TGRP-MigrateRouteKeyTest]
at sun.misc.Unsafe.park(Native Method)
at java.util.concurrent.locks.LockSupport.parkNanos(LockSupport.java:215)
at java.util.concurrent.locks.AbstractQueuedSynchronizer$ConditionObject.awaitNanos(AbstractQueuedSynchronizer.java:2078)
at org.eclipse.jetty.util.BlockingArrayQueue.poll(BlockingArrayQueue.java:389)
at org.eclipse.jetty.util.thread.QueuedThreadPool.idleJobPoll(QueuedThreadPool.java:531)
at org.eclipse.jetty.util.thread.QueuedThreadPool.access$700(QueuedThreadPool.java:47)
at org.eclipse.jetty.util.thread.QueuedThreadPool$3.run(QueuedThreadPool.java:590)
at java.lang.Thread.run(Thread.java:745)
37) Thread[id=11275, name=qtp1492821566-11275, state=TIMED_WAITING, group=TGRP-MigrateRouteKeyTest]
at sun.misc.Unsafe.park(Native Method)
at java.util.concurrent.locks.LockSupport.parkNanos(LockSupport.java:215)
at java.util.concurrent.locks.AbstractQueuedSynchronizer$ConditionObject.awaitNanos(AbstractQueuedSynchronizer.java:2078)
at org.eclipse.jetty.util.BlockingArrayQueue.poll(BlockingArrayQueue.java:389)
at org.eclipse.jetty.util.thread.QueuedThreadPool.idleJobPoll(QueuedThreadPool.java:531)
at org.eclipse.jetty.util.thread.QueuedThreadPool.access$700(QueuedThreadPool.java:47)
at org.eclipse.jetty.util.thread.QueuedThreadPool$3.run(QueuedThreadPool.java:590)
at java.lang.Thread.run(Thread.java:745)
38) Thread[id=11292, name=searcherExecutor-4204-thread-1, state=WAITING, group=TGRP-MigrateRouteKeyTest]
at sun.misc.Unsafe.park(Native Method)
at java.util.concurrent.locks.LockSupport.park(LockSupport.java:175)
at java.util.concurrent.locks.AbstractQueuedSynchronizer$ConditionObject.await(AbstractQueuedSynchronizer.java:2039)
at java.util.concurrent.LinkedBlockingQueue.take(LinkedBlockingQueue.java:442)
at java.util.concurrent.ThreadPoolExecutor.getTask(ThreadPoolExecutor.java:1067)
at java.util.concurrent.ThreadPoolExecutor.runWorker(ThreadPoolExecutor.java:1127)
at java.util.concurrent.ThreadPoolExecutor$Worker.run(ThreadPoolExecutor.java:617)
at java.lang.Thread.run(Thread.java:745)
39) Thread[id=11303, name=qtp1959989137-11303-selector-ServerConnectorManager@4c2af6bd/0, state=RUNNABLE, group=TGRP-MigrateRouteKeyTest]
at sun.nio.ch.DevPollArrayWrapper.poll0(Native Method)
at sun.nio.ch.DevPollArrayWrapper.poll(DevPollArrayWrapper.java:223)
at sun.nio.ch.DevPollSelectorImpl.doSelect(DevPollSelectorImpl.java:84)
at sun.nio.ch.SelectorImpl.lockAndDoSelect(SelectorImpl.java:86)
at sun.nio.ch.SelectorImpl.select(SelectorImpl.java:97)
at sun.nio.ch.SelectorImpl.select(SelectorImpl.java:101)
at org.eclipse.jetty.io.SelectorManager$ManagedSelector.select(SelectorManager.java:600)
at org.eclipse.jetty.io.SelectorManager$ManagedSelector.run(SelectorManager.java:549)
at org.eclipse.jetty.util.thread.NonBlockingThread.run(NonBlockingThread.java:52)
at org.eclipse.jetty.util.thread.QueuedThreadPool.runJob(QueuedThreadPool.java:635)
at org.eclipse.jetty.util.thread.QueuedThreadPool$3.run(QueuedThreadPool.java:555)
at java.lang.Thread.run(Thread.java:745)
40) Thread[id=11304, name=Scheduler-76003184, state=TIMED_WAITING, group=TGRP-MigrateRouteKeyTest]
at sun.misc.Unsafe.park(Native Method)
at java.util.concurrent.locks.LockSupport.parkNanos(LockSupport.java:215)
at java.util.concurrent.locks.AbstractQueuedSynchronizer$ConditionObject.awaitNanos(AbstractQueuedSynchronizer.java:2078)
at java.util.concurrent.ScheduledThreadPoolExecutor$DelayedWorkQueue.take(ScheduledThreadPoolExecutor.java:1093)
at java.util.concurrent.ScheduledThreadPoolExecutor$DelayedWorkQueue.take(ScheduledThreadPoolExecutor.java:809)
at java.util.concurrent.ThreadPoolExecutor.getTask(ThreadPoolExecutor.java:1067)
at java.util.concurrent.ThreadPoolExecutor.runWorker(ThreadPoolExecutor.java:1127)
at java.util.concurrent.ThreadPoolExecutor$Worker.run(ThreadPoolExecutor.java:617)
at java.lang.Thread.run(Thread.java:745)
41) Thread[id=11228, name=qtp1549077534-11228-acceptor-0@5308704c-ServerConnector@169629f8{HTTP/1.1}{127.0.0.1:36280}, state=RUNNABLE, group=TGRP-MigrateRouteKeyTest]
at sun.nio.ch.ServerSocketChannelImpl.accept0(Native Method)
at sun.nio.ch.ServerSocketChannelImpl.accept(ServerSocketChannelImpl.java:422)
at sun.nio.ch.ServerSocketChannelImpl.accept(ServerSocketChannelImpl.java:250)
at org.eclipse.jetty.server.ServerConnector.accept(ServerConnector.java:377)
at org.eclipse.jetty.server.AbstractConnector$Acceptor.run(AbstractConnector.java:500)
at org.eclipse.jetty.util.thread.QueuedThreadPool.runJob(QueuedThreadPool.java:635)
at org.eclipse.jetty.util.thread.QueuedThreadPool$3.run(QueuedThreadPool.java:555)
at java.lang.Thread.run(Thread.java:745)
42) Thread[id=11333, name=qtp527120189-11333-acceptor-0@67c06a64-ServerConnector@6ea09a24{HTTP/1.1}{127.0.0.1:44921}, state=RUNNABLE, group=TGRP-MigrateRouteKeyTest]
at sun.nio.ch.ServerSocketChannelImpl.accept0(Native Method)
at sun.nio.ch.ServerSocketChannelImpl.accept(ServerSocketChannelImpl.java:422)
at sun.nio.ch.ServerSocketChannelImpl.accept(ServerSocketChannelImpl.java:250)
at org.eclipse.jetty.server.ServerConnector.accept(ServerConnector.java:377)
at org.eclipse.jetty.server.AbstractConnector$Acceptor.run(AbstractConnector.java:500)
at org.eclipse.jetty.util.thread.QueuedThreadPool.runJob(QueuedThreadPool.java:635)
at org.eclipse.jetty.util.thread.QueuedThreadPool$3.run(QueuedThreadPool.java:555)
at java.lang.Thread.run(Thread.java
[...truncated too long message...]
.run(SelectorManager.java:549)
[junit4] > at org.eclipse.jetty.util.thread.NonBlockingThread.run(NonBlockingThread.java:52)
[junit4] > at org.eclipse.jetty.util.thread.QueuedThreadPool.runJob(QueuedThreadPool.java:635)
[junit4] > at org.eclipse.jetty.util.thread.QueuedThreadPool$3.run(QueuedThreadPool.java:555)
[junit4] > at java.lang.Thread.run(Thread.java:745)
[junit4] > 16) Thread[id=11246, name=TEST-MigrateRouteKeyTest.test-seed#[F20DB7A1514425B7]-SendThread(127.0.0.1:64052), state=TIMED_WAITING, group=TGRP-MigrateRouteKeyTest]
[junit4] > at java.lang.Thread.sleep(Native Method)
[junit4] > at org.apache.zookeeper.client.StaticHostProvider.next(StaticHostProvider.java:101)
[junit4] > at org.apache.zookeeper.ClientCnxn$SendThread.startConnect(ClientCnxn.java:940)
[junit4] > at org.apache.zookeeper.ClientCnxn$SendThread.run(ClientCnxn.java:1003)
[junit4] > 17) Thread[id=11257, name=searcherExecutor-4193-thread-1, state=WAITING, group=TGRP-MigrateRouteKeyTest]
[junit4] > at sun.misc.Unsafe.park(Native Method)
[junit4] > at java.util.concurrent.locks.LockSupport.park(LockSupport.java:175)
[junit4] > at java.util.concurrent.locks.AbstractQueuedSynchronizer$ConditionObject.await(AbstractQueuedSynchronizer.java:2039)
[junit4] > at java.util.concurrent.LinkedBlockingQueue.take(LinkedBlockingQueue.java:442)
[junit4] > at java.util.concurrent.ThreadPoolExecutor.getTask(ThreadPoolExecutor.java:1067)
[junit4] > at java.util.concurrent.ThreadPoolExecutor.runWorker(ThreadPoolExecutor.java:1127)
[junit4] > at java.util.concurrent.ThreadPoolExecutor$Worker.run(ThreadPoolExecutor.java:617)
[junit4] > at java.lang.Thread.run(Thread.java:745)
[junit4] > 18) Thread[id=11227, name=qtp1549077534-11227-selector-ServerConnectorManager@6273df80/0, state=RUNNABLE, group=TGRP-MigrateRouteKeyTest]
[junit4] > at sun.nio.ch.DevPollArrayWrapper.poll0(Native Method)
[junit4] > at sun.nio.ch.DevPollArrayWrapper.poll(DevPollArrayWrapper.java:223)
[junit4] > at sun.nio.ch.DevPollSelectorImpl.doSelect(DevPollSelectorImpl.java:84)
[junit4] > at sun.nio.ch.SelectorImpl.lockAndDoSelect(SelectorImpl.java:86)
[junit4] > at sun.nio.ch.SelectorImpl.select(SelectorImpl.java:97)
[junit4] > at sun.nio.ch.SelectorImpl.select(SelectorImpl.java:101)
[junit4] > at org.eclipse.jetty.io.SelectorManager$ManagedSelector.select(SelectorManager.java:600)
[junit4] > at org.eclipse.jetty.io.SelectorManager$ManagedSelector.run(SelectorManager.java:549)
[junit4] > at org.eclipse.jetty.util.thread.NonBlockingThread.run(NonBlockingThread.java:52)
[junit4] > at org.eclipse.jetty.util.thread.QueuedThreadPool.runJob(QueuedThreadPool.java:635)
[junit4] > at org.eclipse.jetty.util.thread.QueuedThreadPool$3.run(QueuedThreadPool.java:555)
[junit4] > at java.lang.Thread.run(Thread.java:745)
[junit4] > 19) Thread[id=11284, name=TEST-MigrateRouteKeyTest.test-seed#[F20DB7A1514425B7]-SendThread(127.0.0.1:64052), state=TIMED_WAITING, group=TGRP-MigrateRouteKeyTest]
[junit4] > at java.lang.Thread.sleep(Native Method)
[junit4] > at org.apache.zookeeper.ClientCnxn$SendThread.run(ClientCnxn.java:994)
[junit4] > 20) Thread[id=11325, name=qtp527120189-11325-selector-ServerConnectorManager@5a471e42/0, state=RUNNABLE, group=TGRP-MigrateRouteKeyTest]
[junit4] > at sun.nio.ch.DevPollArrayWrapper.poll0(Native Method)
[junit4] > at sun.nio.ch.DevPollArrayWrapper.poll(DevPollArrayWrapper.java:223)
[junit4] > at sun.nio.ch.DevPollSelectorImpl.doSelect(DevPollSelectorImpl.java:84)
[junit4] > at sun.nio.ch.SelectorImpl.lockAndDoSelect(SelectorImpl.java:86)
[junit4] > at sun.nio.ch.SelectorImpl.select(SelectorImpl.java:97)
[junit4] > at sun.nio.ch.SelectorImpl.select(SelectorImpl.java:101)
[junit4] > at org.eclipse.jetty.io.SelectorManager$ManagedSelector.select(SelectorManager.java:600)
[junit4] > at org.eclipse.jetty.io.SelectorManager$ManagedSelector.run(SelectorManager.java:549)
[junit4] > at org.eclipse.jetty.util.thread.NonBlockingThread.run(NonBlockingThread.java:52)
[junit4] > at org.eclipse.jetty.util.thread.QueuedThreadPool.runJob(QueuedThreadPool.java:635)
[junit4] > at org.eclipse.jetty.util.thread.QueuedThreadPool$3.run(QueuedThreadPool.java:555)
[junit4] > at java.lang.Thread.run(Thread.java:745)
[junit4] > 21) Thread[id=11288, name=Thread-4925, state=WAITING, group=TGRP-MigrateRouteKeyTest]
[junit4] > at java.lang.Object.wait(Native Method)
[junit4] > at java.lang.Object.wait(Object.java:502)
[junit4] > at org.apache.solr.core.CloserThread.run(CoreContainer.java:1153)
[junit4] > 22) Thread[id=11277, name=org.eclipse.jetty.server.session.HashSessionManager@23a8d1c0Timer, state=TIMED_WAITING, group=TGRP-MigrateRouteKeyTest]
[junit4] > at sun.misc.Unsafe.park(Native Method)
[junit4] > at java.util.concurrent.locks.LockSupport.parkNanos(LockSupport.java:215)
[junit4] > at java.util.concurrent.locks.AbstractQueuedSynchronizer$ConditionObject.awaitNanos(AbstractQueuedSynchronizer.java:2078)
[junit4] > at java.util.concurrent.ScheduledThreadPoolExecutor$DelayedWorkQueue.take(ScheduledThreadPoolExecutor.java:1093)
[junit4] > at java.util.concurrent.ScheduledThreadPoolExecutor$DelayedWorkQueue.take(ScheduledThreadPoolExecutor.java:809)
[junit4] > at java.util.concurrent.ThreadPoolExecutor.getTask(ThreadPoolExecutor.java:1067)
[junit4] > at java.util.concurrent.ThreadPoolExecutor.runWorker(ThreadPoolExecutor.java:1127)
[junit4] > at java.util.concurrent.ThreadPoolExecutor$Worker.run(ThreadPoolExecutor.java:617)
[junit4] > at java.lang.Thread.run(Thread.java:745)
[junit4] > 23) Thread[id=11331, name=Scheduler-1219865042, state=TIMED_WAITING, group=TGRP-MigrateRouteKeyTest]
[junit4] > at sun.misc.Unsafe.park(Native Method)
[junit4] > at java.util.concurrent.locks.LockSupport.parkNanos(LockSupport.java:215)
[junit4] > at java.util.concurrent.locks.AbstractQueuedSynchronizer$ConditionObject.awaitNanos(AbstractQueuedSynchronizer.java:2078)
[junit4] > at java.util.concurrent.ScheduledThreadPoolExecutor$DelayedWorkQueue.take(ScheduledThreadPoolExecutor.java:1093)
[junit4] > at java.util.concurrent.ScheduledThreadPoolExecutor$DelayedWorkQueue.take(ScheduledThreadPoolExecutor.java:809)
[junit4] > at java.util.concurrent.ThreadPoolExecutor.getTask(ThreadPoolExecutor.java:1067)
[junit4] > at java.util.concurrent.ThreadPoolExecutor.runWorker(ThreadPoolExecutor.java:1127)
[junit4] > at java.util.concurrent.ThreadPoolExecutor$Worker.run(ThreadPoolExecutor.java:617)
[junit4] > at java.lang.Thread.run(Thread.java:745)
[junit4] > 24) Thread[id=11305, name=org.eclipse.jetty.server.session.HashSessionManager@13a1853fTimer, state=TIMED_WAITING, group=TGRP-MigrateRouteKeyTest]
[junit4] > at sun.misc.Unsafe.park(Native Method)
[junit4] > at java.util.concurrent.locks.LockSupport.parkNanos(LockSupport.java:215)
[junit4] > at java.util.concurrent.locks.AbstractQueuedSynchronizer$ConditionObject.awaitNanos(AbstractQueuedSynchronizer.java:2078)
[junit4] > at java.util.concurrent.ScheduledThreadPoolExecutor$DelayedWorkQueue.take(ScheduledThreadPoolExecutor.java:1093)
[junit4] > at java.util.concurrent.ScheduledThreadPoolExecutor$DelayedWorkQueue.take(ScheduledThreadPoolExecutor.java:809)
[junit4] > at java.util.concurrent.ThreadPoolExecutor.getTask(ThreadPoolExecutor.java:1067)
[junit4] > at java.util.concurrent.ThreadPoolExecutor.runWorker(ThreadPoolExecutor.java:1127)
[junit4] > at java.util.concurrent.ThreadPoolExecutor$Worker.run(ThreadPoolExecutor.java:617)
[junit4] > at java.lang.Thread.run(Thread.java:745)
[junit4] > at __randomizedtesting.SeedInfo.seed([F20DB7A1514425B7]:0)
[junit4] Completed [407/546] on J0 in 182.06s, 1 test, 3 errors <<< FAILURES!
[...truncated 444 lines...]
BUILD FAILED
/export/home/jenkins/workspace/Lucene-Solr-trunk-Solaris/build.xml:775: The following error occurred while executing this line:
/export/home/jenkins/workspace/Lucene-Solr-trunk-Solaris/build.xml:719: The following error occurred while executing this line:
/export/home/jenkins/workspace/Lucene-Solr-trunk-Solaris/build.xml:59: The following error occurred while executing this line:
/export/home/jenkins/workspace/Lucene-Solr-trunk-Solaris/solr/build.xml:233: The following error occurred while executing this line:
/export/home/jenkins/workspace/Lucene-Solr-trunk-Solaris/solr/common-build.xml:514: The following error occurred while executing this line:
/export/home/jenkins/workspace/Lucene-Solr-trunk-Solaris/lucene/common-build.xml:1432: The following error occurred while executing this line:
/export/home/jenkins/workspace/Lucene-Solr-trunk-Solaris/lucene/common-build.xml:987: There were test failures: 546 suites, 2145 tests, 2 suite-level errors, 2 errors, 1 failure, 532 ignored (31 assumptions)
Total time: 65 minutes 20 seconds
Build step 'Invoke Ant' marked build as failure
Archiving artifacts
[WARNINGS] Skipping publisher since build result is FAILURE
Recording test results
Email was triggered for: Failure - Any
Sending email for trigger: Failure - Any