You are viewing a plain text version of this content. The canonical link for it is here.
Posted to commits@phoenix.apache.org by Apache Jenkins Server <je...@builds.apache.org> on 2019/07/24 18:01:46 UTC
Build failed in Jenkins: Phoenix-4.x-HBase-1.3 #511
See <https://builds.apache.org/job/Phoenix-4.x-HBase-1.3/511/display/redirect?page=changes>
Changes:
[s.kadam] PHOENIX-5382 : Improved performace with Bulk operations over iterations
------------------------------------------
[...truncated 453.88 KB...]
[INFO] Running org.apache.phoenix.util.Base62EncoderTest
[INFO] Running org.apache.phoenix.util.SequenceUtilTest
[INFO] Tests run: 1, Failures: 0, Errors: 0, Skipped: 0, Time elapsed: 0.022 s - in org.apache.phoenix.util.Base62EncoderTest
[INFO] Tests run: 119, Failures: 0, Errors: 0, Skipped: 0, Time elapsed: 4.632 s - in org.apache.phoenix.compile.WhereOptimizerTest
[INFO] Running org.apache.phoenix.util.MetaDataUtilTest
[INFO] Tests run: 18, Failures: 0, Errors: 0, Skipped: 0, Time elapsed: 0.024 s - in org.apache.phoenix.util.SequenceUtilTest
[INFO] Running org.apache.phoenix.util.ColumnInfoTest
[INFO] Running org.apache.phoenix.util.csv.StringToArrayConverterTest
[INFO] Tests run: 5, Failures: 0, Errors: 0, Skipped: 0, Time elapsed: 0.02 s - in org.apache.phoenix.util.ColumnInfoTest
[INFO] Running org.apache.phoenix.util.csv.CsvUpsertExecutorTest
[INFO] Tests run: 11, Failures: 0, Errors: 0, Skipped: 0, Time elapsed: 0.13 s - in org.apache.phoenix.util.MetaDataUtilTest
[INFO] Running org.apache.phoenix.util.QualifierEncodingSchemeTest
[INFO] Tests run: 4, Failures: 0, Errors: 0, Skipped: 0, Time elapsed: 0.001 s - in org.apache.phoenix.util.QualifierEncodingSchemeTest
[INFO] Running org.apache.phoenix.mapreduce.FormatToBytesWritableMapperTest
[INFO] Tests run: 49, Failures: 0, Errors: 0, Skipped: 0, Time elapsed: 5.7 s - in org.apache.phoenix.compile.QueryOptimizerTest
[INFO] Running org.apache.phoenix.mapreduce.CsvBulkImportUtilTest
[INFO] Tests run: 4, Failures: 0, Errors: 0, Skipped: 0, Time elapsed: 0.639 s - in org.apache.phoenix.util.PhoenixEncodeDecodeTest
[INFO] Running org.apache.phoenix.mapreduce.bulkload.TestTableRowkeyPair
[INFO] Tests run: 1, Failures: 0, Errors: 0, Skipped: 0, Time elapsed: 0.004 s - in org.apache.phoenix.mapreduce.bulkload.TestTableRowkeyPair
[INFO] Running org.apache.phoenix.mapreduce.util.PhoenixConfigurationUtilTest
[INFO] Tests run: 5, Failures: 0, Errors: 0, Skipped: 0, Time elapsed: 0.354 s - in org.apache.phoenix.mapreduce.FormatToBytesWritableMapperTest
[INFO] Running org.apache.phoenix.mapreduce.util.IndexColumnNamesTest
[INFO] Tests run: 8, Failures: 0, Errors: 0, Skipped: 0, Time elapsed: 1.127 s - in org.apache.phoenix.util.json.JsonUpsertExecutorTest
[INFO] Running org.apache.phoenix.mapreduce.util.ColumnInfoToStringEncoderDecoderTest
[INFO] Tests run: 4, Failures: 0, Errors: 0, Skipped: 0, Time elapsed: 0.675 s - in org.apache.phoenix.util.csv.StringToArrayConverterTest
[INFO] Running org.apache.phoenix.mapreduce.CsvToKeyValueMapperTest
[INFO] Tests run: 2, Failures: 0, Errors: 0, Skipped: 0, Time elapsed: 0.016 s - in org.apache.phoenix.mapreduce.CsvToKeyValueMapperTest
[INFO] Running org.apache.phoenix.mapreduce.BulkLoadToolTest
[INFO] Tests run: 2, Failures: 0, Errors: 0, Skipped: 0, Time elapsed: 0.052 s - in org.apache.phoenix.mapreduce.util.ColumnInfoToStringEncoderDecoderTest
[INFO] Running org.apache.phoenix.mapreduce.index.IndexScrutinyTableOutputTest
[INFO] Tests run: 12, Failures: 0, Errors: 0, Skipped: 0, Time elapsed: 0.026 s - in org.apache.phoenix.mapreduce.BulkLoadToolTest
[INFO] Running org.apache.phoenix.execute.MutationStateTest
[INFO] Tests run: 3, Failures: 0, Errors: 0, Skipped: 0, Time elapsed: 0.024 s - in org.apache.phoenix.execute.MutationStateTest
[INFO] Running org.apache.phoenix.execute.LiteralResultIteratorPlanTest
[INFO] Tests run: 3, Failures: 0, Errors: 0, Skipped: 0, Time elapsed: 0.014 s - in org.apache.phoenix.execute.LiteralResultIteratorPlanTest
[INFO] Running org.apache.phoenix.execute.CorrelatePlanTest
[INFO] Tests run: 6, Failures: 0, Errors: 0, Skipped: 0, Time elapsed: 0.053 s - in org.apache.phoenix.execute.CorrelatePlanTest
[INFO] Running org.apache.phoenix.execute.UnnestArrayPlanTest
[INFO] Tests run: 6, Failures: 0, Errors: 0, Skipped: 0, Time elapsed: 0.016 s - in org.apache.phoenix.execute.UnnestArrayPlanTest
[INFO] Running org.apache.phoenix.execute.DescVarLengthFastByteComparisonsTest
[INFO] Tests run: 2, Failures: 0, Errors: 0, Skipped: 0, Time elapsed: 0.002 s - in org.apache.phoenix.execute.DescVarLengthFastByteComparisonsTest
[INFO] Running org.apache.phoenix.trace.TraceSpanReceiverTest
[INFO] Tests run: 5, Failures: 0, Errors: 0, Skipped: 0, Time elapsed: 0.715 s - in org.apache.phoenix.mapreduce.CsvBulkImportUtilTest
[INFO] Running org.apache.phoenix.query.QueryPlanTest
[INFO] Tests run: 8, Failures: 0, Errors: 0, Skipped: 0, Time elapsed: 1.035 s - in org.apache.phoenix.util.csv.CsvUpsertExecutorTest
[INFO] Running org.apache.phoenix.query.KeyRangeClipTest
[INFO] Tests run: 5, Failures: 0, Errors: 0, Skipped: 0, Time elapsed: 0.58 s - in org.apache.phoenix.mapreduce.index.IndexScrutinyTableOutputTest
[INFO] Tests run: 2, Failures: 0, Errors: 0, Skipped: 0, Time elapsed: 0.816 s - in org.apache.phoenix.mapreduce.util.IndexColumnNamesTest
[INFO] Running org.apache.phoenix.query.KeyRangeUnionTest
[INFO] Running org.apache.phoenix.query.GuidePostsCacheWrapperTest
[INFO] Tests run: 2, Failures: 0, Errors: 0, Skipped: 0, Time elapsed: 0.428 s - in org.apache.phoenix.trace.TraceSpanReceiverTest
[INFO] Running org.apache.phoenix.query.OrderByTest
[INFO] Tests run: 8, Failures: 0, Errors: 0, Skipped: 0, Time elapsed: 0.036 s - in org.apache.phoenix.query.KeyRangeUnionTest
[INFO] Running org.apache.phoenix.query.HBaseFactoryProviderTest
[INFO] Tests run: 3, Failures: 0, Errors: 0, Skipped: 0, Time elapsed: 0.004 s - in org.apache.phoenix.query.HBaseFactoryProviderTest
[INFO] Running org.apache.phoenix.query.PhoenixStatsCacheLoaderTest
[INFO] Tests run: 9, Failures: 0, Errors: 0, Skipped: 0, Time elapsed: 1.001 s - in org.apache.phoenix.mapreduce.util.PhoenixConfigurationUtilTest
[INFO] Running org.apache.phoenix.query.PropertyPolicyProviderTest
[INFO] Tests run: 4, Failures: 0, Errors: 0, Skipped: 0, Time elapsed: 0.191 s - in org.apache.phoenix.query.GuidePostsCacheWrapperTest
[INFO] Running org.apache.phoenix.query.ParallelIteratorsSplitTest
[INFO] Tests run: 8, Failures: 0, Errors: 0, Skipped: 0, Time elapsed: 0.449 s - in org.apache.phoenix.query.KeyRangeClipTest
[INFO] Running org.apache.phoenix.query.KeyRangeIntersectTest
[INFO] Tests run: 9, Failures: 0, Errors: 0, Skipped: 0, Time elapsed: 0.056 s - in org.apache.phoenix.query.KeyRangeIntersectTest
[INFO] Running org.apache.phoenix.query.KeyRangeMoreTest
[INFO] Tests run: 12, Failures: 0, Errors: 0, Skipped: 0, Time elapsed: 3.575 s - in org.apache.phoenix.util.PhoenixRuntimeTest
[INFO] Running org.apache.phoenix.query.EncodedColumnQualifierCellsListTest
[INFO] Tests run: 22, Failures: 0, Errors: 0, Skipped: 0, Time elapsed: 0.04 s - in org.apache.phoenix.query.EncodedColumnQualifierCellsListTest
[INFO] Running org.apache.phoenix.query.KeyRangeCoalesceTest
[INFO] Tests run: 4, Failures: 0, Errors: 0, Skipped: 0, Time elapsed: 0.319 s - in org.apache.phoenix.query.PropertyPolicyProviderTest
[INFO] Running org.apache.phoenix.query.GuidePostsCacheProviderTest
[INFO] Tests run: 13, Failures: 0, Errors: 0, Skipped: 0, Time elapsed: 0.066 s - in org.apache.phoenix.query.KeyRangeCoalesceTest
[INFO] Running org.apache.phoenix.query.ScannerLeaseRenewalTest
[INFO] Tests run: 1, Failures: 0, Errors: 0, Skipped: 0, Time elapsed: 0.383 s - in org.apache.phoenix.query.PhoenixStatsCacheLoaderTest
[INFO] Running org.apache.phoenix.query.ConnectionlessTest
[INFO] Tests run: 4, Failures: 0, Errors: 0, Skipped: 0, Time elapsed: 0.469 s - in org.apache.phoenix.query.OrderByTest
[INFO] Running org.apache.phoenix.query.PhoenixStatsCacheRemovalListenerTest
[INFO] Tests run: 1, Failures: 0, Errors: 0, Skipped: 0, Time elapsed: 0.004 s - in org.apache.phoenix.query.PhoenixStatsCacheRemovalListenerTest
[INFO] Running org.apache.phoenix.query.ConnectionQueryServicesImplTest
[INFO] Tests run: 6, Failures: 0, Errors: 0, Skipped: 0, Time elapsed: 0.166 s - in org.apache.phoenix.query.GuidePostsCacheProviderTest
[INFO] Running org.apache.phoenix.metrics.MetricTypeTest
[INFO] Tests run: 1, Failures: 0, Errors: 0, Skipped: 0, Time elapsed: 0.016 s - in org.apache.phoenix.metrics.MetricTypeTest
[INFO] Running org.apache.phoenix.memory.MemoryManagerTest
[INFO] Tests run: 5, Failures: 0, Errors: 0, Skipped: 0, Time elapsed: 0.878 s - in org.apache.phoenix.query.QueryPlanTest
[INFO] Running org.apache.phoenix.tool.PhoenixCanaryToolTest
[INFO] Tests run: 3, Failures: 0, Errors: 0, Skipped: 0, Time elapsed: 0.416 s - in org.apache.phoenix.query.ConnectionlessTest
[INFO] Running org.apache.phoenix.index.automated.MRJobSubmitterTest
[INFO] Tests run: 1, Failures: 0, Errors: 0, Skipped: 0, Time elapsed: 0.407 s - in org.apache.phoenix.query.ConnectionQueryServicesImplTest
[INFO] Running org.apache.phoenix.index.IndexMaintainerTest
[INFO] Tests run: 6, Failures: 0, Errors: 0, Skipped: 0, Time elapsed: 0.361 s - in org.apache.phoenix.index.automated.MRJobSubmitterTest
[INFO] Running org.apache.phoenix.hbase.index.parallel.TestThreadPoolBuilder
[INFO] Tests run: 2, Failures: 0, Errors: 0, Skipped: 0, Time elapsed: 0.009 s - in org.apache.phoenix.hbase.index.parallel.TestThreadPoolBuilder
[INFO] Tests run: 5, Failures: 0, Errors: 0, Skipped: 0, Time elapsed: 0.659 s - in org.apache.phoenix.memory.MemoryManagerTest
[INFO] Running org.apache.phoenix.hbase.index.parallel.TestThreadPoolManager
[INFO] Running org.apache.phoenix.hbase.index.util.TestIndexManagementUtil
[INFO] Tests run: 3, Failures: 0, Errors: 0, Skipped: 0, Time elapsed: 0.023 s - in org.apache.phoenix.hbase.index.parallel.TestThreadPoolManager
[INFO] Running org.apache.phoenix.hbase.index.covered.filter.TestApplyAndFilterDeletesFilter
[INFO] Tests run: 3, Failures: 0, Errors: 0, Skipped: 0, Time elapsed: 0.028 s - in org.apache.phoenix.hbase.index.util.TestIndexManagementUtil
[INFO] Running org.apache.phoenix.hbase.index.covered.filter.TestNewerTimestampFilter
[INFO] Tests run: 6, Failures: 0, Errors: 0, Skipped: 0, Time elapsed: 0.016 s - in org.apache.phoenix.hbase.index.covered.filter.TestApplyAndFilterDeletesFilter
[INFO] Tests run: 1, Failures: 0, Errors: 0, Skipped: 0, Time elapsed: 0.002 s - in org.apache.phoenix.hbase.index.covered.filter.TestNewerTimestampFilter
[INFO] Running org.apache.phoenix.hbase.index.covered.TestColumnTracker
[INFO] Running org.apache.phoenix.hbase.index.covered.TestCoveredIndexSpecifierBuilder
[INFO] Tests run: 3, Failures: 0, Errors: 0, Skipped: 0, Time elapsed: 0.004 s - in org.apache.phoenix.hbase.index.covered.TestColumnTracker
[INFO] Tests run: 8, Failures: 0, Errors: 0, Skipped: 0, Time elapsed: 1.113 s - in org.apache.phoenix.query.ParallelIteratorsSplitTest
[INFO] Running org.apache.phoenix.hbase.index.covered.data.TestIndexMemStore
[INFO] Running org.apache.phoenix.hbase.index.covered.data.TestLocalTable
[INFO] Tests run: 1, Failures: 0, Errors: 0, Skipped: 0, Time elapsed: 0.003 s - in org.apache.phoenix.hbase.index.covered.data.TestLocalTable
[INFO] Running org.apache.phoenix.hbase.index.covered.CoveredColumnsTest
[INFO] Tests run: 1, Failures: 0, Errors: 0, Skipped: 0, Time elapsed: 0.002 s - in org.apache.phoenix.hbase.index.covered.CoveredColumnsTest
[INFO] Running org.apache.phoenix.hbase.index.covered.NonTxIndexBuilderTest
[INFO] Tests run: 1, Failures: 0, Errors: 0, Skipped: 0, Time elapsed: 0.019 s - in org.apache.phoenix.hbase.index.covered.TestCoveredIndexSpecifierBuilder
[INFO] Running org.apache.phoenix.hbase.index.covered.update.TestIndexUpdateManager
[INFO] Tests run: 2, Failures: 0, Errors: 0, Skipped: 0, Time elapsed: 0.013 s - in org.apache.phoenix.hbase.index.covered.update.TestIndexUpdateManager
[INFO] Running org.apache.phoenix.hbase.index.covered.TestCoveredColumnIndexCodec
[INFO] Tests run: 2, Failures: 0, Errors: 0, Skipped: 0, Time elapsed: 0.051 s - in org.apache.phoenix.hbase.index.covered.data.TestIndexMemStore
[INFO] Running org.apache.phoenix.hbase.index.covered.LocalTableStateTest
[INFO] Tests run: 3, Failures: 0, Errors: 0, Skipped: 0, Time elapsed: 0.046 s - in org.apache.phoenix.hbase.index.covered.TestCoveredColumnIndexCodec
[INFO] Running org.apache.phoenix.hbase.index.write.TestParalleIndexWriter
[INFO] Tests run: 3, Failures: 0, Errors: 0, Skipped: 0, Time elapsed: 0.892 s - in org.apache.phoenix.tool.PhoenixCanaryToolTest
[INFO] Running org.apache.phoenix.hbase.index.write.recovery.TestPerRegionIndexWriteCache
[INFO] Tests run: 5, Failures: 0, Errors: 0, Skipped: 0, Time elapsed: 0.147 s - in org.apache.phoenix.hbase.index.covered.LocalTableStateTest
[INFO] Running org.apache.phoenix.hbase.index.write.TestWALRecoveryCaching
[WARNING] Tests run: 1, Failures: 0, Errors: 0, Skipped: 1, Time elapsed: 0.008 s - in org.apache.phoenix.hbase.index.write.TestWALRecoveryCaching
[INFO] Running org.apache.phoenix.hbase.index.write.TestIndexWriter
[INFO] Tests run: 2, Failures: 0, Errors: 0, Skipped: 0, Time elapsed: 0.166 s - in org.apache.phoenix.hbase.index.write.TestParalleIndexWriter
[INFO] Running org.apache.phoenix.hbase.index.write.TestParalleWriterIndexCommitter
[INFO] Tests run: 2, Failures: 0, Errors: 0, Skipped: 0, Time elapsed: 0.028 s - in org.apache.phoenix.hbase.index.write.TestParalleWriterIndexCommitter
[INFO] Running org.apache.phoenix.jdbc.PhoenixResultSetMetadataTest
[INFO] Tests run: 4, Failures: 0, Errors: 0, Skipped: 0, Time elapsed: 0.141 s - in org.apache.phoenix.hbase.index.write.TestIndexWriter
[INFO] Running org.apache.phoenix.jdbc.PhoenixPreparedStatementTest
[INFO] Tests run: 1, Failures: 0, Errors: 0, Skipped: 0, Time elapsed: 0.279 s - in org.apache.phoenix.jdbc.PhoenixResultSetMetadataTest
[INFO] Running org.apache.phoenix.jdbc.ReadOnlyPropertiesTest
[INFO] Tests run: 4, Failures: 0, Errors: 0, Skipped: 0, Time elapsed: 0.004 s - in org.apache.phoenix.jdbc.ReadOnlyPropertiesTest
[INFO] Running org.apache.phoenix.jdbc.PhoenixDriverTest
[INFO] Tests run: 8, Failures: 0, Errors: 0, Skipped: 0, Time elapsed: 0.382 s - in org.apache.phoenix.jdbc.PhoenixPreparedStatementTest
[INFO] Running org.apache.phoenix.jdbc.PhoenixEmbeddedDriverTest
[INFO] Tests run: 4, Failures: 0, Errors: 0, Skipped: 0, Time elapsed: 0.251 s - in org.apache.phoenix.jdbc.PhoenixEmbeddedDriverTest
[INFO] Running org.apache.hadoop.hbase.ipc.PhoenixIndexRpcSchedulerTest
[INFO] Tests run: 24, Failures: 0, Errors: 0, Skipped: 0, Time elapsed: 1.505 s - in org.apache.phoenix.index.IndexMaintainerTest
[INFO] Running org.apache.hadoop.hbase.regionserver.PhoenixRpcSchedulerFactoryTest
[INFO] Tests run: 2, Failures: 0, Errors: 0, Skipped: 0, Time elapsed: 0.027 s - in org.apache.hadoop.hbase.regionserver.PhoenixRpcSchedulerFactoryTest
[INFO] Running org.apache.hadoop.hbase.regionserver.wal.IndexedKeyValueTest
[INFO] Tests run: 3, Failures: 0, Errors: 0, Skipped: 0, Time elapsed: 1.003 s - in org.apache.phoenix.hbase.index.write.recovery.TestPerRegionIndexWriteCache
[INFO] Running org.apache.hadoop.hbase.regionserver.wal.IndexedWALEditCodecTest
[INFO] Tests run: 1, Failures: 0, Errors: 0, Skipped: 0, Time elapsed: 0.006 s - in org.apache.hadoop.hbase.regionserver.wal.IndexedWALEditCodecTest
[INFO] Running org.apache.hadoop.hbase.regionserver.wal.ReadWriteKeyValuesWithCodecTest
[WARNING] Tests run: 7, Failures: 0, Errors: 0, Skipped: 1, Time elapsed: 0.719 s - in org.apache.phoenix.jdbc.PhoenixDriverTest
[INFO] Tests run: 1, Failures: 0, Errors: 0, Skipped: 0, Time elapsed: 0.302 s - in org.apache.hadoop.hbase.regionserver.wal.IndexedKeyValueTest
[INFO] Tests run: 2, Failures: 0, Errors: 0, Skipped: 0, Time elapsed: 0.284 s - in org.apache.hadoop.hbase.regionserver.wal.ReadWriteKeyValuesWithCodecTest
[INFO] Tests run: 3, Failures: 0, Errors: 0, Skipped: 0, Time elapsed: 1.53 s - in org.apache.phoenix.hbase.index.covered.NonTxIndexBuilderTest
[INFO] Tests run: 2, Failures: 0, Errors: 0, Skipped: 0, Time elapsed: 0.586 s - in org.apache.hadoop.hbase.ipc.PhoenixIndexRpcSchedulerTest
[INFO] Tests run: 5, Failures: 0, Errors: 0, Skipped: 0, Time elapsed: 2.911 s - in org.apache.phoenix.query.KeyRangeMoreTest
[WARNING] Tests run: 199, Failures: 0, Errors: 0, Skipped: 2, Time elapsed: 9.542 s - in org.apache.phoenix.compile.QueryCompilerTest
[INFO] Tests run: 2, Failures: 0, Errors: 0, Skipped: 0, Time elapsed: 6.091 s - in org.apache.phoenix.query.ScannerLeaseRenewalTest
[INFO]
[INFO] Results:
[INFO]
[WARNING] Tests run: 1712, Failures: 0, Errors: 0, Skipped: 5
[INFO]
[INFO]
[INFO] --- maven-source-plugin:2.2.1:jar-no-fork (attach-sources) @ phoenix-core ---
[INFO] Building jar: <https://builds.apache.org/job/Phoenix-4.x-HBase-1.3/ws/phoenix-core/target/phoenix-core-4.15.0-HBase-1.3-SNAPSHOT-sources.jar>
[INFO]
[INFO] --- maven-jar-plugin:2.4:test-jar (default) @ phoenix-core ---
[INFO] Building jar: <https://builds.apache.org/job/Phoenix-4.x-HBase-1.3/ws/phoenix-core/target/phoenix-core-4.15.0-HBase-1.3-SNAPSHOT-tests.jar>
[INFO]
[INFO] --- maven-jar-plugin:2.4:jar (default-jar) @ phoenix-core ---
[INFO] Building jar: <https://builds.apache.org/job/Phoenix-4.x-HBase-1.3/ws/phoenix-core/target/phoenix-core-4.15.0-HBase-1.3-SNAPSHOT.jar>
[INFO]
[INFO] --- maven-site-plugin:3.7.1:attach-descriptor (attach-descriptor) @ phoenix-core ---
[INFO] Skipping because packaging 'jar' is not pom.
[INFO]
[INFO] --- maven-failsafe-plugin:2.20:integration-test (ParallelStatsEnabledTest) @ phoenix-core ---
[INFO]
[INFO] -------------------------------------------------------
[INFO] T E S T S
[INFO] -------------------------------------------------------
[INFO] Running org.apache.phoenix.end2end.MultiCfQueryExecIT
[INFO] Running org.apache.phoenix.end2end.ParallelIteratorsIT
[INFO] Running org.apache.phoenix.end2end.KeyOnlyIT
[INFO] Running org.apache.phoenix.end2end.QueryWithTableSampleIT
[INFO] Running org.apache.phoenix.coprocessor.StatisticsCollectionRunTrackerIT
[INFO] Running org.apache.phoenix.end2end.ConfigurableCacheIT
[INFO] Tests run: 4, Failures: 0, Errors: 0, Skipped: 0, Time elapsed: 0.895 s - in org.apache.phoenix.end2end.ConfigurableCacheIT
[INFO] Running org.apache.phoenix.end2end.ReadIsolationLevelIT
[INFO] Tests run: 3, Failures: 0, Errors: 0, Skipped: 0, Time elapsed: 19.745 s - in org.apache.phoenix.end2end.ParallelIteratorsIT
[INFO] Running org.apache.phoenix.end2end.TenantSpecificTablesDDLIT
[INFO] Tests run: 2, Failures: 0, Errors: 0, Skipped: 0, Time elapsed: 8.858 s - in org.apache.phoenix.end2end.ReadIsolationLevelIT
[INFO] Running org.apache.phoenix.end2end.TenantSpecificTablesDMLIT
[INFO] Tests run: 3, Failures: 0, Errors: 0, Skipped: 0, Time elapsed: 21.495 s - in org.apache.phoenix.end2end.KeyOnlyIT
[INFO] Running org.apache.phoenix.end2end.TransactionalViewIT
[INFO] Running org.apache.phoenix.end2end.ExplainPlanWithStatsEnabledIT
[INFO] Tests run: 4, Failures: 0, Errors: 0, Skipped: 0, Time elapsed: 24.816 s - in org.apache.phoenix.end2end.TransactionalViewIT
[INFO] Running org.apache.phoenix.end2end.index.ImmutableIndexWithStatsIT
[INFO] Tests run: 1, Failures: 0, Errors: 0, Skipped: 0, Time elapsed: 9.523 s - in org.apache.phoenix.end2end.index.ImmutableIndexWithStatsIT
[INFO] Running org.apache.phoenix.query.ConnectionCachingIT
[INFO] Tests run: 11, Failures: 0, Errors: 0, Skipped: 0, Time elapsed: 60.769 s - in org.apache.phoenix.end2end.MultiCfQueryExecIT
[INFO] Tests run: 4, Failures: 0, Errors: 0, Skipped: 0, Time elapsed: 61.732 s - in org.apache.phoenix.coprocessor.StatisticsCollectionRunTrackerIT
[INFO] Tests run: 12, Failures: 0, Errors: 0, Skipped: 0, Time elapsed: 114.932 s - in org.apache.phoenix.end2end.QueryWithTableSampleIT
[INFO] Tests run: 2, Failures: 0, Errors: 0, Skipped: 0, Time elapsed: 65.8 s - in org.apache.phoenix.query.ConnectionCachingIT
[INFO] Tests run: 28, Failures: 0, Errors: 0, Skipped: 0, Time elapsed: 128.789 s - in org.apache.phoenix.end2end.ExplainPlanWithStatsEnabledIT
[INFO] Tests run: 16, Failures: 0, Errors: 0, Skipped: 0, Time elapsed: 278.058 s - in org.apache.phoenix.end2end.TenantSpecificTablesDMLIT
[INFO] Tests run: 16, Failures: 0, Errors: 0, Skipped: 0, Time elapsed: 312.586 s - in org.apache.phoenix.end2end.TenantSpecificTablesDDLIT
[INFO]
[INFO] Results:
[INFO]
[INFO] Tests run: 106, Failures: 0, Errors: 0, Skipped: 0
[INFO]
[INFO]
[INFO] --- maven-failsafe-plugin:2.20:integration-test (ParallelStatsDisabledTest) @ phoenix-core ---
[INFO]
[INFO] -------------------------------------------------------
[INFO] T E S T S
[INFO] -------------------------------------------------------
[INFO]
[INFO] Results:
[INFO]
[INFO] Tests run: 0, Failures: 0, Errors: 0, Skipped: 0
[INFO]
[INFO] ------------------------------------------------------------------------
[INFO] Reactor Summary for Apache Phoenix 4.15.0-HBase-1.3-SNAPSHOT:
[INFO]
[INFO] Apache Phoenix ..................................... SUCCESS [ 2.423 s]
[INFO] Phoenix Core ....................................... FAILURE [08:07 min]
[INFO] Phoenix - Pherf .................................... SKIPPED
[INFO] Phoenix Client ..................................... SKIPPED
[INFO] Phoenix Server ..................................... SKIPPED
[INFO] Phoenix Assembly ................................... SKIPPED
[INFO] Phoenix - Tracing Web Application .................. SKIPPED
[INFO] ------------------------------------------------------------------------
[INFO] BUILD FAILURE
[INFO] ------------------------------------------------------------------------
[INFO] Total time: 08:10 min
[INFO] Finished at: 2019-07-24T18:01:42Z
[INFO] ------------------------------------------------------------------------
[ERROR] Failed to execute goal org.apache.maven.plugins:maven-failsafe-plugin:2.20:integration-test (ParallelStatsDisabledTest) on project phoenix-core: Execution ParallelStatsDisabledTest of goal org.apache.maven.plugins:maven-failsafe-plugin:2.20:integration-test failed: java.lang.NoClassDefFoundError: org/apache/hadoop/hbase/HBaseTestingUtility: org.apache.hadoop.hbase.HBaseTestingUtility -> [Help 1]
[ERROR]
[ERROR] To see the full stack trace of the errors, re-run Maven with the -e switch.
[ERROR] Re-run Maven using the -X switch to enable full debug logging.
[ERROR]
[ERROR] For more information about the errors and possible solutions, please read the following articles:
[ERROR] [Help 1] http://cwiki.apache.org/confluence/display/MAVEN/PluginExecutionException
[ERROR]
[ERROR] After correcting the problems, you can resume the build with the command
[ERROR] mvn <goals> -rf :phoenix-core
Build step 'Invoke top-level Maven targets' marked build as failure
[JIRA] Updating issue PHOENIX-5382
Recording test results
Not sending mail to unregistered user s.kadam@salesforce.com
Jenkins build is back to normal : Phoenix-4.x-HBase-1.3 #512
Posted by Apache Jenkins Server <je...@builds.apache.org>.
See <https://builds.apache.org/job/Phoenix-4.x-HBase-1.3/512/display/redirect?page=changes>