You are viewing a plain text version of this content. The canonical link for it is here.
Posted to dev@jackrabbit.apache.org by Apache Hudson Server <hu...@hudson.apache.org> on 2011/01/27 20:07:09 UTC
Build failed in Hudson: Jackrabbit-trunk-tests-java14 #606
See <https://hudson.apache.org/hudson/job/Jackrabbit-trunk-tests-java14/606/>
------------------------------------------
Started by upstream project "Jackrabbit-trunk" build number 1433
Building remotely on solaris2
Updating http://svn.apache.org/repos/asf/jackrabbit/trunk/jackrabbit-jcr-tests
At revision 1064257
Updating http://svn.apache.org/repos/asf/jackrabbit/trunk/jackrabbit-parent
At revision 1064257
no change for http://svn.apache.org/repos/asf/jackrabbit/trunk/jackrabbit-jcr-tests since the previous build
no change for http://svn.apache.org/repos/asf/jackrabbit/trunk/jackrabbit-parent since the previous build
[locks-and-latches] Checking to see if we really have the locks
[locks-and-latches] Have all the locks, build can start
[Jackrabbit-trunk-tests-java14] $ /bin/bash -xe /var/tmp/hudson29129.sh
+ cd jackrabbit-parent
+ MAVEN_OPTS=-Xmx128m
+ /export/home/hudson/tools/maven/apache-maven-2.0.9/bin/mvn clean install
[INFO] Scanning for projects...
[INFO] ------------------------------------------------------------------------
[INFO] Building Jackrabbit Parent POM
[INFO] task-segment: [clean, install]
[INFO] ------------------------------------------------------------------------
[INFO] [clean:clean]
[INFO] Deleting file set: /zonestorage/hudson<https://hudson.apache.org/hudson/job/Jackrabbit-trunk-tests-java14/ws/jackrabbit-parent/target> (included: [**], excluded: [])
[INFO] Setting property: classpath.resource.loader.class => 'org.codehaus.plexus.velocity.ContextClassLoaderResourceLoader'.
[INFO] Setting property: velocimacro.messages.on => 'false'.
[INFO] Setting property: resource.loader => 'classpath'.
[INFO] Setting property: resource.manager.logwhenfound => 'false'.
[INFO] [remote-resources:process {execution: default}]
[INFO] [site:attach-descriptor]
[INFO] [install:install]
[INFO] Installing /zonestorage/hudson<https://hudson.apache.org/hudson/job/Jackrabbit-trunk-tests-java14/ws/jackrabbit-parent/pom.xml> to /export/home/hudson/.m2/repository/org/apache/jackrabbit/jackrabbit-parent/2.3-SNAPSHOT/jackrabbit-parent-2.3-SNAPSHOT.pom
[INFO] ------------------------------------------------------------------------
[ERROR] BUILD ERROR
[INFO] ------------------------------------------------------------------------
[INFO] Error installing artifact's metadata: Error installing metadata: Error updating group repository metadata
expected START_TAG or END_TAG not TEXT (position: TEXT seen ...<extension>pom</... @13:25)
[INFO] ------------------------------------------------------------------------
[INFO] For more information, run Maven with the -e switch
[INFO] ------------------------------------------------------------------------
[INFO] Total time: 10 seconds
[INFO] Finished at: Thu Jan 27 14:07:08 EST 2011
[INFO] Final Memory: 21M/39M
[INFO] ------------------------------------------------------------------------
[locks-and-latches] Releasing all the locks
[locks-and-latches] All the locks released
Hudson build is back to normal : Jackrabbit-trunk-tests-java14 #611
Posted by Apache Hudson Server <hu...@hudson.apache.org>.
See <https://hudson.apache.org/hudson/job/Jackrabbit-trunk-tests-java14/611/>
Build failed in Hudson: Jackrabbit-trunk-tests-java14 #610
Posted by Apache Hudson Server <hu...@hudson.apache.org>.
See <https://hudson.apache.org/hudson/job/Jackrabbit-trunk-tests-java14/610/>
------------------------------------------
Started by user jukka
Building remotely on solaris2
no change for http://svn.apache.org/repos/asf/jackrabbit/trunk/jackrabbit-jcr-tests since the previous build
no change for http://svn.apache.org/repos/asf/jackrabbit/trunk/jackrabbit-parent since the previous build
[locks-and-latches] Checking to see if we really have the locks
[locks-and-latches] Have all the locks, build can start
[locks-and-latches] Releasing all the locks
[locks-and-latches] All the locks released
Re: Build failed in Hudson: Jackrabbit-trunk-tests-java14 #609
Posted by Jukka Zitting <jz...@adobe.com>.
Hi,
On 01/31/2011 07:59 PM, Apache Hudson Server wrote:
> [INFO] Error installing artifact's metadata: Error installing
> metadata: Error updating group repository metadata expected START_TAG
> or END_TAG not TEXT (position: TEXT seen ...<extension>pom</...
> @13:25)
Looks like a Maven 3 vs. Maven 2 issue somewhere. I modified the build
configuration not to install the build artifacts (the Java 1.4 build
results are not used anywhere), which should work around this issue.
--
Jukka Zitting
Build failed in Hudson: Jackrabbit-trunk-tests-java14 #609
Posted by Apache Hudson Server <hu...@hudson.apache.org>.
See <https://hudson.apache.org/hudson/job/Jackrabbit-trunk-tests-java14/609/>
------------------------------------------
Started by upstream project "Jackrabbit-trunk" build number 1438
Started by upstream project "Jackrabbit-trunk" build number 1439
Building remotely on solaris2
Updating http://svn.apache.org/repos/asf/jackrabbit/trunk/jackrabbit-jcr-tests
At revision 1065689
Updating http://svn.apache.org/repos/asf/jackrabbit/trunk/jackrabbit-parent
At revision 1065689
no change for http://svn.apache.org/repos/asf/jackrabbit/trunk/jackrabbit-jcr-tests since the previous build
no change for http://svn.apache.org/repos/asf/jackrabbit/trunk/jackrabbit-parent since the previous build
[locks-and-latches] Checking to see if we really have the locks
[locks-and-latches] Have all the locks, build can start
[Jackrabbit-trunk-tests-java14] $ /bin/bash -xe /var/tmp/hudson30234.sh
+ cd jackrabbit-parent
+ MAVEN_OPTS=-Xmx128m
+ /export/home/hudson/tools/maven/apache-maven-2.0.9/bin/mvn clean install
[INFO] Scanning for projects...
[INFO] ------------------------------------------------------------------------
[INFO] Building Jackrabbit Parent POM
[INFO] task-segment: [clean, install]
[INFO] ------------------------------------------------------------------------
[INFO] [clean:clean]
[INFO] Deleting file set: /zonestorage/hudson<https://hudson.apache.org/hudson/job/Jackrabbit-trunk-tests-java14/ws/jackrabbit-parent/target> (included: [**], excluded: [])
[INFO] Setting property: classpath.resource.loader.class => 'org.codehaus.plexus.velocity.ContextClassLoaderResourceLoader'.
[INFO] Setting property: velocimacro.messages.on => 'false'.
[INFO] Setting property: resource.loader => 'classpath'.
[INFO] Setting property: resource.manager.logwhenfound => 'false'.
[INFO] [remote-resources:process {execution: default}]
[INFO] [site:attach-descriptor]
[INFO] [install:install]
[INFO] Installing /zonestorage/hudson<https://hudson.apache.org/hudson/job/Jackrabbit-trunk-tests-java14/ws/jackrabbit-parent/pom.xml> to /export/home/hudson/.m2/repository/org/apache/jackrabbit/jackrabbit-parent/2.3-SNAPSHOT/jackrabbit-parent-2.3-SNAPSHOT.pom
[INFO] ------------------------------------------------------------------------
[ERROR] BUILD ERROR
[INFO] ------------------------------------------------------------------------
[INFO] Error installing artifact's metadata: Error installing metadata: Error updating group repository metadata
expected START_TAG or END_TAG not TEXT (position: TEXT seen ...<extension>pom</... @13:25)
[INFO] ------------------------------------------------------------------------
[INFO] For more information, run Maven with the -e switch
[INFO] ------------------------------------------------------------------------
[INFO] Total time: 8 seconds
[INFO] Finished at: Mon Jan 31 13:59:52 EST 2011
[INFO] Final Memory: 21M/39M
[INFO] ------------------------------------------------------------------------
[locks-and-latches] Releasing all the locks
[locks-and-latches] All the locks released
Build failed in Hudson: Jackrabbit-trunk-tests-java14 #608
Posted by Apache Hudson Server <hu...@hudson.apache.org>.
See <https://hudson.apache.org/hudson/job/Jackrabbit-trunk-tests-java14/608/>
------------------------------------------
Started by upstream project "Jackrabbit-trunk" build number 1435
Started by upstream project "Jackrabbit-trunk" build number 1436
Building remotely on solaris2
Updating http://svn.apache.org/repos/asf/jackrabbit/trunk/jackrabbit-jcr-tests
At revision 1064750
Updating http://svn.apache.org/repos/asf/jackrabbit/trunk/jackrabbit-parent
At revision 1064750
no change for http://svn.apache.org/repos/asf/jackrabbit/trunk/jackrabbit-jcr-tests since the previous build
no change for http://svn.apache.org/repos/asf/jackrabbit/trunk/jackrabbit-parent since the previous build
[locks-and-latches] Checking to see if we really have the locks
[locks-and-latches] Have all the locks, build can start
[Jackrabbit-trunk-tests-java14] $ /bin/bash -xe /var/tmp/hudson29377.sh
+ cd jackrabbit-parent
+ MAVEN_OPTS=-Xmx128m
+ /export/home/hudson/tools/maven/apache-maven-2.0.9/bin/mvn clean install
[INFO] Scanning for projects...
[INFO] ------------------------------------------------------------------------
[INFO] Building Jackrabbit Parent POM
[INFO] task-segment: [clean, install]
[INFO] ------------------------------------------------------------------------
[INFO] [clean:clean]
[INFO] Deleting file set: /zonestorage/hudson<https://hudson.apache.org/hudson/job/Jackrabbit-trunk-tests-java14/ws/jackrabbit-parent/target> (included: [**], excluded: [])
[INFO] Setting property: classpath.resource.loader.class => 'org.codehaus.plexus.velocity.ContextClassLoaderResourceLoader'.
[INFO] Setting property: velocimacro.messages.on => 'false'.
[INFO] Setting property: resource.loader => 'classpath'.
[INFO] Setting property: resource.manager.logwhenfound => 'false'.
[INFO] [remote-resources:process {execution: default}]
[INFO] [site:attach-descriptor]
[INFO] [install:install]
[INFO] Installing /zonestorage/hudson<https://hudson.apache.org/hudson/job/Jackrabbit-trunk-tests-java14/ws/jackrabbit-parent/pom.xml> to /export/home/hudson/.m2/repository/org/apache/jackrabbit/jackrabbit-parent/2.3-SNAPSHOT/jackrabbit-parent-2.3-SNAPSHOT.pom
[INFO] ------------------------------------------------------------------------
[ERROR] BUILD ERROR
[INFO] ------------------------------------------------------------------------
[INFO] Error installing artifact's metadata: Error installing metadata: Error updating group repository metadata
expected START_TAG or END_TAG not TEXT (position: TEXT seen ...<extension>pom</... @13:25)
[INFO] ------------------------------------------------------------------------
[INFO] For more information, run Maven with the -e switch
[INFO] ------------------------------------------------------------------------
[INFO] Total time: 9 seconds
[INFO] Finished at: Fri Jan 28 11:00:45 EST 2011
[INFO] Final Memory: 21M/39M
[INFO] ------------------------------------------------------------------------
[locks-and-latches] Releasing all the locks
[locks-and-latches] All the locks released
Build failed in Hudson: Jackrabbit-trunk-tests-java14 #607
Posted by Apache Hudson Server <hu...@hudson.apache.org>.
See <https://hudson.apache.org/hudson/job/Jackrabbit-trunk-tests-java14/607/>
------------------------------------------
Started by upstream project "Jackrabbit-trunk" build number 1434
Building remotely on solaris2
Updating http://svn.apache.org/repos/asf/jackrabbit/trunk/jackrabbit-jcr-tests
At revision 1064634
Updating http://svn.apache.org/repos/asf/jackrabbit/trunk/jackrabbit-parent
At revision 1064634
no change for http://svn.apache.org/repos/asf/jackrabbit/trunk/jackrabbit-jcr-tests since the previous build
no change for http://svn.apache.org/repos/asf/jackrabbit/trunk/jackrabbit-parent since the previous build
[locks-and-latches] Checking to see if we really have the locks
[locks-and-latches] Have all the locks, build can start
[Jackrabbit-trunk-tests-java14] $ /bin/bash -xe /var/tmp/hudson29328.sh
+ cd jackrabbit-parent
+ MAVEN_OPTS=-Xmx128m
+ /export/home/hudson/tools/maven/apache-maven-2.0.9/bin/mvn clean install
[INFO] Scanning for projects...
[INFO] ------------------------------------------------------------------------
[INFO] Building Jackrabbit Parent POM
[INFO] task-segment: [clean, install]
[INFO] ------------------------------------------------------------------------
[INFO] [clean:clean]
[INFO] Deleting file set: /zonestorage/hudson<https://hudson.apache.org/hudson/job/Jackrabbit-trunk-tests-java14/ws/jackrabbit-parent/target> (included: [**], excluded: [])
[INFO] Setting property: classpath.resource.loader.class => 'org.codehaus.plexus.velocity.ContextClassLoaderResourceLoader'.
[INFO] Setting property: velocimacro.messages.on => 'false'.
[INFO] Setting property: resource.loader => 'classpath'.
[INFO] Setting property: resource.manager.logwhenfound => 'false'.
[INFO] [remote-resources:process {execution: default}]
[INFO] [site:attach-descriptor]
[INFO] [install:install]
[INFO] Installing /zonestorage/hudson<https://hudson.apache.org/hudson/job/Jackrabbit-trunk-tests-java14/ws/jackrabbit-parent/pom.xml> to /export/home/hudson/.m2/repository/org/apache/jackrabbit/jackrabbit-parent/2.3-SNAPSHOT/jackrabbit-parent-2.3-SNAPSHOT.pom
[INFO] ------------------------------------------------------------------------
[ERROR] BUILD ERROR
[INFO] ------------------------------------------------------------------------
[INFO] Error installing artifact's metadata: Error installing metadata: Error updating group repository metadata
expected START_TAG or END_TAG not TEXT (position: TEXT seen ...<extension>pom</... @13:25)
[INFO] ------------------------------------------------------------------------
[INFO] For more information, run Maven with the -e switch
[INFO] ------------------------------------------------------------------------
[INFO] Total time: 19 seconds
[INFO] Finished at: Fri Jan 28 07:05:17 EST 2011
[INFO] Final Memory: 21M/39M
[INFO] ------------------------------------------------------------------------
[locks-and-latches] Releasing all the locks
[locks-and-latches] All the locks released