You are viewing a plain text version of this content. The canonical link for it is here.
Posted to dev@lucene.apache.org by Policeman Jenkins Server <je...@thetaphi.de> on 2016/02/09 08:47:56 UTC
[JENKINS] Lucene-Solr-trunk-MacOSX (64bit/jdk1.8.0) - Build # 3075
- Still Failing!
Build: http://jenkins.thetaphi.de/job/Lucene-Solr-trunk-MacOSX/3075/
Java: 64bit/jdk1.8.0 -XX:-UseCompressedOops -XX:+UseSerialGC
1 tests failed.
FAILED: org.apache.solr.cloud.TestRandomRequestDistribution.test
Error Message:
Shard a1x2_shard1_replica1 received all 10 requests
Stack Trace:
java.lang.AssertionError: Shard a1x2_shard1_replica1 received all 10 requests
at __randomizedtesting.SeedInfo.seed([89098B5E74BC35D6:15DB484DA40582E]:0)
at org.junit.Assert.fail(Assert.java:93)
at org.junit.Assert.assertTrue(Assert.java:43)
at org.apache.solr.cloud.TestRandomRequestDistribution.testRequestTracking(TestRandomRequestDistribution.java:121)
at org.apache.solr.cloud.TestRandomRequestDistribution.test(TestRandomRequestDistribution.java:65)
at sun.reflect.NativeMethodAccessorImpl.invoke0(Native Method)
at sun.reflect.NativeMethodAccessorImpl.invoke(NativeMethodAccessorImpl.java:62)
at sun.reflect.DelegatingMethodAccessorImpl.invoke(DelegatingMethodAccessorImpl.java:43)
at java.lang.reflect.Method.invoke(Method.java:498)
at com.carrotsearch.randomizedtesting.RandomizedRunner.invoke(RandomizedRunner.java:1764)
at com.carrotsearch.randomizedtesting.RandomizedRunner$8.evaluate(RandomizedRunner.java:871)
at com.carrotsearch.randomizedtesting.RandomizedRunner$9.evaluate(RandomizedRunner.java:907)
at com.carrotsearch.randomizedtesting.RandomizedRunner$10.evaluate(RandomizedRunner.java:921)
at org.apache.solr.BaseDistributedSearchTestCase$ShardsRepeatRule$ShardsFixedStatement.callStatement(BaseDistributedSearchTestCase.java:964)
at org.apache.solr.BaseDistributedSearchTestCase$ShardsRepeatRule$ShardsStatement.evaluate(BaseDistributedSearchTestCase.java:939)
at com.carrotsearch.randomizedtesting.rules.SystemPropertiesRestoreRule$1.evaluate(SystemPropertiesRestoreRule.java:57)
at org.apache.lucene.util.TestRuleSetupTeardownChained$1.evaluate(TestRuleSetupTeardownChained.java:49)
at org.apache.lucene.util.AbstractBeforeAfterRule$1.evaluate(AbstractBeforeAfterRule.java:45)
at org.apache.lucene.util.TestRuleThreadAndTestName$1.evaluate(TestRuleThreadAndTestName.java:48)
at org.apache.lucene.util.TestRuleIgnoreAfterMaxFailures$1.evaluate(TestRuleIgnoreAfterMaxFailures.java:64)
at org.apache.lucene.util.TestRuleMarkFailure$1.evaluate(TestRuleMarkFailure.java:47)
at com.carrotsearch.randomizedtesting.rules.StatementAdapter.evaluate(StatementAdapter.java:36)
at com.carrotsearch.randomizedtesting.ThreadLeakControl$StatementRunner.run(ThreadLeakControl.java:367)
at com.carrotsearch.randomizedtesting.ThreadLeakControl.forkTimeoutingTask(ThreadLeakControl.java:809)
at com.carrotsearch.randomizedtesting.ThreadLeakControl$3.evaluate(ThreadLeakControl.java:460)
at com.carrotsearch.randomizedtesting.RandomizedRunner.runSingleTest(RandomizedRunner.java:880)
at com.carrotsearch.randomizedtesting.RandomizedRunner$5.evaluate(RandomizedRunner.java:781)
at com.carrotsearch.randomizedtesting.RandomizedRunner$6.evaluate(RandomizedRunner.java:816)
at com.carrotsearch.randomizedtesting.RandomizedRunner$7.evaluate(RandomizedRunner.java:827)
at com.carrotsearch.randomizedtesting.rules.StatementAdapter.evaluate(StatementAdapter.java:36)
at com.carrotsearch.randomizedtesting.rules.SystemPropertiesRestoreRule$1.evaluate(SystemPropertiesRestoreRule.java:57)
at org.apache.lucene.util.AbstractBeforeAfterRule$1.evaluate(AbstractBeforeAfterRule.java:45)
at com.carrotsearch.randomizedtesting.rules.StatementAdapter.evaluate(StatementAdapter.java:36)
at org.apache.lucene.util.TestRuleStoreClassName$1.evaluate(TestRuleStoreClassName.java:41)
at com.carrotsearch.randomizedtesting.rules.NoShadowingOrOverridesOnMethodsRule$1.evaluate(NoShadowingOrOverridesOnMethodsRule.java:40)
at com.carrotsearch.randomizedtesting.rules.NoShadowingOrOverridesOnMethodsRule$1.evaluate(NoShadowingOrOverridesOnMethodsRule.java:40)
at com.carrotsearch.randomizedtesting.rules.StatementAdapter.evaluate(StatementAdapter.java:36)
at com.carrotsearch.randomizedtesting.rules.StatementAdapter.evaluate(StatementAdapter.java:36)
at com.carrotsearch.randomizedtesting.rules.StatementAdapter.evaluate(StatementAdapter.java:36)
at org.apache.lucene.util.TestRuleAssertionsRequired$1.evaluate(TestRuleAssertionsRequired.java:53)
at org.apache.lucene.util.TestRuleMarkFailure$1.evaluate(TestRuleMarkFailure.java:47)
at org.apache.lucene.util.TestRuleIgnoreAfterMaxFailures$1.evaluate(TestRuleIgnoreAfterMaxFailures.java:64)
at org.apache.lucene.util.TestRuleIgnoreTestSuites$1.evaluate(TestRuleIgnoreTestSuites.java:54)
at com.carrotsearch.randomizedtesting.rules.StatementAdapter.evaluate(StatementAdapter.java:36)
at com.carrotsearch.randomizedtesting.ThreadLeakControl$StatementRunner.run(ThreadLeakControl.java:367)
at java.lang.Thread.run(Thread.java:745)
Build Log:
[...truncated 11736 lines...]
[junit4] Suite: org.apache.solr.cloud.TestRandomRequestDistribution
[junit4] 2> 2682181 ERROR (Finalizer) [ ] o.a.s.c.CoreContainer CoreContainer was not close prior to finalize(), indicates a bug -- POSSIBLE RESOURCE LEAK!!! instance=1266502406
[junit4] 2> Creating dataDir: /Users/jenkins/workspace/Lucene-Solr-trunk-MacOSX/solr/build/solr-core/test/J0/temp/solr.cloud.TestRandomRequestDistribution_89098B5E74BC35D6-001/init-core-data-001
[junit4] 2> 2682184 INFO (SUITE-TestRandomRequestDistribution-seed#[89098B5E74BC35D6]-worker) [ ] o.a.s.BaseDistributedSearchTestCase Setting hostContext system property: /_xqv/
[junit4] 2> 2682187 INFO (TEST-TestRandomRequestDistribution.test-seed#[89098B5E74BC35D6]) [ ] o.a.s.c.ZkTestServer STARTING ZK TEST SERVER
[junit4] 2> 2682188 INFO (Thread-6378) [ ] o.a.s.c.ZkTestServer client port:0.0.0.0/0.0.0.0:0
[junit4] 2> 2682188 INFO (Thread-6378) [ ] o.a.s.c.ZkTestServer Starting server
[junit4] 2> 2682289 INFO (TEST-TestRandomRequestDistribution.test-seed#[89098B5E74BC35D6]) [ ] o.a.s.c.ZkTestServer start zk server on port:60078
[junit4] 2> 2682289 INFO (TEST-TestRandomRequestDistribution.test-seed#[89098B5E74BC35D6]) [ ] o.a.s.c.c.SolrZkClient Using default ZkCredentialsProvider
[junit4] 2> 2682290 INFO (TEST-TestRandomRequestDistribution.test-seed#[89098B5E74BC35D6]) [ ] o.a.s.c.c.ConnectionManager Waiting for client to connect to ZooKeeper
[junit4] 2> 2682297 INFO (zkCallback-3064-thread-1) [ ] o.a.s.c.c.ConnectionManager Watcher org.apache.solr.common.cloud.ConnectionManager@266f1772 name:ZooKeeperConnection Watcher:127.0.0.1:60078 got event WatchedEvent state:SyncConnected type:None path:null path:null type:None
[junit4] 2> 2682297 INFO (TEST-TestRandomRequestDistribution.test-seed#[89098B5E74BC35D6]) [ ] o.a.s.c.c.ConnectionManager Client is connected to ZooKeeper
[junit4] 2> 2682297 INFO (TEST-TestRandomRequestDistribution.test-seed#[89098B5E74BC35D6]) [ ] o.a.s.c.c.SolrZkClient Using default ZkACLProvider
[junit4] 2> 2682297 INFO (TEST-TestRandomRequestDistribution.test-seed#[89098B5E74BC35D6]) [ ] o.a.s.c.c.SolrZkClient makePath: /solr
[junit4] 2> 2682302 INFO (TEST-TestRandomRequestDistribution.test-seed#[89098B5E74BC35D6]) [ ] o.a.s.c.c.SolrZkClient Using default ZkCredentialsProvider
[junit4] 2> 2682303 INFO (TEST-TestRandomRequestDistribution.test-seed#[89098B5E74BC35D6]) [ ] o.a.s.c.c.ConnectionManager Waiting for client to connect to ZooKeeper
[junit4] 2> 2682304 INFO (zkCallback-3065-thread-1) [ ] o.a.s.c.c.ConnectionManager Watcher org.apache.solr.common.cloud.ConnectionManager@6d0b79a6 name:ZooKeeperConnection Watcher:127.0.0.1:60078/solr got event WatchedEvent state:SyncConnected type:None path:null path:null type:None
[junit4] 2> 2682304 INFO (TEST-TestRandomRequestDistribution.test-seed#[89098B5E74BC35D6]) [ ] o.a.s.c.c.ConnectionManager Client is connected to ZooKeeper
[junit4] 2> 2682305 INFO (TEST-TestRandomRequestDistribution.test-seed#[89098B5E74BC35D6]) [ ] o.a.s.c.c.SolrZkClient Using default ZkACLProvider
[junit4] 2> 2682305 INFO (TEST-TestRandomRequestDistribution.test-seed#[89098B5E74BC35D6]) [ ] o.a.s.c.c.SolrZkClient makePath: /collections/collection1
[junit4] 2> 2682309 INFO (TEST-TestRandomRequestDistribution.test-seed#[89098B5E74BC35D6]) [ ] o.a.s.c.c.SolrZkClient makePath: /collections/collection1/shards
[junit4] 2> 2682313 INFO (TEST-TestRandomRequestDistribution.test-seed#[89098B5E74BC35D6]) [ ] o.a.s.c.c.SolrZkClient makePath: /collections/control_collection
[junit4] 2> 2682316 INFO (TEST-TestRandomRequestDistribution.test-seed#[89098B5E74BC35D6]) [ ] o.a.s.c.c.SolrZkClient makePath: /collections/control_collection/shards
[junit4] 2> 2682320 INFO (TEST-TestRandomRequestDistribution.test-seed#[89098B5E74BC35D6]) [ ] o.a.s.c.AbstractZkTestCase put /Users/jenkins/workspace/Lucene-Solr-trunk-MacOSX/solr/core/src/test-files/solr/collection1/conf/solrconfig-tlog.xml to /configs/conf1/solrconfig.xml
[junit4] 2> 2682320 INFO (TEST-TestRandomRequestDistribution.test-seed#[89098B5E74BC35D6]) [ ] o.a.s.c.c.SolrZkClient makePath: /configs/conf1/solrconfig.xml
[junit4] 2> 2682324 INFO (TEST-TestRandomRequestDistribution.test-seed#[89098B5E74BC35D6]) [ ] o.a.s.c.AbstractZkTestCase put /Users/jenkins/workspace/Lucene-Solr-trunk-MacOSX/solr/core/src/test-files/solr/collection1/conf/schema.xml to /configs/conf1/schema.xml
[junit4] 2> 2682325 INFO (TEST-TestRandomRequestDistribution.test-seed#[89098B5E74BC35D6]) [ ] o.a.s.c.c.SolrZkClient makePath: /configs/conf1/schema.xml
[junit4] 2> 2682328 INFO (TEST-TestRandomRequestDistribution.test-seed#[89098B5E74BC35D6]) [ ] o.a.s.c.AbstractZkTestCase put /Users/jenkins/workspace/Lucene-Solr-trunk-MacOSX/solr/core/src/test-files/solr/collection1/conf/solrconfig.snippet.randomindexconfig.xml to /configs/conf1/solrconfig.snippet.randomindexconfig.xml
[junit4] 2> 2682328 INFO (TEST-TestRandomRequestDistribution.test-seed#[89098B5E74BC35D6]) [ ] o.a.s.c.c.SolrZkClient makePath: /configs/conf1/solrconfig.snippet.randomindexconfig.xml
[junit4] 2> 2682332 INFO (TEST-TestRandomRequestDistribution.test-seed#[89098B5E74BC35D6]) [ ] o.a.s.c.AbstractZkTestCase put /Users/jenkins/workspace/Lucene-Solr-trunk-MacOSX/solr/core/src/test-files/solr/collection1/conf/stopwords.txt to /configs/conf1/stopwords.txt
[junit4] 2> 2682332 INFO (TEST-TestRandomRequestDistribution.test-seed#[89098B5E74BC35D6]) [ ] o.a.s.c.c.SolrZkClient makePath: /configs/conf1/stopwords.txt
[junit4] 2> 2682335 INFO (TEST-TestRandomRequestDistribution.test-seed#[89098B5E74BC35D6]) [ ] o.a.s.c.AbstractZkTestCase put /Users/jenkins/workspace/Lucene-Solr-trunk-MacOSX/solr/core/src/test-files/solr/collection1/conf/protwords.txt to /configs/conf1/protwords.txt
[junit4] 2> 2682335 INFO (TEST-TestRandomRequestDistribution.test-seed#[89098B5E74BC35D6]) [ ] o.a.s.c.c.SolrZkClient makePath: /configs/conf1/protwords.txt
[junit4] 2> 2682339 INFO (TEST-TestRandomRequestDistribution.test-seed#[89098B5E74BC35D6]) [ ] o.a.s.c.AbstractZkTestCase put /Users/jenkins/workspace/Lucene-Solr-trunk-MacOSX/solr/core/src/test-files/solr/collection1/conf/currency.xml to /configs/conf1/currency.xml
[junit4] 2> 2682339 INFO (TEST-TestRandomRequestDistribution.test-seed#[89098B5E74BC35D6]) [ ] o.a.s.c.c.SolrZkClient makePath: /configs/conf1/currency.xml
[junit4] 2> 2682342 INFO (TEST-TestRandomRequestDistribution.test-seed#[89098B5E74BC35D6]) [ ] o.a.s.c.AbstractZkTestCase put /Users/jenkins/workspace/Lucene-Solr-trunk-MacOSX/solr/core/src/test-files/solr/collection1/conf/enumsConfig.xml to /configs/conf1/enumsConfig.xml
[junit4] 2> 2682342 INFO (TEST-TestRandomRequestDistribution.test-seed#[89098B5E74BC35D6]) [ ] o.a.s.c.c.SolrZkClient makePath: /configs/conf1/enumsConfig.xml
[junit4] 2> 2682345 INFO (TEST-TestRandomRequestDistribution.test-seed#[89098B5E74BC35D6]) [ ] o.a.s.c.AbstractZkTestCase put /Users/jenkins/workspace/Lucene-Solr-trunk-MacOSX/solr/core/src/test-files/solr/collection1/conf/open-exchange-rates.json to /configs/conf1/open-exchange-rates.json
[junit4] 2> 2682345 INFO (TEST-TestRandomRequestDistribution.test-seed#[89098B5E74BC35D6]) [ ] o.a.s.c.c.SolrZkClient makePath: /configs/conf1/open-exchange-rates.json
[junit4] 2> 2682349 INFO (TEST-TestRandomRequestDistribution.test-seed#[89098B5E74BC35D6]) [ ] o.a.s.c.AbstractZkTestCase put /Users/jenkins/workspace/Lucene-Solr-trunk-MacOSX/solr/core/src/test-files/solr/collection1/conf/mapping-ISOLatin1Accent.txt to /configs/conf1/mapping-ISOLatin1Accent.txt
[junit4] 2> 2682349 INFO (TEST-TestRandomRequestDistribution.test-seed#[89098B5E74BC35D6]) [ ] o.a.s.c.c.SolrZkClient makePath: /configs/conf1/mapping-ISOLatin1Accent.txt
[junit4] 2> 2682353 INFO (TEST-TestRandomRequestDistribution.test-seed#[89098B5E74BC35D6]) [ ] o.a.s.c.AbstractZkTestCase put /Users/jenkins/workspace/Lucene-Solr-trunk-MacOSX/solr/core/src/test-files/solr/collection1/conf/old_synonyms.txt to /configs/conf1/old_synonyms.txt
[junit4] 2> 2682353 INFO (TEST-TestRandomRequestDistribution.test-seed#[89098B5E74BC35D6]) [ ] o.a.s.c.c.SolrZkClient makePath: /configs/conf1/old_synonyms.txt
[junit4] 2> 2682357 INFO (TEST-TestRandomRequestDistribution.test-seed#[89098B5E74BC35D6]) [ ] o.a.s.c.AbstractZkTestCase put /Users/jenkins/workspace/Lucene-Solr-trunk-MacOSX/solr/core/src/test-files/solr/collection1/conf/synonyms.txt to /configs/conf1/synonyms.txt
[junit4] 2> 2682357 INFO (TEST-TestRandomRequestDistribution.test-seed#[89098B5E74BC35D6]) [ ] o.a.s.c.c.SolrZkClient makePath: /configs/conf1/synonyms.txt
[junit4] 2> 2682662 INFO (TEST-TestRandomRequestDistribution.test-seed#[89098B5E74BC35D6]) [ ] o.a.s.SolrTestCaseJ4 Writing core.properties file to /Users/jenkins/workspace/Lucene-Solr-trunk-MacOSX/solr/build/solr-core/test/J0/temp/solr.cloud.TestRandomRequestDistribution_89098B5E74BC35D6-001/control-001/cores/collection1
[junit4] 2> 2682664 INFO (TEST-TestRandomRequestDistribution.test-seed#[89098B5E74BC35D6]) [ ] o.e.j.s.Server jetty-9.2.13.v20150730
[junit4] 2> 2682668 INFO (TEST-TestRandomRequestDistribution.test-seed#[89098B5E74BC35D6]) [ ] o.e.j.s.h.ContextHandler Started o.e.j.s.ServletContextHandler@dc985c4{/_xqv,null,AVAILABLE}
[junit4] 2> 2682669 INFO (TEST-TestRandomRequestDistribution.test-seed#[89098B5E74BC35D6]) [ ] o.e.j.s.ServerConnector Started ServerConnector@56d660ca{HTTP/1.1}{127.0.0.1:60081}
[junit4] 2> 2682670 INFO (TEST-TestRandomRequestDistribution.test-seed#[89098B5E74BC35D6]) [ ] o.e.j.s.Server Started @2686112ms
[junit4] 2> 2682670 INFO (TEST-TestRandomRequestDistribution.test-seed#[89098B5E74BC35D6]) [ ] o.a.s.c.s.e.JettySolrRunner Jetty properties: {solr.data.dir=/Users/jenkins/workspace/Lucene-Solr-trunk-MacOSX/solr/build/solr-core/test/J0/temp/solr.cloud.TestRandomRequestDistribution_89098B5E74BC35D6-001/tempDir-001/control/data, hostContext=/_xqv, hostPort=60081, coreRootDirectory=/Users/jenkins/workspace/Lucene-Solr-trunk-MacOSX/solr/build/solr-core/test/J0/../../../../../../../../../Users/jenkins/workspace/Lucene-Solr-trunk-MacOSX/solr/build/solr-core/test/J0/temp/solr.cloud.TestRandomRequestDistribution_89098B5E74BC35D6-001/control-001/cores}
[junit4] 2> 2682670 INFO (TEST-TestRandomRequestDistribution.test-seed#[89098B5E74BC35D6]) [ ] o.a.s.s.SolrDispatchFilter SolrDispatchFilter.init(): sun.misc.Launcher$AppClassLoader@1540e19d
[junit4] 2> 2682670 INFO (TEST-TestRandomRequestDistribution.test-seed#[89098B5E74BC35D6]) [ ] o.a.s.c.SolrResourceLoader new SolrResourceLoader for directory: '/Users/jenkins/workspace/Lucene-Solr-trunk-MacOSX/solr/build/solr-core/test/J0/temp/solr.cloud.TestRandomRequestDistribution_89098B5E74BC35D6-001/control-001'
[junit4] 2> 2682671 INFO (TEST-TestRandomRequestDistribution.test-seed#[89098B5E74BC35D6]) [ ] o.a.s.c.SolrResourceLoader JNDI not configured for solr (NoInitialContextEx)
[junit4] 2> 2682671 INFO (TEST-TestRandomRequestDistribution.test-seed#[89098B5E74BC35D6]) [ ] o.a.s.c.SolrResourceLoader solr home defaulted to 'solr/' (could not find system property or JNDI)
[junit4] 2> 2682671 INFO (TEST-TestRandomRequestDistribution.test-seed#[89098B5E74BC35D6]) [ ] o.a.s.c.c.SolrZkClient Using default ZkCredentialsProvider
[junit4] 2> 2682672 INFO (TEST-TestRandomRequestDistribution.test-seed#[89098B5E74BC35D6]) [ ] o.a.s.c.c.ConnectionManager Waiting for client to connect to ZooKeeper
[junit4] 2> 2682673 INFO (zkCallback-3066-thread-1) [ ] o.a.s.c.c.ConnectionManager Watcher org.apache.solr.common.cloud.ConnectionManager@5e634934 name:ZooKeeperConnection Watcher:127.0.0.1:60078/solr got event WatchedEvent state:SyncConnected type:None path:null path:null type:None
[junit4] 2> 2682673 INFO (TEST-TestRandomRequestDistribution.test-seed#[89098B5E74BC35D6]) [ ] o.a.s.c.c.ConnectionManager Client is connected to ZooKeeper
[junit4] 2> 2682674 INFO (TEST-TestRandomRequestDistribution.test-seed#[89098B5E74BC35D6]) [ ] o.a.s.c.c.SolrZkClient Using default ZkACLProvider
[junit4] 2> 2682676 INFO (TEST-TestRandomRequestDistribution.test-seed#[89098B5E74BC35D6]) [ ] o.a.s.s.SolrDispatchFilter Loading solr.xml from SolrHome (not found in ZooKeeper)
[junit4] 2> 2682676 INFO (TEST-TestRandomRequestDistribution.test-seed#[89098B5E74BC35D6]) [ ] o.a.s.c.SolrXmlConfig Loading container configuration from /Users/jenkins/workspace/Lucene-Solr-trunk-MacOSX/solr/build/solr-core/test/J0/temp/solr.cloud.TestRandomRequestDistribution_89098B5E74BC35D6-001/control-001/solr.xml
[junit4] 2> 2682683 INFO (TEST-TestRandomRequestDistribution.test-seed#[89098B5E74BC35D6]) [ ] o.a.s.c.CorePropertiesLocator Config-defined core root directory: /Users/jenkins/workspace/Lucene-Solr-trunk-MacOSX/solr/build/solr-core/test/J0/../../../../../../../../../Users/jenkins/workspace/Lucene-Solr-trunk-MacOSX/solr/build/solr-core/test/J0/temp/solr.cloud.TestRandomRequestDistribution_89098B5E74BC35D6-001/control-001/cores
[junit4] 2> 2682683 INFO (TEST-TestRandomRequestDistribution.test-seed#[89098B5E74BC35D6]) [ ] o.a.s.c.CoreContainer New CoreContainer 165436702
[junit4] 2> 2682683 INFO (TEST-TestRandomRequestDistribution.test-seed#[89098B5E74BC35D6]) [ ] o.a.s.c.CoreContainer Loading cores into CoreContainer [instanceDir=/Users/jenkins/workspace/Lucene-Solr-trunk-MacOSX/solr/build/solr-core/test/J0/temp/solr.cloud.TestRandomRequestDistribution_89098B5E74BC35D6-001/control-001]
[junit4] 2> 2682683 WARN (TEST-TestRandomRequestDistribution.test-seed#[89098B5E74BC35D6]) [ ] o.a.s.c.CoreContainer Couldn't add files from /Users/jenkins/workspace/Lucene-Solr-trunk-MacOSX/solr/build/solr-core/test/J0/temp/solr.cloud.TestRandomRequestDistribution_89098B5E74BC35D6-001/control-001/lib to classpath: /Users/jenkins/workspace/Lucene-Solr-trunk-MacOSX/solr/build/solr-core/test/J0/temp/solr.cloud.TestRandomRequestDistribution_89098B5E74BC35D6-001/control-001/lib
[junit4] 2> 2682684 INFO (TEST-TestRandomRequestDistribution.test-seed#[89098B5E74BC35D6]) [ ] o.a.s.h.c.HttpShardHandlerFactory created with socketTimeout : 90000,urlScheme : ,connTimeout : 15000,maxConnectionsPerHost : 20,maxConnections : 10000,corePoolSize : 0,maximumPoolSize : 2147483647,maxThreadIdleTime : 5,sizeOfQueue : -1,fairnessPolicy : false,useRetries : false,
[junit4] 2> 2682687 INFO (TEST-TestRandomRequestDistribution.test-seed#[89098B5E74BC35D6]) [ ] o.a.s.u.UpdateShardHandler Creating UpdateShardHandler HTTP client with params: socketTimeout=340000&connTimeout=45000&retry=true
[junit4] 2> 2682687 INFO (TEST-TestRandomRequestDistribution.test-seed#[89098B5E74BC35D6]) [ ] o.a.s.l.LogWatcher SLF4J impl is org.slf4j.impl.Log4jLoggerFactory
[junit4] 2> 2682687 INFO (TEST-TestRandomRequestDistribution.test-seed#[89098B5E74BC35D6]) [ ] o.a.s.l.LogWatcher Registering Log Listener [Log4j (org.slf4j.impl.Log4jLoggerFactory)]
[junit4] 2> 2682687 INFO (TEST-TestRandomRequestDistribution.test-seed#[89098B5E74BC35D6]) [ ] o.a.s.c.ZkContainer Zookeeper client=127.0.0.1:60078/solr
[junit4] 2> 2682687 INFO (TEST-TestRandomRequestDistribution.test-seed#[89098B5E74BC35D6]) [ ] o.a.s.c.ZkController zkHost includes chroot
[junit4] 2> 2682687 INFO (TEST-TestRandomRequestDistribution.test-seed#[89098B5E74BC35D6]) [ ] o.a.s.c.c.SolrZkClient Using default ZkCredentialsProvider
[junit4] 2> 2682688 INFO (TEST-TestRandomRequestDistribution.test-seed#[89098B5E74BC35D6]) [ ] o.a.s.c.c.ConnectionManager Waiting for client to connect to ZooKeeper
[junit4] 2> 2682689 INFO (zkCallback-3069-thread-1) [ ] o.a.s.c.c.ConnectionManager Watcher org.apache.solr.common.cloud.ConnectionManager@31331722 name:ZooKeeperConnection Watcher:127.0.0.1:60078 got event WatchedEvent state:SyncConnected type:None path:null path:null type:None
[junit4] 2> 2682689 INFO (TEST-TestRandomRequestDistribution.test-seed#[89098B5E74BC35D6]) [ ] o.a.s.c.c.ConnectionManager Client is connected to ZooKeeper
[junit4] 2> 2682689 INFO (TEST-TestRandomRequestDistribution.test-seed#[89098B5E74BC35D6]) [ ] o.a.s.c.c.SolrZkClient Using default ZkACLProvider
[junit4] 2> 2682692 INFO (TEST-TestRandomRequestDistribution.test-seed#[89098B5E74BC35D6]) [n:127.0.0.1:60081__xqv ] o.a.s.c.c.ConnectionManager Waiting for client to connect to ZooKeeper
[junit4] 2> 2682693 INFO (zkCallback-3070-thread-1-processing-n:127.0.0.1:60081__xqv) [n:127.0.0.1:60081__xqv ] o.a.s.c.c.ConnectionManager Watcher org.apache.solr.common.cloud.ConnectionManager@17fa9538 name:ZooKeeperConnection Watcher:127.0.0.1:60078/solr got event WatchedEvent state:SyncConnected type:None path:null path:null type:None
[junit4] 2> 2682693 INFO (TEST-TestRandomRequestDistribution.test-seed#[89098B5E74BC35D6]) [n:127.0.0.1:60081__xqv ] o.a.s.c.c.ConnectionManager Client is connected to ZooKeeper
[junit4] 2> 2682695 INFO (TEST-TestRandomRequestDistribution.test-seed#[89098B5E74BC35D6]) [n:127.0.0.1:60081__xqv ] o.a.s.c.c.SolrZkClient makePath: /overseer/queue
[junit4] 2> 2682699 INFO (TEST-TestRandomRequestDistribution.test-seed#[89098B5E74BC35D6]) [n:127.0.0.1:60081__xqv ] o.a.s.c.c.SolrZkClient makePath: /overseer/collection-queue-work
[junit4] 2> 2682705 INFO (TEST-TestRandomRequestDistribution.test-seed#[89098B5E74BC35D6]) [n:127.0.0.1:60081__xqv ] o.a.s.c.c.SolrZkClient makePath: /overseer/collection-map-running
[junit4] 2> 2682708 INFO (TEST-TestRandomRequestDistribution.test-seed#[89098B5E74BC35D6]) [n:127.0.0.1:60081__xqv ] o.a.s.c.c.SolrZkClient makePath: /overseer/collection-map-completed
[junit4] 2> 2682712 INFO (TEST-TestRandomRequestDistribution.test-seed#[89098B5E74BC35D6]) [n:127.0.0.1:60081__xqv ] o.a.s.c.c.SolrZkClient makePath: /overseer/collection-map-failure
[junit4] 2> 2682716 INFO (TEST-TestRandomRequestDistribution.test-seed#[89098B5E74BC35D6]) [n:127.0.0.1:60081__xqv ] o.a.s.c.c.SolrZkClient makePath: /live_nodes
[junit4] 2> 2682719 INFO (TEST-TestRandomRequestDistribution.test-seed#[89098B5E74BC35D6]) [n:127.0.0.1:60081__xqv ] o.a.s.c.c.SolrZkClient makePath: /aliases.json
[junit4] 2> 2682722 INFO (TEST-TestRandomRequestDistribution.test-seed#[89098B5E74BC35D6]) [n:127.0.0.1:60081__xqv ] o.a.s.c.c.SolrZkClient makePath: /clusterstate.json
[junit4] 2> 2682724 INFO (TEST-TestRandomRequestDistribution.test-seed#[89098B5E74BC35D6]) [n:127.0.0.1:60081__xqv ] o.a.s.c.c.SolrZkClient makePath: /security.json
[junit4] 2> 2682726 INFO (TEST-TestRandomRequestDistribution.test-seed#[89098B5E74BC35D6]) [n:127.0.0.1:60081__xqv ] o.a.s.c.ZkController Register node as live in ZooKeeper:/live_nodes/127.0.0.1:60081__xqv
[junit4] 2> 2682727 INFO (TEST-TestRandomRequestDistribution.test-seed#[89098B5E74BC35D6]) [n:127.0.0.1:60081__xqv ] o.a.s.c.c.SolrZkClient makePath: /live_nodes/127.0.0.1:60081__xqv
[junit4] 2> 2682730 INFO (TEST-TestRandomRequestDistribution.test-seed#[89098B5E74BC35D6]) [n:127.0.0.1:60081__xqv ] o.a.s.c.c.SolrZkClient makePath: /overseer_elect
[junit4] 2> 2682733 INFO (TEST-TestRandomRequestDistribution.test-seed#[89098B5E74BC35D6]) [n:127.0.0.1:60081__xqv ] o.a.s.c.c.SolrZkClient makePath: /overseer_elect/election
[junit4] 2> 2682735 INFO (TEST-TestRandomRequestDistribution.test-seed#[89098B5E74BC35D6]) [n:127.0.0.1:60081__xqv ] o.a.s.c.Overseer Overseer (id=null) closing
[junit4] 2> 2682736 INFO (TEST-TestRandomRequestDistribution.test-seed#[89098B5E74BC35D6]) [n:127.0.0.1:60081__xqv ] o.a.s.c.LeaderElector Joined leadership election with path: /overseer_elect/election/95355118233583620-127.0.0.1:60081__xqv-n_0000000000
[junit4] 2> 2682737 INFO (TEST-TestRandomRequestDistribution.test-seed#[89098B5E74BC35D6]) [n:127.0.0.1:60081__xqv ] o.a.s.c.OverseerElectionContext I am going to be the leader 127.0.0.1:60081__xqv
[junit4] 2> 2682737 INFO (TEST-TestRandomRequestDistribution.test-seed#[89098B5E74BC35D6]) [n:127.0.0.1:60081__xqv ] o.a.s.c.c.SolrZkClient makePath: /overseer_elect/leader
[junit4] 2> 2682739 INFO (TEST-TestRandomRequestDistribution.test-seed#[89098B5E74BC35D6]) [n:127.0.0.1:60081__xqv ] o.a.s.c.Overseer Overseer (id=95355118233583620-127.0.0.1:60081__xqv-n_0000000000) starting
[junit4] 2> 2682742 INFO (TEST-TestRandomRequestDistribution.test-seed#[89098B5E74BC35D6]) [n:127.0.0.1:60081__xqv ] o.a.s.c.c.SolrZkClient makePath: /overseer/queue-work
[junit4] 2> 2682753 INFO (TEST-TestRandomRequestDistribution.test-seed#[89098B5E74BC35D6]) [n:127.0.0.1:60081__xqv ] o.a.s.c.OverseerAutoReplicaFailoverThread Starting OverseerAutoReplicaFailoverThread autoReplicaFailoverWorkLoopDelay=10000 autoReplicaFailoverWaitAfterExpiration=30000 autoReplicaFailoverBadNodeExpiration=60000
[junit4] 2> 2682754 INFO (OverseerCollectionConfigSetProcessor-95355118233583620-127.0.0.1:60081__xqv-n_0000000000) [n:127.0.0.1:60081__xqv ] o.a.s.c.OverseerTaskProcessor Process current queue of overseer operations
[junit4] 2> 2682754 INFO (TEST-TestRandomRequestDistribution.test-seed#[89098B5E74BC35D6]) [n:127.0.0.1:60081__xqv ] o.a.s.c.c.ZkStateReader Updating cluster state from ZooKeeper...
[junit4] 2> 2682754 INFO (OverseerStateUpdate-95355118233583620-127.0.0.1:60081__xqv-n_0000000000) [n:127.0.0.1:60081__xqv ] o.a.s.c.Overseer Starting to work on the main queue
[junit4] 2> 2682770 INFO (TEST-TestRandomRequestDistribution.test-seed#[89098B5E74BC35D6]) [n:127.0.0.1:60081__xqv ] o.a.s.c.CoreContainer Security conf doesn't exist. Skipping setup for authorization module.
[junit4] 2> 2682770 INFO (TEST-TestRandomRequestDistribution.test-seed#[89098B5E74BC35D6]) [n:127.0.0.1:60081__xqv ] o.a.s.c.CoreContainer No authentication plugin used.
[junit4] 2> 2682773 INFO (TEST-TestRandomRequestDistribution.test-seed#[89098B5E74BC35D6]) [n:127.0.0.1:60081__xqv ] o.a.s.c.CorePropertiesLocator Looking for core definitions underneath /Users/jenkins/workspace/Lucene-Solr-trunk-MacOSX/solr/build/solr-core/test/J0/../../../../../../../../../Users/jenkins/workspace/Lucene-Solr-trunk-MacOSX/solr/build/solr-core/test/J0/temp/solr.cloud.TestRandomRequestDistribution_89098B5E74BC35D6-001/control-001/cores
[junit4] 2> 2682775 INFO (TEST-TestRandomRequestDistribution.test-seed#[89098B5E74BC35D6]) [n:127.0.0.1:60081__xqv ] o.a.s.c.CoreDescriptor Created CoreDescriptor: {name=collection1, config=solrconfig.xml, transient=false, schema=schema.xml, loadOnStartup=true, configSetProperties=configsetprops.json, collection=control_collection, coreNodeName=, dataDir=data/, shard=}
[junit4] 2> 2682775 INFO (TEST-TestRandomRequestDistribution.test-seed#[89098B5E74BC35D6]) [n:127.0.0.1:60081__xqv ] o.a.s.c.CorePropertiesLocator Found core collection1 in /Users/jenkins/workspace/Lucene-Solr-trunk-MacOSX/solr/build/solr-core/test/J0/../../../../../../../../../Users/jenkins/workspace/Lucene-Solr-trunk-MacOSX/solr/build/solr-core/test/J0/temp/solr.cloud.TestRandomRequestDistribution_89098B5E74BC35D6-001/control-001/cores/collection1
[junit4] 2> 2682776 INFO (TEST-TestRandomRequestDistribution.test-seed#[89098B5E74BC35D6]) [n:127.0.0.1:60081__xqv ] o.a.s.c.CorePropertiesLocator Found 1 core definitions
[junit4] 2> 2682777 INFO (TEST-TestRandomRequestDistribution.test-seed#[89098B5E74BC35D6]) [n:127.0.0.1:60081__xqv ] o.a.s.s.SolrDispatchFilter user.dir=/Users/jenkins/workspace/Lucene-Solr-trunk-MacOSX/solr/build/solr-core/test/J0
[junit4] 2> 2682777 INFO (TEST-TestRandomRequestDistribution.test-seed#[89098B5E74BC35D6]) [n:127.0.0.1:60081__xqv ] o.a.s.s.SolrDispatchFilter SolrDispatchFilter.init() done
[junit4] 2> 2682777 INFO (coreLoadExecutor-8329-thread-1-processing-n:127.0.0.1:60081__xqv) [n:127.0.0.1:60081__xqv c:control_collection x:collection1] o.a.s.c.ZkController publishing state=down
[junit4] 2> 2682777 INFO (coreLoadExecutor-8329-thread-1-processing-n:127.0.0.1:60081__xqv) [n:127.0.0.1:60081__xqv c:control_collection x:collection1] o.a.s.c.ZkController numShards not found on descriptor - reading it from system property
[junit4] 2> 2682780 INFO (OverseerStateUpdate-95355118233583620-127.0.0.1:60081__xqv-n_0000000000) [n:127.0.0.1:60081__xqv ] o.a.s.c.Overseer processMessage: queueSize: 1, message = {
[junit4] 2> "core":"collection1",
[junit4] 2> "roles":null,
[junit4] 2> "base_url":"http://127.0.0.1:60081/_xqv",
[junit4] 2> "node_name":"127.0.0.1:60081__xqv",
[junit4] 2> "numShards":"1",
[junit4] 2> "state":"down",
[junit4] 2> "shard":null,
[junit4] 2> "collection":"control_collection",
[junit4] 2> "operation":"state"} current state version: 0
[junit4] 2> 2682781 INFO (coreLoadExecutor-8329-thread-1-processing-n:127.0.0.1:60081__xqv) [n:127.0.0.1:60081__xqv c:control_collection x:collection1] o.a.s.c.ZkController look for our core node name
[junit4] 2> 2682781 INFO (OverseerStateUpdate-95355118233583620-127.0.0.1:60081__xqv-n_0000000000) [n:127.0.0.1:60081__xqv ] o.a.s.c.o.ReplicaMutator Update state numShards=1 message={
[junit4] 2> "core":"collection1",
[junit4] 2> "roles":null,
[junit4] 2> "base_url":"http://127.0.0.1:60081/_xqv",
[junit4] 2> "node_name":"127.0.0.1:60081__xqv",
[junit4] 2> "numShards":"1",
[junit4] 2> "state":"down",
[junit4] 2> "shard":null,
[junit4] 2> "collection":"control_collection",
[junit4] 2> "operation":"state"}
[junit4] 2> 2682782 INFO (OverseerStateUpdate-95355118233583620-127.0.0.1:60081__xqv-n_0000000000) [n:127.0.0.1:60081__xqv ] o.a.s.c.o.ClusterStateMutator building a new cName: control_collection
[junit4] 2> 2682783 INFO (OverseerStateUpdate-95355118233583620-127.0.0.1:60081__xqv-n_0000000000) [n:127.0.0.1:60081__xqv ] o.a.s.c.o.ReplicaMutator Assigning new node to shard shard=shard1
[junit4] 2> 2682785 INFO (zkCallback-3070-thread-1-processing-n:127.0.0.1:60081__xqv) [n:127.0.0.1:60081__xqv ] o.a.s.c.c.ZkStateReader A cluster state change: [WatchedEvent state:SyncConnected type:NodeDataChanged path:/clusterstate.json], has occurred - updating... (live nodes size: [1])
[junit4] 2> 2683783 INFO (coreLoadExecutor-8329-thread-1-processing-n:127.0.0.1:60081__xqv) [n:127.0.0.1:60081__xqv c:control_collection x:collection1] o.a.s.c.ZkController waiting to find shard id in clusterstate for collection1
[junit4] 2> 2683783 INFO (coreLoadExecutor-8329-thread-1-processing-n:127.0.0.1:60081__xqv) [n:127.0.0.1:60081__xqv c:control_collection x:collection1] o.a.s.c.ZkController Check for collection zkNode:control_collection
[junit4] 2> 2683783 INFO (coreLoadExecutor-8329-thread-1-processing-n:127.0.0.1:60081__xqv) [n:127.0.0.1:60081__xqv c:control_collection x:collection1] o.a.s.c.ZkController Collection zkNode exists
[junit4] 2> 2683784 INFO (coreLoadExecutor-8329-thread-1-processing-n:127.0.0.1:60081__xqv) [n:127.0.0.1:60081__xqv c:control_collection x:collection1] o.a.s.c.c.ZkStateReader Load collection config from: [/collections/control_collection]
[junit4] 2> 2683785 INFO (coreLoadExecutor-8329-thread-1-processing-n:127.0.0.1:60081__xqv) [n:127.0.0.1:60081__xqv c:control_collection x:collection1] o.a.s.c.c.ZkStateReader path=[/collections/control_collection] [configName]=[conf1] specified config exists in ZooKeeper
[junit4] 2> 2683785 INFO (coreLoadExecutor-8329-thread-1-processing-n:127.0.0.1:60081__xqv) [n:127.0.0.1:60081__xqv c:control_collection x:collection1] o.a.s.c.SolrResourceLoader new SolrResourceLoader for directory: '/Users/jenkins/workspace/Lucene-Solr-trunk-MacOSX/solr/build/solr-core/test/J0/temp/solr.cloud.TestRandomRequestDistribution_89098B5E74BC35D6-001/control-001/cores/collection1'
[junit4] 2> 2683785 INFO (coreLoadExecutor-8329-thread-1-processing-n:127.0.0.1:60081__xqv) [n:127.0.0.1:60081__xqv c:control_collection x:collection1] o.a.s.c.SolrResourceLoader JNDI not configured for solr (NoInitialContextEx)
[junit4] 2> 2683785 INFO (coreLoadExecutor-8329-thread-1-processing-n:127.0.0.1:60081__xqv) [n:127.0.0.1:60081__xqv c:control_collection x:collection1] o.a.s.c.SolrResourceLoader solr home defaulted to 'solr/' (could not find system property or JNDI)
[junit4] 2> 2683788 INFO (coreLoadExecutor-8329-thread-1-processing-n:127.0.0.1:60081__xqv) [n:127.0.0.1:60081__xqv c:control_collection x:collection1] o.a.s.c.Config loaded config solrconfig.xml with version 0
[junit4] 2> 2683794 INFO (coreLoadExecutor-8329-thread-1-processing-n:127.0.0.1:60081__xqv) [n:127.0.0.1:60081__xqv c:control_collection x:collection1] o.a.s.c.SolrConfig current version of requestparams : -1
[junit4] 2> 2683797 INFO (coreLoadExecutor-8329-thread-1-processing-n:127.0.0.1:60081__xqv) [n:127.0.0.1:60081__xqv c:control_collection x:collection1] o.a.s.c.SolrConfig Using Lucene MatchVersion: 6.0.0
[junit4] 2> 2683804 INFO (coreLoadExecutor-8329-thread-1-processing-n:127.0.0.1:60081__xqv) [n:127.0.0.1:60081__xqv c:control_collection x:collection1] o.a.s.c.SolrConfig Loaded SolrConfig: solrconfig.xml
[junit4] 2> 2683809 INFO (coreLoadExecutor-8329-thread-1-processing-n:127.0.0.1:60081__xqv) [n:127.0.0.1:60081__xqv c:control_collection x:collection1] o.a.s.s.IndexSchema [collection1] Schema name=test
[junit4] 2> 2683892 INFO (coreLoadExecutor-8329-thread-1-processing-n:127.0.0.1:60081__xqv) [n:127.0.0.1:60081__xqv c:control_collection x:collection1] o.a.s.s.OpenExchangeRatesOrgProvider Initialized with rates=open-exchange-rates.json, refreshInterval=1440.
[junit4] 2> 2683898 INFO (coreLoadExecutor-8329-thread-1-processing-n:127.0.0.1:60081__xqv) [n:127.0.0.1:60081__xqv c:control_collection x:collection1] o.a.s.s.IndexSchema default search field in schema is text
[junit4] 2> 2683910 INFO (coreLoadExecutor-8329-thread-1-processing-n:127.0.0.1:60081__xqv) [n:127.0.0.1:60081__xqv c:control_collection x:collection1] o.a.s.s.IndexSchema unique key field: id
[junit4] 2> 2683924 INFO (coreLoadExecutor-8329-thread-1-processing-n:127.0.0.1:60081__xqv) [n:127.0.0.1:60081__xqv c:control_collection x:collection1] o.a.s.s.FileExchangeRateProvider Reloading exchange rates from file currency.xml
[junit4] 2> 2683927 INFO (coreLoadExecutor-8329-thread-1-processing-n:127.0.0.1:60081__xqv) [n:127.0.0.1:60081__xqv c:control_collection x:collection1] o.a.s.s.FileExchangeRateProvider Reloading exchange rates from file currency.xml
[junit4] 2> 2683929 INFO (coreLoadExecutor-8329-thread-1-processing-n:127.0.0.1:60081__xqv) [n:127.0.0.1:60081__xqv c:control_collection x:collection1] o.a.s.s.OpenExchangeRatesOrgProvider Reloading exchange rates from open-exchange-rates.json
[junit4] 2> 2683930 INFO (coreLoadExecutor-8329-thread-1-processing-n:127.0.0.1:60081__xqv) [n:127.0.0.1:60081__xqv c:control_collection x:collection1] o.a.s.s.OpenExchangeRatesOrgProvider Reloading exchange rates from open-exchange-rates.json
[junit4] 2> 2683933 INFO (coreLoadExecutor-8329-thread-1-processing-n:127.0.0.1:60081__xqv) [n:127.0.0.1:60081__xqv c:control_collection x:collection1] o.a.s.c.ConfigSetProperties Did not find ConfigSet properties, assuming default properties: Can't find resource 'configsetprops.json' in classpath or '/configs/conf1', cwd=/Users/jenkins/workspace/Lucene-Solr-trunk-MacOSX/solr/build/solr-core/test/J0
[junit4] 2> 2683933 INFO (coreLoadExecutor-8329-thread-1-processing-n:127.0.0.1:60081__xqv) [n:127.0.0.1:60081__xqv c:control_collection x:collection1] o.a.s.c.CoreContainer Creating SolrCore 'collection1' using configuration from collection control_collection
[junit4] 2> 2683933 INFO (coreLoadExecutor-8329-thread-1-processing-n:127.0.0.1:60081__xqv) [n:127.0.0.1:60081__xqv c:control_collection s:shard1 r:core_node1 x:collection1] o.a.s.c.SolrCore org.apache.solr.core.MockDirectoryFactory
[junit4] 2> 2683934 INFO (coreLoadExecutor-8329-thread-1-processing-n:127.0.0.1:60081__xqv) [n:127.0.0.1:60081__xqv c:control_collection s:shard1 r:core_node1 x:collection1] o.a.s.c.SolrCore [[collection1] ] Opening new SolrCore at [/Users/jenkins/workspace/Lucene-Solr-trunk-MacOSX/solr/build/solr-core/test/J0/temp/solr.cloud.TestRandomRequestDistribution_89098B5E74BC35D6-001/control-001/cores/collection1], dataDir=[/Users/jenkins/workspace/Lucene-Solr-trunk-MacOSX/solr/build/solr-core/test/J0/../../../../../../../../../Users/jenkins/workspace/Lucene-Solr-trunk-MacOSX/solr/build/solr-core/test/J0/temp/solr.cloud.TestRandomRequestDistribution_89098B5E74BC35D6-001/control-001/cores/collection1/data/]
[junit4] 2> 2683934 INFO (coreLoadExecutor-8329-thread-1-processing-n:127.0.0.1:60081__xqv) [n:127.0.0.1:60081__xqv c:control_collection s:shard1 r:core_node1 x:collection1] o.a.s.c.JmxMonitoredMap JMX monitoring is enabled. Adding Solr mbeans to JMX Server: com.sun.jmx.mbeanserver.JmxMBeanServer@e5d1b76
[junit4] 2> 2683935 INFO (coreLoadExecutor-8329-thread-1-processing-n:127.0.0.1:60081__xqv) [n:127.0.0.1:60081__xqv c:control_collection s:shard1 r:core_node1 x:collection1] o.a.s.c.CachingDirectoryFactory return new directory for /Users/jenkins/workspace/Lucene-Solr-trunk-MacOSX/solr/build/solr-core/test/J0/../../../../../../../../../Users/jenkins/workspace/Lucene-Solr-trunk-MacOSX/solr/build/solr-core/test/J0/temp/solr.cloud.TestRandomRequestDistribution_89098B5E74BC35D6-001/control-001/cores/collection1/data
[junit4] 2> 2683935 INFO (coreLoadExecutor-8329-thread-1-processing-n:127.0.0.1:60081__xqv) [n:127.0.0.1:60081__xqv c:control_collection s:shard1 r:core_node1 x:collection1] o.a.s.c.SolrCore New index directory detected: old=null new=/Users/jenkins/workspace/Lucene-Solr-trunk-MacOSX/solr/build/solr-core/test/J0/../../../../../../../../../Users/jenkins/workspace/Lucene-Solr-trunk-MacOSX/solr/build/solr-core/test/J0/temp/solr.cloud.TestRandomRequestDistribution_89098B5E74BC35D6-001/control-001/cores/collection1/data/index/
[junit4] 2> 2683935 WARN (coreLoadExecutor-8329-thread-1-processing-n:127.0.0.1:60081__xqv) [n:127.0.0.1:60081__xqv c:control_collection s:shard1 r:core_node1 x:collection1] o.a.s.c.SolrCore [collection1] Solr index directory '/Users/jenkins/workspace/Lucene-Solr-trunk-MacOSX/solr/build/solr-core/test/J0/../../../../../../../../../Users/jenkins/workspace/Lucene-Solr-trunk-MacOSX/solr/build/solr-core/test/J0/temp/solr.cloud.TestRandomRequestDistribution_89098B5E74BC35D6-001/control-001/cores/collection1/data/index' doesn't exist. Creating new index...
[junit4] 2> 2683935 INFO (coreLoadExecutor-8329-thread-1-processing-n:127.0.0.1:60081__xqv) [n:127.0.0.1:60081__xqv c:control_collection s:shard1 r:core_node1 x:collection1] o.a.s.c.CachingDirectoryFactory return new directory for /Users/jenkins/workspace/Lucene-Solr-trunk-MacOSX/solr/build/solr-core/test/J0/../../../../../../../../../Users/jenkins/workspace/Lucene-Solr-trunk-MacOSX/solr/build/solr-core/test/J0/temp/solr.cloud.TestRandomRequestDistribution_89098B5E74BC35D6-001/control-001/cores/collection1/data/index
[junit4] 2> 2683935 INFO (coreLoadExecutor-8329-thread-1-processing-n:127.0.0.1:60081__xqv) [n:127.0.0.1:60081__xqv c:control_collection s:shard1 r:core_node1 x:collection1] o.a.s.u.RandomMergePolicy RandomMergePolicy wrapping class org.apache.lucene.index.TieredMergePolicy: [TieredMergePolicy: maxMergeAtOnce=34, maxMergeAtOnceExplicit=45, maxMergedSegmentMB=56.76171875, floorSegmentMB=1.736328125, forceMergeDeletesPctAllowed=14.249054970394083, segmentsPerTier=17.0, maxCFSSegmentSizeMB=8.796093022207999E12, noCFSRatio=0.0
[junit4] 2> 2683936 INFO (coreLoadExecutor-8329-thread-1-processing-n:127.0.0.1:60081__xqv) [n:127.0.0.1:60081__xqv c:control_collection s:shard1 r:core_node1 x:collection1] o.a.s.c.SolrDeletionPolicy SolrDeletionPolicy.onCommit: commits: num=1
[junit4] 2> commit{dir=MockDirectoryWrapper(RAMDirectory@2c8288c8 lockFactory=org.apache.lucene.store.SingleInstanceLockFactory@43faba2d),segFN=segments_1,generation=1}
[junit4] 2> 2683936 INFO (coreLoadExecutor-8329-thread-1-processing-n:127.0.0.1:60081__xqv) [n:127.0.0.1:60081__xqv c:control_collection s:shard1 r:core_node1 x:collection1] o.a.s.c.SolrDeletionPolicy newest commit generation = 1
[junit4] 2> 2683936 INFO (OldIndexDirectoryCleanupThreadForCore-collection1) [n:127.0.0.1:60081__xqv c:control_collection s:shard1 r:core_node1 x:collection1] o.a.s.c.SolrCore Looking for old index directories to cleanup for core collection1 in /Users/jenkins/workspace/Lucene-Solr-trunk-MacOSX/solr/build/solr-core/test/J0/../../../../../../../../../Users/jenkins/workspace/Lucene-Solr-trunk-MacOSX/solr/build/solr-core/test/J0/temp/solr.cloud.TestRandomRequestDistribution_89098B5E74BC35D6-001/control-001/cores/collection1/data/
[junit4] 2> 2683937 WARN (OldIndexDirectoryCleanupThreadForCore-collection1) [n:127.0.0.1:60081__xqv c:control_collection s:shard1 r:core_node1 x:collection1] o.a.s.c.DirectoryFactory /Users/jenkins/workspace/Lucene-Solr-trunk-MacOSX/solr/build/solr-core/test/J0/../../../../../../../../../Users/jenkins/workspace/Lucene-Solr-trunk-MacOSX/solr/build/solr-core/test/J0/temp/solr.cloud.TestRandomRequestDistribution_89098B5E74BC35D6-001/control-001/cores/collection1/data/ does not point to a valid data directory; skipping clean-up of old index directories.
[junit4] 2> 2683938 INFO (coreLoadExecutor-8329-thread-1-processing-n:127.0.0.1:60081__xqv) [n:127.0.0.1:60081__xqv c:control_collection s:shard1 r:core_node1 x:collection1] o.a.s.u.p.UpdateRequestProcessorChain creating updateRequestProcessorChain "nodistrib"
[junit4] 2> 2683938 INFO (coreLoadExecutor-8329-thread-1-processing-n:127.0.0.1:60081__xqv) [n:127.0.0.1:60081__xqv c:control_collection s:shard1 r:core_node1 x:collection1] o.a.s.u.p.UpdateRequestProcessorChain creating updateRequestProcessorChain "dedupe"
[junit4] 2> 2683939 INFO (coreLoadExecutor-8329-thread-1-processing-n:127.0.0.1:60081__xqv) [n:127.0.0.1:60081__xqv c:control_collection s:shard1 r:core_node1 x:collection1] o.a.s.u.p.UpdateRequestProcessorChain inserting DistributedUpdateProcessorFactory into updateRequestProcessorChain "dedupe"
[junit4] 2> 2683939 INFO (coreLoadExecutor-8329-thread-1-processing-n:127.0.0.1:60081__xqv) [n:127.0.0.1:60081__xqv c:control_collection s:shard1 r:core_node1 x:collection1] o.a.s.u.p.UpdateRequestProcessorChain creating updateRequestProcessorChain "stored_sig"
[junit4] 2> 2683939 INFO (coreLoadExecutor-8329-thread-1-processing-n:127.0.0.1:60081__xqv) [n:127.0.0.1:60081__xqv c:control_collection s:shard1 r:core_node1 x:collection1] o.a.s.u.p.UpdateRequestProcessorChain inserting DistributedUpdateProcessorFactory into updateRequestProcessorChain "stored_sig"
[junit4] 2> 2683939 INFO (coreLoadExecutor-8329-thread-1-processing-n:127.0.0.1:60081__xqv) [n:127.0.0.1:60081__xqv c:control_collection s:shard1 r:core_node1 x:collection1] o.a.s.u.p.UpdateRequestProcessorChain creating updateRequestProcessorChain "distrib-dup-test-chain-explicit"
[junit4] 2> 2683939 INFO (coreLoadExecutor-8329-thread-1-processing-n:127.0.0.1:60081__xqv) [n:127.0.0.1:60081__xqv c:control_collection s:shard1 r:core_node1 x:collection1] o.a.s.u.p.UpdateRequestProcessorChain creating updateRequestProcessorChain "distrib-dup-test-chain-implicit"
[junit4] 2> 2683939 INFO (coreLoadExecutor-8329-thread-1-processing-n:127.0.0.1:60081__xqv) [n:127.0.0.1:60081__xqv c:control_collection s:shard1 r:core_node1 x:collection1] o.a.s.u.p.UpdateRequestProcessorChain inserting DistributedUpdateProcessorFactory into updateRequestProcessorChain "distrib-dup-test-chain-implicit"
[junit4] 2> 2683939 INFO (coreLoadExecutor-8329-thread-1-processing-n:127.0.0.1:60081__xqv) [n:127.0.0.1:60081__xqv c:control_collection s:shard1 r:core_node1 x:collection1] o.a.s.c.SolrCore no updateRequestProcessorChain defined as default, creating implicit default
[junit4] 2> 2683939 WARN (coreLoadExecutor-8329-thread-1-processing-n:127.0.0.1:60081__xqv) [n:127.0.0.1:60081__xqv c:control_collection s:shard1 r:core_node1 x:collection1] o.a.s.c.RequestHandlers INVALID paramSet a in requestHandler {type = requestHandler,name = /dump,class = DumpRequestHandler,args = {defaults={a=A,b=B}}}
[junit4] 2> 2683942 INFO (coreLoadExecutor-8329-thread-1-processing-n:127.0.0.1:60081__xqv) [n:127.0.0.1:60081__xqv c:control_collection s:shard1 r:core_node1 x:collection1] o.a.s.h.l.XMLLoader xsltCacheLifetimeSeconds=60
[junit4] 2> 2683943 INFO (coreLoadExecutor-8329-thread-1-processing-n:127.0.0.1:60081__xqv) [n:127.0.0.1:60081__xqv c:control_collection s:shard1 r:core_node1 x:collection1] o.a.s.h.l.XMLLoader xsltCacheLifetimeSeconds=60
[junit4] 2> 2683943 INFO (coreLoadExecutor-8329-thread-1-processing-n:127.0.0.1:60081__xqv) [n:127.0.0.1:60081__xqv c:control_collection s:shard1 r:core_node1 x:collection1] o.a.s.h.l.XMLLoader xsltCacheLifetimeSeconds=60
[junit4] 2> 2683944 INFO (coreLoadExecutor-8329-thread-1-processing-n:127.0.0.1:60081__xqv) [n:127.0.0.1:60081__xqv c:control_collection s:shard1 r:core_node1 x:collection1] o.a.s.h.l.XMLLoader xsltCacheLifetimeSeconds=60
[junit4] 2> 2683947 INFO (coreLoadExecutor-8329-thread-1-processing-n:127.0.0.1:60081__xqv) [n:127.0.0.1:60081__xqv c:control_collection s:shard1 r:core_node1 x:collection1] o.a.s.c.RequestHandlers Registered paths: /admin/mbeans,standard,/dump,/update/csv,/sql,/update/json/docs,/admin/luke,/export,/admin/segments,/get,/admin/system,/replication,/admin/properties,/config,/stream,/schema,/admin/plugins,/admin/logging,/update/json,/admin/threads,/admin/ping,/update,/admin/file
[junit4] 2> 2683947 INFO (coreLoadExecutor-8329-thread-1-processing-n:127.0.0.1:60081__xqv) [n:127.0.0.1:60081__xqv c:control_collection s:shard1 r:core_node1 x:collection1] o.a.s.c.SolrCore Using default statsCache cache: org.apache.solr.search.stats.LocalStatsCache
[junit4] 2> 2683948 INFO (coreLoadExecutor-8329-thread-1-processing-n:127.0.0.1:60081__xqv) [n:127.0.0.1:60081__xqv c:control_collection s:shard1 r:core_node1 x:collection1] o.a.s.u.UpdateHandler Using UpdateLog implementation: org.apache.solr.update.UpdateLog
[junit4] 2> 2683948 INFO (coreLoadExecutor-8329-thread-1-processing-n:127.0.0.1:60081__xqv) [n:127.0.0.1:60081__xqv c:control_collection s:shard1 r:core_node1 x:collection1] o.a.s.u.UpdateLog Initializing UpdateLog: dataDir= defaultSyncLevel=FLUSH numRecordsToKeep=100 maxNumLogsToKeep=10 numVersionBuckets=65536
[junit4] 2> 2683951 INFO (coreLoadExecutor-8329-thread-1-processing-n:127.0.0.1:60081__xqv) [n:127.0.0.1:60081__xqv c:control_collection s:shard1 r:core_node1 x:collection1] o.a.s.u.CommitTracker Hard AutoCommit: disabled
[junit4] 2> 2683951 INFO (coreLoadExecutor-8329-thread-1-processing-n:127.0.0.1:60081__xqv) [n:127.0.0.1:60081__xqv c:control_collection s:shard1 r:core_node1 x:collection1] o.a.s.u.CommitTracker Soft AutoCommit: disabled
[junit4] 2> 2683951 INFO (coreLoadExecutor-8329-thread-1-processing-n:127.0.0.1:60081__xqv) [n:127.0.0.1:60081__xqv c:control_collection s:shard1 r:core_node1 x:collection1] o.a.s.u.RandomMergePolicy RandomMergePolicy wrapping class org.apache.lucene.index.TieredMergePolicy: [TieredMergePolicy: maxMergeAtOnce=10, maxMergeAtOnceExplicit=41, maxMergedSegmentMB=10.8427734375, floorSegmentMB=1.619140625, forceMergeDeletesPctAllowed=14.458837480906869, segmentsPerTier=43.0, maxCFSSegmentSizeMB=8.796093022207999E12, noCFSRatio=0.0
[junit4] 2> 2683951 INFO (coreLoadExecutor-8329-thread-1-processing-n:127.0.0.1:60081__xqv) [n:127.0.0.1:60081__xqv c:control_collection s:shard1 r:core_node1 x:collection1] o.a.s.c.SolrDeletionPolicy SolrDeletionPolicy.onInit: commits: num=1
[junit4] 2> commit{dir=MockDirectoryWrapper(RAMDirectory@2c8288c8 lockFactory=org.apache.lucene.store.SingleInstanceLockFactory@43faba2d),segFN=segments_1,generation=1}
[junit4] 2> 2683952 INFO (coreLoadExecutor-8329-thread-1-processing-n:127.0.0.1:60081__xqv) [n:127.0.0.1:60081__xqv c:control_collection s:shard1 r:core_node1 x:collection1] o.a.s.c.SolrDeletionPolicy newest commit generation = 1
[junit4] 2> 2683952 INFO (coreLoadExecutor-8329-thread-1-processing-n:127.0.0.1:60081__xqv) [n:127.0.0.1:60081__xqv c:control_collection s:shard1 r:core_node1 x:collection1] o.a.s.s.SolrIndexSearcher Opening [Searcher@2f8b13eb[collection1] main]
[junit4] 2> 2683952 INFO (coreLoadExecutor-8329-thread-1-processing-n:127.0.0.1:60081__xqv) [n:127.0.0.1:60081__xqv c:control_collection s:shard1 r:core_node1 x:collection1] o.a.s.c.c.ZkStateReader Load collection config from: [/collections/control_collection]
[junit4] 2> 2683953 INFO (coreLoadExecutor-8329-thread-1-processing-n:127.0.0.1:60081__xqv) [n:127.0.0.1:60081__xqv c:control_collection s:shard1 r:core_node1 x:collection1] o.a.s.c.c.ZkStateReader path=[/collections/control_collection] [configName]=[conf1] specified config exists in ZooKeeper
[junit4] 2> 2683953 INFO (coreLoadExecutor-8329-thread-1-processing-n:127.0.0.1:60081__xqv) [n:127.0.0.1:60081__xqv c:control_collection s:shard1 r:core_node1 x:collection1] o.a.s.r.ManagedResourceStorage Setting up ZooKeeper-based storage for the RestManager with znodeBase: /configs/conf1
[junit4] 2> 2683954 INFO (coreLoadExecutor-8329-thread-1-processing-n:127.0.0.1:60081__xqv) [n:127.0.0.1:60081__xqv c:control_collection s:shard1 r:core_node1 x:collection1] o.a.s.r.ManagedResourceStorage Configured ZooKeeperStorageIO with znodeBase: /configs/conf1
[junit4] 2> 2683954 INFO (coreLoadExecutor-8329-thread-1-processing-n:127.0.0.1:60081__xqv) [n:127.0.0.1:60081__xqv c:control_collection s:shard1 r:core_node1 x:collection1] o.a.s.r.RestManager Initializing RestManager with initArgs: {}
[junit4] 2> 2683954 INFO (coreLoadExecutor-8329-thread-1-processing-n:127.0.0.1:60081__xqv) [n:127.0.0.1:60081__xqv c:control_collection s:shard1 r:core_node1 x:collection1] o.a.s.r.ManagedResourceStorage Reading _rest_managed.json using ZooKeeperStorageIO:path=/configs/conf1
[junit4] 2> 2683955 INFO (coreLoadExecutor-8329-thread-1-processing-n:127.0.0.1:60081__xqv) [n:127.0.0.1:60081__xqv c:control_collection s:shard1 r:core_node1 x:collection1] o.a.s.r.ManagedResourceStorage No data found for znode /configs/conf1/_rest_managed.json
[junit4] 2> 2683955 INFO (coreLoadExecutor-8329-thread-1-processing-n:127.0.0.1:60081__xqv) [n:127.0.0.1:60081__xqv c:control_collection s:shard1 r:core_node1 x:collection1] o.a.s.r.ManagedResourceStorage Loaded null at path _rest_managed.json using ZooKeeperStorageIO:path=/configs/conf1
[junit4] 2> 2683955 INFO (coreLoadExecutor-8329-thread-1-processing-n:127.0.0.1:60081__xqv) [n:127.0.0.1:60081__xqv c:control_collection s:shard1 r:core_node1 x:collection1] o.a.s.r.RestManager Initializing 0 registered ManagedResources
[junit4] 2> 2683955 INFO (coreLoadExecutor-8329-thread-1-processing-n:127.0.0.1:60081__xqv) [n:127.0.0.1:60081__xqv c:control_collection s:shard1 r:core_node1 x:collection1] o.a.s.h.ReplicationHandler Commits will be reserved for 10000
[junit4] 2> 2683955 INFO (searcherExecutor-8330-thread-1-processing-n:127.0.0.1:60081__xqv x:collection1 s:shard1 c:control_collection r:core_node1) [n:127.0.0.1:60081__xqv c:control_collection s:shard1 r:core_node1 x:collection1] o.a.s.c.SolrCore [collection1] Registered new searcher Searcher@2f8b13eb[collection1] main{ExitableDirectoryReader(UninvertingDirectoryReader())}
[junit4] 2> 2683955 INFO (coreLoadExecutor-8329-thread-1-processing-n:127.0.0.1:60081__xqv) [n:127.0.0.1:60081__xqv c:control_collection s:shard1 r:core_node1 x:collection1] o.a.s.u.UpdateLog Looking up max value of version field to seed version buckets
[junit4] 2> 2683956 INFO (coreLoadExecutor-8329-thread-1-processing-n:127.0.0.1:60081__xqv) [n:127.0.0.1:60081__xqv c:control_collection s:shard1 r:core_node1 x:collection1] o.a.s.u.VersionInfo Refreshing highest value of _version_ for 65536 version buckets from index
[junit4] 2> 2683956 INFO (coreLoadExecutor-8329-thread-1-processing-n:127.0.0.1:60081__xqv) [n:127.0.0.1:60081__xqv c:control_collection s:shard1 r:core_node1 x:collection1] o.a.s.u.VersionInfo No terms found for _version_, cannot seed version bucket highest value from index
[junit4] 2> 2683956 INFO (coreLoadExecutor-8329-thread-1-processing-n:127.0.0.1:60081__xqv) [n:127.0.0.1:60081__xqv c:control_collection s:shard1 r:core_node1 x:collection1] o.a.s.u.UpdateLog Could not find max version in index or recent updates, using new clock 1525681893588074496
[junit4] 2> 2683957 INFO (coreLoadExecutor-8329-thread-1-processing-n:127.0.0.1:60081__xqv) [n:127.0.0.1:60081__xqv c:control_collection s:shard1 r:core_node1 x:collection1] o.a.s.u.UpdateLog Took 1.0ms to seed version buckets with highest version 1525681893588074496
[junit4] 2> 2683958 INFO (coreLoadExecutor-8329-thread-1-processing-n:127.0.0.1:60081__xqv) [n:127.0.0.1:60081__xqv c:control_collection s:shard1 r:core_node1 x:collection1] o.a.s.c.ZkController watch zkdir /configs/conf1
[junit4] 2> 2683959 INFO (coreLoadExecutor-8329-thread-1-processing-n:127.0.0.1:60081__xqv) [n:127.0.0.1:60081__xqv c:control_collection s:shard1 r:core_node1 x:collection1] o.a.s.c.CoreContainer registering core: collection1
[junit4] 2> 2683959 INFO (coreZkRegister-8323-thread-1-processing-n:127.0.0.1:60081__xqv x:collection1 s:shard1 c:control_collection r:core_node1) [n:127.0.0.1:60081__xqv c:control_collection s:shard1 r:core_node1 x:collection1] o.a.s.c.ZkController Register replica - core:collection1 address:http://127.0.0.1:60081/_xqv collection:control_collection shard:shard1
[junit4] 2> 2683961 INFO (coreZkRegister-8323-thread-1-processing-n:127.0.0.1:60081__xqv x:collection1 s:shard1 c:control_collection r:core_node1) [n:127.0.0.1:60081__xqv c:control_collection s:shard1 r:core_node1 x:collection1] o.a.s.c.c.SolrZkClient makePath: /collections/control_collection/leader_elect/shard1/election
[junit4] 2> 2683967 INFO (coreZkRegister-8323-thread-1-processing-n:127.0.0.1:60081__xqv x:collection1 s:shard1 c:control_collection r:core_node1) [n:127.0.0.1:60081__xqv c:control_collection s:shard1 r:core_node1 x:collection1] o.a.s.c.LeaderElector Joined leadership election with path: /collections/control_collection/leader_elect/shard1/election/95355118233583620-core_node1-n_0000000000
[junit4] 2> 2683967 INFO (coreZkRegister-8323-thread-1-processing-n:127.0.0.1:60081__xqv x:collection1 s:shard1 c:control_collection r:core_node1) [n:127.0.0.1:60081__xqv c:control_collection s:shard1 r:core_node1 x:collection1] o.a.s.c.ShardLeaderElectionContext Running the leader process for shard=shard1 and weAreReplacement=false and leaderVoteWait=10000
[junit4] 2> 2683971 INFO (coreZkRegister-8323-thread-1-processing-n:127.0.0.1:60081__xqv x:collection1 s:shard1 c:control_collection r:core_node1) [n:127.0.0.1:60081__xqv c:control_collection s:shard1 r:core_node1 x:collection1] o.a.s.c.ShardLeaderElectionContext Enough replicas found to continue.
[junit4] 2> 2683971 INFO (coreZkRegister-8323-thread-1-processing-n:127.0.0.1:60081__xqv x:collection1 s:shard1 c:control_collection r:core_node1) [n:127.0.0.1:60081__xqv c:control_collection s:shard1 r:core_node1 x:collection1] o.a.s.c.ShardLeaderElectionContext I may be the new leader - try and sync
[junit4] 2> 2683971 INFO (coreZkRegister-8323-thread-1-processing-n:127.0.0.1:60081__xqv x:collection1 s:shard1 c:control_collection r:core_node1) [n:127.0.0.1:60081__xqv c:control_collection s:shard1 r:core_node1 x:collection1] o.a.s.c.SyncStrategy Sync replicas to http://127.0.0.1:60081/_xqv/collection1/
[junit4] 2> 2683971 INFO (coreZkRegister-8323-thread-1-processing-n:127.0.0.1:60081__xqv x:collection1 s:shard1 c:control_collection r:core_node1) [n:127.0.0.1:60081__xqv c:control_collection s:shard1 r:core_node1 x:collection1] o.a.s.c.SyncStrategy Sync Success - now sync replicas to me
[junit4] 2> 2683971 INFO (coreZkRegister-8323-thread-1-processing-n:127.0.0.1:60081__xqv x:collection1 s:shard1 c:control_collection r:core_node1) [n:127.0.0.1:60081__xqv c:control_collection s:shard1 r:core_node1 x:collection1] o.a.s.c.SyncStrategy http://127.0.0.1:60081/_xqv/collection1/ has no replicas
[junit4] 2> 2683971 INFO (OverseerStateUpdate-95355118233583620-127.0.0.1:60081__xqv-n_0000000000) [n:127.0.0.1:60081__xqv ] o.a.s.c.Overseer processMessage: queueSize: 1, message = {
[junit4] 2> "operation":"leader",
[junit4] 2> "shard":"shard1",
[junit4] 2> "collection":"control_collection"} current state version: 1
[junit4] 2> 2683972 INFO (coreZkRegister-8323-thread-1-processing-n:127.0.0.1:60081__xqv x:collection1 s:shard1 c:control_collection r:core_node1) [n:127.0.0.1:60081__xqv c:control_collection s:shard1 r:core_node1 x:collection1] o.a.s.c.c.SolrZkClient makePath: /collections/control_collection/leaders/shard1
[junit4] 2> 2683977 INFO (coreZkRegister-8323-thread-1-processing-n:127.0.0.1:60081__xqv x:collection1 s:shard1 c:control_collection r:core_node1) [n:127.0.0.1:60081__xqv c:control_collection s:shard1 r:core_node1 x:collection1] o.a.s.c.ShardLeaderElectionContextBase Creating leader registration node
[junit4] 2> 2683980 INFO (coreZkRegister-8323-thread-1-processing-n:127.0.0.1:60081__xqv x:collection1 s:shard1 c:control_collection r:core_node1) [n:127.0.0.1:60081__xqv c:control_collection s:shard1 r:core_node1 x:collection1] o.a.s.c.ShardLeaderElectionContext I am the new leader: http://127.0.0.1:60081/_xqv/collection1/ shard1
[junit4] 2> 2683981 INFO (OverseerStateUpdate-95355118233583620-127.0.0.1:60081__xqv-n_0000000000) [n:127.0.0.1:60081__xqv ] o.a.s.c.Overseer processMessage: queueSize: 1, message = {
[junit4] 2> "operation":"leader",
[junit4] 2> "shard":"shard1",
[junit4] 2> "collection":"control_collection",
[junit4] 2> "base_url":"http://127.0.0.1:60081/_xqv",
[junit4] 2> "core":"collection1",
[junit4] 2> "state":"active"} current state version: 1
[junit4] 2> 2684086 INFO (zkCallback-3070-thread-1-processing-n:127.0.0.1:60081__xqv) [n:127.0.0.1:60081__xqv ] o.a.s.c.c.ZkStateReader A cluster state change: [WatchedEvent state:SyncConnected type:NodeDataChanged path:/clusterstate.json], has occurred - updating... (live nodes size: [1])
[junit4] 2> 2684134 INFO (coreZkRegister-8323-thread-1-processing-n:127.0.0.1:60081__xqv x:collection1 s:shard1 c:control_collection r:core_node1) [n:127.0.0.1:60081__xqv c:control_collection s:shard1 r:core_node1 x:collection1] o.a.s.c.ZkController We are http://127.0.0.1:60081/_xqv/collection1/ and leader is http://127.0.0.1:60081/_xqv/collection1/
[junit4] 2> 2684134 INFO (coreZkRegister-8323-thread-1-processing-n:127.0.0.1:60081__xqv x:collection1 s:shard1 c:control_collection r:core_node1) [n:127.0.0.1:60081__xqv c:control_collection s:shard1 r:core_node1 x:collection1] o.a.s.c.ZkController No LogReplay needed for core=collection1 baseURL=http://127.0.0.1:60081/_xqv
[junit4] 2> 2684134 INFO (coreZkRegister-8323-thread-1-processing-n:127.0.0.1:60081__xqv x:collection1 s:shard1 c:control_collection r:core_node1) [n:127.0.0.1:60081__xqv c:control_collection s:shard1 r:core_node1 x:collection1] o.a.s.c.ZkController I am the leader, no recovery necessary
[junit4] 2> 2684134 INFO (coreZkRegister-8323-thread-1-processing-n:127.0.0.1:60081__xqv x:collection1 s:shard1 c:control_collection r:core_node1) [n:127.0.0.1:60081__xqv c:control_collection s:shard1 r:core_node1 x:collection1] o.a.s.c.ZkController publishing state=active
[junit4] 2> 2684134 INFO (coreZkRegister-8323-thread-1-processing-n:127.0.0.1:60081__xqv x:collection1 s:shard1 c:control_collection r:core_node1) [n:127.0.0.1:60081__xqv c:control_collection s:shard1 r:core_node1 x:collection1] o.a.s.c.ZkController numShards not found on descriptor - reading it from system property
[junit4] 2> 2684137 INFO (OverseerStateUpdate-95355118233583620-127.0.0.1:60081__xqv-n_0000000000) [n:127.0.0.1:60081__xqv ] o.a.s.c.Overseer processMessage: queueSize: 1, message = {
[junit4] 2> "core":"collection1",
[junit4] 2> "core_node_name":"core_node1",
[junit4] 2> "roles":null,
[junit4] 2> "base_url":"http://127.0.0.1:60081/_xqv",
[junit4] 2> "node_name":"127.0.0.1:60081__xqv",
[junit4] 2> "numShards":"1",
[junit4] 2> "state":"active",
[junit4] 2> "shard":"shard1",
[junit4] 2> "collection":"control_collection",
[junit4] 2> "operation":"state"} current state version: 2
[junit4] 2> 2684139 INFO (OverseerStateUpdate-95355118233583620-127.0.0.1:60081__xqv-n_0000000000) [n:127.0.0.1:60081__xqv ] o.a.s.c.o.ReplicaMutator Update state numShards=1 message={
[junit4] 2> "core":"collection1",
[junit4] 2> "core_node_name":"core_node1",
[junit4] 2> "roles":null,
[junit4] 2> "base_url":"http://127.0.0.1:60081/_xqv",
[junit4] 2> "node_name":"127.0.0.1:60081__xqv",
[junit4] 2> "numShards":"1",
[junit4] 2> "state":"active",
[junit4] 2> "shard":"shard1",
[junit4] 2> "collection":"control_collection",
[junit4] 2> "operation":"state"}
[junit4] 2> 2684244 INFO (zkCallback-3070-thread-1-processing-n:127.0.0.1:60081__xqv) [n:127.0.0.1:60081__xqv ] o.a.s.c.c.ZkStateReader A cluster state change: [WatchedEvent state:SyncConnected type:NodeDataChanged path:/clusterstate.json], has occurred - updating... (live nodes size: [1])
[junit4] 2> 2684282 INFO (TEST-TestRandomRequestDistribution.test-seed#[89098B5E74BC35D6]) [ ] o.a.s.c.c.SolrZkClient Using default ZkCredentialsProvider
[junit4] 2> 2684283 INFO (TEST-TestRandomRequestDistribution.test-seed#[89098B5E74BC35D6]) [ ] o.a.s.c.c.ConnectionManager Waiting for client to connect to ZooKeeper
[junit4] 2> 2684285 INFO (zkCallback-3072-thread-1) [ ] o.a.s.c.c.ConnectionManager Watcher org.apache.solr.common.cloud.ConnectionManager@23acb814 name:ZooKeeperConnection Watcher:127.0.0.1:60078/solr got event WatchedEvent state:SyncConnected type:None path:null path:null type:None
[junit4] 2> 2684285 INFO (TEST-TestRandomRequestDistribution.test-seed#[89098B5E74BC35D6]) [ ] o.a.s.c.c.ConnectionManager Client is connected to ZooKeeper
[junit4] 2> 2684285 INFO (TEST-TestRandomRequestDistribution.test-seed#[89098B5E74BC35D6]) [ ] o.a.s.c.c.SolrZkClient Using default ZkACLProvider
[junit4] 2> 2684285 INFO (TEST-TestRandomRequestDistribution.test-seed#[89098B5E74BC35D6]) [ ] o.a.s.c.c.ZkStateReader Updating cluster state from ZooKeeper...
[junit4] 2> 2684289 INFO (TEST-TestRandomRequestDistribution.test-seed#[89098B5E74BC35D6]) [ ] o.a.s.c.ChaosMonkey monkey: init - expire sessions:false cause connection loss:false
[junit4] 2> 2684289 INFO (TEST-TestRandomRequestDistribution.test-seed#[89098B5E74BC35D6]) [ ] o.a.s.c.AbstractFullDistribZkTestBase Creating collection1 with stateFormat=2
[junit4] 2> 2684289 INFO (TEST-TestRandomRequestDistribution.test-seed#[89098B5E74BC35D6]) [ ] o.a.s.c.c.SolrZkClient Using default ZkCredentialsProvider
[junit4] 2> 2684290 INFO (TEST-TestRandomRequestDistribution.test-seed#[89098B5E74BC35D6]) [ ] o.a.s.c.c.ConnectionManager Waiting for client to connect to ZooKeeper
[junit4] 2> 2684291 INFO (zkCallback-3073-thread-1) [ ] o.a.s.c.c.ConnectionManager Watcher org.apache.solr.common.cloud.ConnectionManager@29c0f581 name:ZooKeeperConnection Watcher:127.0.0.1:60078/solr got event WatchedEvent state:SyncConnected type:None path:null path:null type:None
[junit4] 2> 2684291 INFO (TEST-TestRandomRequestDistribution.test-seed#[89098B5E74BC35D6]) [ ] o.a.s.c.c.ConnectionManager Client is connected to ZooKeeper
[junit4] 2> 2684291 INFO (TEST-TestRandomRequestDistribution.test-seed#[89098B5E74BC35D6]) [ ] o.a.s.c.c.SolrZkClient Using default ZkACLProvider
[junit4] 2> 2684295 INFO (OverseerStateUpdate-95355118233583620-127.0.0.1:60081__xqv-n_0000000000) [n:127.0.0.1:60081__xqv ] o.a.s.c.Overseer processMessage: queueSize: 1, message = {
[junit4] 2> "operation":"create",
[junit4] 2> "name":"collection1",
[junit4] 2> "numShards":"2",
[junit4] 2> "stateFormat":"2"} current state version: 3
[junit4] 2> 2684295 INFO (OverseerStateUpdate-95355118233583620-127.0.0.1:60081__xqv-n_0000000000) [n:127.0.0.1:60081__xqv ] o.a.s.c.o.ClusterStateMutator building a new cName: collection1
[junit4] 2> 2684400 INFO (OverseerStateUpdate-95355118233583620-127.0.0.1:60081__xqv-n_0000000000) [n:127.0.0.1:60081__xqv ] o.a.s.c.o.ZkStateWriter going to create_collection /collections/collection1/state.json
[junit4] 2> 2684520 INFO (TEST-TestRandomRequestDistribution.test-seed#[89098B5E74BC35D6]) [ ] o.a.s.SolrTestCaseJ4 Writing core.properties file to /Users/jenkins/workspace/Lucene-Solr-trunk-MacOSX/solr/build/solr-core/test/J0/temp/solr.cloud.TestRandomRequestDistribution_89098B5E74BC35D6-001/shard-1-001/cores/collection1
[junit4] 2> 2684521 INFO (TEST-TestRandomRequestDistribution.test-seed#[89098B5E74BC35D6]) [ ] o.a.s.c.AbstractFullDistribZkTestBase create jetty 1 in directory /Users/jenkins/workspace/Lucene-Solr-trunk-MacOSX/solr/build/solr-core/test/J0/temp/solr.cloud.TestRandomRequestDistribution_89098B5E74BC35D6-001/shard-1-001
[junit4] 2> 2684522 INFO (TEST-TestRandomRequestDistribution.test-seed#[89098B5E74BC35D6]) [ ] o.e.j.s.Server jetty-9.2.13.v20150730
[junit4] 2> 2684525 INFO (TEST-TestRandomRequestDistribution.test-seed#[89098B5E74BC35D6]) [ ] o.e.j.s.h.ContextHandler Started o.e.j.s.ServletContextHandler@41d21210{/_xqv,null,AVAILABLE}
[junit4] 2> 2684525 INFO (TEST-TestRandomRequestDistribution.test-seed#[89098B5E74BC35D6]) [ ] o.e.j.s.ServerConnector Started ServerConnector@38b7fabf{HTTP/1.1}{127.0.0.1:60087}
[junit4] 2> 2684525 INFO (TEST-TestRandomRequestDistribution.test-seed#[89098B5E74BC35D6]) [ ] o.e.j.s.Server Started @2687967ms
[junit4] 2> 2684525 INFO (TEST-TestRandomRequestDistribution.test-seed#[89098B5E74BC35D6]) [ ] o.a.s.c.s.e.JettySolrRunner Jetty properties: {solr.data.dir=/Users/jenkins/workspace/Lucene-Solr-trunk-MacOSX/solr/build/solr-core/test/J0/temp/solr.cloud.TestRandomRequestDistribution_89098B5E74BC35D6-001/tempDir-001/jetty1, solrconfig=solrconfig.xml, hostContext=/_xqv, hostPort=60087, coreRootDirectory=/Users/jenkins/workspace/Lucene-Solr-trunk-MacOSX/solr/build/solr-core/test/J0/temp/solr.cloud.TestRandomRequestDistribution_89098B5E74BC35D6-001/shard-1-001/cores}
[junit4] 2> 2684525 INFO (TEST-TestRandomRequestDistribution.test-seed#[89098B5E74BC35D6]) [ ] o.a.s.s.SolrDispatchFilter SolrDispatchFilter.init(): sun.misc.Launcher$AppClassLoader@1540e19d
[junit4] 2> 2684525 INFO (TEST-TestRandomRequestDistribution.test-seed#[89098B5E74BC35D6]) [ ] o.a.s.c.SolrResourceLoader new SolrResourceLoader for directory: '/Users/jenkins/workspace/Lucene-Solr-trunk-MacOSX/solr/build/solr-core/test/J0/temp/solr.cloud.TestRandomRequestDistribution_89098B5E74BC35D6-001/shard-1-001'
[junit4] 2> 2684526 INFO (TEST-TestRandomRequestDistribution.test-seed#[89098B5E74BC35D6]) [ ] o.a.s.c.SolrResourceLoader JNDI not configured for solr (NoInitialContextEx)
[junit4] 2> 2684526 INFO (TEST-TestRandomRequestDistribution.test-seed#[89098B5E74BC35D6]) [ ] o.a.s.c.SolrResourceLoader solr home defaulted to 'solr/' (could not find system property or JNDI)
[junit4] 2> 2684526 INFO (TEST-TestRandomRequestDistribution.test-seed#[89098B5E74BC35D6]) [ ] o.a.s.c.c.SolrZkClient Using default ZkCredentialsProvider
[junit4] 2> 2684526 INFO (TEST-TestRandomRequestDistribution.test-seed#[89098B5E74BC35D6]) [ ] o.a.s.c.c.ConnectionManager Waiting for client to connect to ZooKeeper
[junit4] 2> 2684528 INFO (zkCallback-3074-thread-1) [ ] o.a.s.c.c.ConnectionManager Watcher org.apache.solr.common.cloud.ConnectionManager@69f1d68b name:ZooKeeperConnection Watcher:127.0.0.1:60078/solr got event WatchedEvent state:SyncConnected type:None path:null path:null type:None
[junit4] 2> 2684528 INFO (TEST-TestRandomRequestDistribution.test-seed#[89098B5E74BC35D6]) [ ] o.a.s.c.c.ConnectionManager Client is connected to ZooKeeper
[junit4] 2> 2684528 INFO (TEST-TestRandomRequestDistribution.test-seed#[89098B5E74BC35D6]) [ ] o.a.s.c.c.SolrZkClient Using default ZkACLProvider
[junit4] 2> 2684530 INFO (TEST-TestRandomRequestDistribution.test-seed#[89098B5E74BC35D6]) [ ] o.a.s.s.SolrDispatchFilter Loading solr.xml from SolrHome (not found in ZooKeeper)
[junit4] 2> 2684530 INFO (TEST-TestRandomRequestDistribution.test-seed#[89098B5E74BC35D6]) [ ] o.a.s.c.SolrXmlConfig Loading container configuration from /Users/jenkins/workspace/Lucene-Solr-trunk-MacOSX/solr/build/solr-core/test/J0/temp/solr.cloud.TestRandomRequestDistribution_89098B5E74BC35D6-001/shard-1-001/solr.xml
[junit4] 2> 2684549 INFO (TEST-TestRandomRequestDistribution.test-seed#[89098B5E74BC35D6]) [ ] o.a.s.c.CorePropertiesLocator Config-defined core root directory: /Users/jenkins/workspace/Lucene-Solr-trunk-MacOSX/solr/build/solr-core/test/J0/temp/solr.cloud.TestRandomRequestDistribution_89098B5E74BC35D6-001/shard-1-001/cores
[junit4] 2> 2684549 INFO (TEST-TestRandomRequestDistribution.test-seed#[89098B5E74BC35D6]) [ ] o.a.s.c.CoreContainer New CoreContainer 801971860
[junit4] 2> 2684550 INFO (TEST-TestRandomRequestDistribution.test-seed#[89098B5E74BC35D6]) [ ] o.a.s.c.CoreContainer Loading cores into CoreContainer [instanceDir=/Users/jenkins/workspace/Lucene-Solr-trunk-MacOSX/solr/build/solr-core/test/J0/temp/solr.cloud.TestRandomRequestDistribution_89098B5E74BC35D6-001/shard-1-001]
[junit4] 2> 2684550 WARN (TEST-TestRandomRequestDistribution.test-seed#[89098B5E74BC35D6]) [ ] o.a.s.c.CoreContainer Couldn't add files from /Users/jenkins/workspace/Lucene-Solr-trunk-MacOSX/solr/build/solr-core/test/J0/temp/solr.cloud.TestRandomRequestDistribution_89098B5E74BC35D6-001/shard-1-001/lib to classpath: /Users/jenkins/workspace/Lucene-Solr-trunk-MacOSX/solr/build/solr-core/test/J0/temp/solr.cloud.TestRandomRequestDistribution_89098B5E74BC35D6-001/shard-1-001/lib
[junit4] 2> 2684550 INFO (TEST-TestRandomRequestDistribution.test-seed#[89098B5E74BC35D6]) [ ] o.a.s.h.c.HttpShardHandlerFactory created with socketTimeout : 90000,urlScheme : ,connTimeout : 15000,maxConnectionsPerHost : 20,maxConnections : 10000,corePoolSize : 0,maximumPoolSize : 2147483647,maxThreadIdleTime : 5,sizeOfQueue : -1,fairnessPolicy : false,useRetries : false,
[junit4] 2> 2684552 INFO (TEST-TestRandomRequestDistribution.test-seed#[89098B5E74BC35D6]) [ ] o.a.s.u.UpdateShardHandler Creating UpdateShardHandler HTTP client with params: socketTimeout=340000&connTimeout=45000&retry=true
[junit4] 2> 2684552 INFO (TEST-TestRandomRequestDistribution.test-seed#[89098B5E74BC35D6]) [ ] o.a.s.l.LogWatcher SLF4J impl is org.slf4j.impl.Log4jLoggerFactory
[junit4] 2> 2684552 INFO (TEST-TestRandomRequestDistribution.test-seed#[89098B5E74BC35D6]) [ ] o.a.s.l.LogWatcher Registering Log Listener [Log4j (org.slf4j.impl.Log4jLoggerFactory)]
[junit4] 2> 2684552 INFO (TEST-TestRandomRequestDistribution.test-seed#[89098B5E74BC35D6]) [ ] o.a.s.c.ZkContainer Zookeeper client=127.0.0.1:60078/solr
[junit4] 2> 2684553 INFO (TEST-TestRandomRequestDistribution.test-seed#[89098B5E74BC35D6]) [ ] o.a.s.c.ZkController zkHost includes chroot
[junit4] 2> 2684553 INFO (TEST-TestRandomRequestDistribution.test-seed#[89098B5E74BC35D6]) [ ] o.a.s.c.c.SolrZkClient Using default ZkCredentialsProvider
[junit4] 2> 2684553 INFO (TEST-TestRandomRequestDistribution.test-seed#[89098B5E74BC35D6]) [ ] o.a.s.c.c.ConnectionManager Waiting for client to connect to ZooKeeper
[junit4] 2> 2684555 INFO (zkCallback-3077-thread-1) [ ] o.a.s.c.c.ConnectionManager Watcher org.apache.solr.common.cloud.ConnectionManager@1f95053a name:ZooKeeperConnection Watcher:127.0.0.1:60078 got event WatchedEvent state:SyncConnected type:None path:null path:null type:None
[junit4] 2> 2684555 INFO (TEST-TestRandomRequestDistribution.test-seed#[89098B5E74BC35D6]) [ ] o.a.s.c.c.ConnectionManager Client is connected to ZooKeeper
[junit4] 2> 2684555 INFO (TEST-TestRandomRequestDistribution.test-seed#[89098B5E74BC35D6]) [ ] o.a.s.c.c.SolrZkClient Using default ZkACLProvider
[junit4] 2> 2684558 INFO (TEST-TestRandomRequestDistribution.test-seed#[89098B5E74BC35D6]) [n:127.0.0.1:60087__xqv ] o.a.s.c.c.ConnectionManager Waiting for client to connect to ZooKeeper
[junit4] 2> 2684559 INFO (zkCallback-3078-thread-1-processing-n:127.0.0.1:60087__xqv) [n:127.0.0.1:60087__xqv ] o.a.s.c.c.ConnectionManager Watcher org.apache.solr.common.cloud.ConnectionManager@68c0dd75 name:ZooKeeperConnection Watcher:127.0.0.1:60078/solr got event WatchedEvent state:SyncConnected type:None path:null path:null type:None
[junit4] 2> 2684560 INFO (TEST-TestRandomRequestDistribution.test-seed#[89098B5E74BC35D6]) [n:127.0.0.1:60087__xqv ] o.a.s.c.c.ConnectionManager Client is connected to ZooKeeper
[junit4] 2> 2684569 INFO (TEST-TestRandomRequestDistribution.test-seed#[89098B5E74BC35D6]) [n:127.0.0.1:60087__xqv ] o.a.s.c.c.ZkStateReader Updating cluster state from ZooKeeper...
[junit4] 2> 2685584 INFO (TEST-TestRandomRequestDistribution.test-seed#[89098B5E74BC35D6]) [n:127.0.0.1:60087__xqv ] o.a.s.c.ZkController Register node as live in ZooKeeper:/live_nodes/127.0.0.1:60087__xqv
[junit4] 2> 2685585 INFO (TEST-TestRandomRequestDistribution.test-seed#[89098B5E74BC35D6]) [n:127.0.0.1:60087__xqv ] o.a.s.c.c.SolrZkClient makePath: /live_nodes/127.0.0.1:60087__xqv
[junit4] 2> 2685587 INFO (zkCallback-3078-thread-1-processing-n:127.0.0.1:60087__xqv) [n:127.0.0.1:60087__xqv ] o.a.s.c.c.ZkStateReader A live node change: [WatchedEvent state:SyncConnected type:NodeChildrenChanged path:/live_nodes], has occurred - updating... (live nodes size: [1])
[junit4] 2> 2685588 INFO (zkCallback-3072-thread-1) [ ] o.a.s.c.c.ZkStateReader A live node change: [WatchedEvent state:SyncConnected type:NodeChildrenChanged path:/live_nodes], has occurred - updating... (live nodes size: [1])
[junit4] 2> 2685591 INFO (zkCallback-3070-thread-1-processing-n:127.0.0.1:60081__xqv) [n:127.0.0.1:60081__xqv ] o.a.s.c.c.ZkStateReader A live node change: [WatchedEvent state:SyncConnected type:NodeChildrenChanged path:/live_nodes], has occurred - updating... (live nodes size: [1])
[junit4] 2> 2685592 INFO (TEST-TestRandomRequestDistribution.test-seed#[89098B5E74BC35D6]) [n:127.0.0.1:60087__xqv ] o.a.s.c.Overseer Overseer (id=null) closing
[junit4] 2> 2685593 INFO (TEST-TestRandomRequestDistribution.test-seed#[89098B5E74BC35D6]) [n:127.0.0.1:60087__xqv ] o.a.s.c.LeaderElector Joined leadership election with path: /overseer_elect/election/95355118233583625-127.0.0.1:60087__xqv-n_0000000001
[junit4] 2> 2685594 INFO (TEST-TestRandomRequestDistribution.test-seed#[89098B5E74BC35D6]) [n:127.0.0.1:60087__xqv ] o.a.s.c.LeaderElector Watching path /overseer_elect/election/95355118233583620-127.0.0.1:60081__xqv-n_0000000000 to know if I could be the leader
[junit4] 2> 2685601 INFO (TEST-TestRandomRequestDistribution.test-seed#[89098B5E74BC35D6]) [n:127.0.0.1:60087__xqv ] o.a.s.c.CoreContainer Security conf doesn't exist. Skipping setup for authorization module.
[junit4] 2> 2685601 INFO (TEST-TestRandomRequestDistribution.test-seed#[89098B5E74BC35D6]) [n:127.0.0.1:60087__xqv ] o.a.s.c.CoreContainer No authentication plugin used.
[junit4] 2> 2685603 INFO (TEST-TestRandomRequestDistribution.test-seed#[89098B5E74BC35D6]) [n:127.0.0.1:60087__xqv ] o.a.s.c.CorePropertiesLocator Looking for core definitions underneath /Users/jenkins/workspace/Lucene-Solr-trunk-MacOSX/solr/build/solr-core/test/J0/temp/solr.cloud.TestRandomRequestDistribution_89098B5E74BC35D6-001/shard-1-001/cores
[junit4] 2> 2685604 INFO (TEST-TestRandomRequestDistribution.test-seed#[89098B5E74BC35D6]) [n:127.0.0.1:60087__xqv ] o.a.s.c.CoreDescriptor Created CoreDescriptor: {name=collection1, config=solrconfig.xml, transient=false, schema=schema.xml, loadOnStartup=true, configSetProperties=configsetprops.json, collection=collection1, coreNodeName=, dataDir=data/, shard=}
[junit4] 2> 2685604 INFO (TEST-TestRandomRequestDistribution.test-seed#[89098B5E74BC35D6]) [n:127.0.0.1:60087__xqv ] o.a.s.c.CorePropertiesLocator Found core collection1 in /Users/jenkins/workspace/Lucene-Solr-trunk-MacOSX/solr/build/solr-core/test/J0/temp/solr.cloud.TestRandomRequestDistribution_89098B5E74BC35D6-001/shard-1-001/cores/collection1
[junit4] 2> 2685604 INFO (TEST-TestRandomRequestDistribution.test-seed#[89098B5E74BC35D6]) [n:127.0.0.1:60087__xqv ] o.a.s.c.CorePropertiesLocator Found 1 core definitions
[junit4] 2> 2685606 INFO (TEST-TestRandomRequestDistribution.test-seed#[89098B5E74BC35D6]) [n:127.0.0.1:60087__xqv ] o.a.s.s.SolrDispatchFilter user.dir=/Users/jenkins/workspace/Lucene-Solr-trunk-MacOSX/solr/build/solr-core/test/J0
[junit4] 2> 2685606 INFO (TEST-TestRandomRequestDistribution.test-seed#[89098B5E74BC35D6]) [n:127.0.0.1:60087__xqv ] o.a.s.s.SolrDispatchFilter SolrDispatchFilter.init() done
[junit4] 2> 2685608 INFO (coreLoadExecutor-8340-thread-1-processing-n:127.0.0.1:60087__xqv) [n:127.0.0.1:60087__xqv c:collection1 x:collection1] o.a.s.c.ZkController publishing state=down
[junit4] 2> 2685608 INFO (coreLoadExecutor-8340-thread-1-processing-n:127.0.0.1:60087__xqv) [n:127.0.0.1:60087__xqv c:collection1 x:collection1] o.a.s.c.ZkController numShards not found on descriptor - reading it from system property
[junit4] 2> 2685610 INFO (coreLoadExecutor-8340-thread-1-processing-n:127.0.0.1:60087__xqv) [n:127.0.0.1:60087__xqv c:collection1 x:collection1] o.a.s.c.ZkController Registering watch for collection collection1
[junit4] 2> 2685610 INFO (coreLoadExecutor-8340-thread-1-processing-n:127.0.0.1:60087__xqv) [n:127.0.0.1:60087__xqv c:collection1 x:collection1] o.a.s.c.c.ZkStateReader addZkWatch [collection1]
[junit4] 2> 2685611 INFO (OverseerStateUpdate-95355118233583620-127.0.0.1:60081__xqv-n_0000000000) [n:127.0.0.1:60081__xqv ] o.a.s.c.Overseer processMessage: queueSize: 1, message = {
[junit4] 2> "core":"collection1",
[junit4] 2> "roles":null,
[junit4] 2> "base_url":"http://127.0.0.1:60087/_xqv",
[junit4] 2> "node_name":"127.0.0.1:60087__xqv",
[junit4] 2> "numShards":"2",
[junit4] 2> "state":"down",
[junit4] 2> "shard":null,
[junit4] 2> "collection":"collection1",
[junit4] 2> "operation":"state"} current state version: 3
[junit4] 2> 2685611 INFO (coreLoadExecutor-8340-thread-1-processing-n:127.0.0.1:60087__xqv) [n:127.0.0.1:60087__xqv c:collection1 x:collection1] o.a.s.c.c.ZkStateReader Add data for [collection1] ver [0]
[junit4] 2> 2685611 INFO (coreLoadExecutor-8340-thread-1-processing-n:127.0.0.1:60087__xqv) [n:127.0.0.1:60087__xqv c:collection1 x:collection1] o.a.s.c.ZkController look for our core node name
[junit4] 2> 2685612 INFO (OverseerStateUpdate-95355118233583620-127.0.0.1:60081__xqv-n_0000000000) [n:127.0.0.1:60081__xqv ] o.a.s.c.o.ReplicaMutator Update state numShards=2 message={
[junit4] 2> "core":"collection1",
[junit4] 2> "roles":null,
[junit4] 2> "base_url":"http://127.0.0.1:60087/_xqv",
[junit4] 2> "node_name":"127.0.0.1:60087__xqv",
[junit4] 2> "numShards":"2",
[junit4] 2> "state":"down",
[junit4] 2> "shard":null,
[junit4] 2> "collection":"collection1",
[junit4] 2> "operation":"state"}
[junit4] 2> 2685612 INFO (OverseerStateUpdate-95355118233583620-127.0.0.1:60081__xqv-n_0000000000) [n:127.0.0.1:60081__xqv ] o.a.s.c.o.ReplicaMutator Collection already exists with numShards=2
[junit4] 2> 2685612 INFO (OverseerStateUpdate-95355118233583620-127.0.0.1:60081__xqv-n_0000000000) [n:127.0.0.1:60081__xqv ] o.a.s.c.o.ReplicaMutator Assigning new node to shard shard=shard2
[junit4] 2> 2685719 INFO (OverseerStateUpdate-95355118233583620-127.0.0.1:60081__xqv-n_0000000000) [n:127.0.0.1:60081__xqv ] o.a.s.c.o.ZkStateWriter going to update_collection /collections/collection1/state.json version: 0
[junit4] 2> 2685723 INFO (zkCallback-3078-thread-1-processing-n:127.0.0.1:60087__xqv) [n:127.0.0.1:60087__xqv ] o.a.s.c.c.ZkStateReader A cluster state change: [WatchedEvent state:SyncConnected type:NodeDataChanged path:/collections/collection1/state.json] for collection [collection1] has occurred - updating... (live nodes size: [2])
[junit4] 2> 2685724 INFO (zkCallback-3078-thread-1-processing-n:127.0.0.1:60087__xqv) [n:127.0.0.1:60087__xqv ] o.a.s.c.c.ZkStateReader Updating data for [collection1] from [0] to [1]
[junit4] 2> 2686612 INFO (coreLoadExecutor-8340-thread-1-processing-n:127.0.0.1:60087__xqv) [n:127.0.0.1:60087__xqv c:collection1 x:collection1] o.a.s.c.ZkController waiting to find shard id in clusterstate for collection1
[junit4] 2> 2686613 INFO (coreLoadExecutor-8340-thread-1-processing-n:127.0.0.1:60087__xqv) [n:127.0.0.1:60087__xqv c:collection1 x:collection1] o.a.s.c.ZkController Check for collection zkNode:collection1
[junit4] 2> 2686613 INFO (coreLoadExecutor-8340-thread-1-processing-n:127.0.0.1:60087__xqv) [n:127.0.0.1:60087__xqv c:collection1 x:collection1] o.a.s.c.ZkController Collection zkNode exists
[junit4] 2> 2686613 INFO (coreLoadExecutor-8340-thread-1-processing-n:127.0.0.1:60087__xqv) [n:127.0.0.1:60087__xqv c:collection1 x:collection1] o.a.s.c.c.ZkStateReader Load collection config from: [/collections/collection1]
[junit4] 2> 2686615 INFO (coreLoadExecutor-8340-thread-1-processing-n:127.0.0.1:60087__xqv) [n:127.0.0.1:60087__xqv c:collection1 x:collection1] o.a.s.c.c.ZkStateReader path=[/collections/collection1] [configName]=[conf1] specified config exists in ZooKeeper
[junit4] 2> 2686615 INFO (coreLoadExecutor-8340-thread-1-processing-n:127.0.0.1:60087__xqv) [n:127.0.0.1:60087__xqv c:collection1 x:collection1] o.a.s.c.SolrResourceLoader new SolrResourceLoader for directory: '/Users/jenkins/workspace/Lucene-Solr-trunk-MacOSX/solr/build/solr-core/test/J0/temp/solr.cloud.TestRandomRequestDistribution_89098B5E74BC35D6-001/shard-1-001/cores/collection1'
[junit4] 2> 2686615 INFO (coreLoadExecutor-8340-thread-1-processing-n:127.0.0.1:60087__xqv) [n:127.0.0.1:60087__xqv c:collection1 x:collection1] o.a.s.c.SolrResourceLoader JNDI not configured for solr (NoInitialContextEx)
[junit4] 2> 2686615 INFO (coreLoadExecutor-8340-thread-1-processing-n:127.0.0.1:60087__xqv) [n:127.0.0.1:60087__xqv c:collection1 x:collection1] o.a.s.c.SolrResourceLoader solr home defaulted to 'solr/' (could not find system property or JNDI)
[junit4] 2> 2686618 INFO (coreLoadExecutor-8340-thread-1-processing-n:127.0.0.1:60087__xqv) [n:127.0.0.1:60087__xqv c:collection1 x:collection1] o.a.s.c.Config loaded config solrconfig.xml with version 0
[junit4] 2> 2686624 INFO (coreLoadExecutor-8340-thread-1-processing-n:127.0.0.1:60087__xqv) [n:127.0.0.1:60087__xqv c:collection1 x:collection1] o.a.s.c.SolrConfig current version of requestparams : -1
[junit4] 2> 2686627 INFO (coreLoadExecutor-8340-thread-1-processing-n:127.0.0.1:60087__xqv) [n:127.0.0.1:60087__xqv c:collection1 x:collection1] o.a.s.c.SolrConfig Using Lucene MatchVersion: 6.0.0
[junit4] 2> 2686635 INFO (coreLoadExecutor-8340-thread-1-processing-n:127.0.0.1:60087__xqv) [n:127.0.0.1:60087__xqv c:collection1 x:collection1] o.a.s.c.SolrConfig Loaded SolrConfig: solrconfig.xml
[junit4] 2> 2686640 INFO (coreLoadExecutor-8340-thread-1-processing-n:127.0.0.1:60087__xqv) [n:127.0.0.1:60087__xqv c:collection1 x:collection1] o.a.s.s.IndexSchema [collection1] Schema name=test
[junit4] 2> 2686745 INFO (coreLoadExecutor-8340-thread-1-processing-n:127.0.0.1:60087__xqv) [n:127.0.0.1:60087__xqv c:collection1 x:collection1] o.a.s.s.OpenExchangeRatesOrgProvider Initialized with rates=open-exchange-rates.json, refreshInterval=1440.
[junit4] 2> 2686751 INFO (coreLoadExecutor-8340-thread-1-processing-n:127.0.0.1:60087__xqv) [n:127.0.0.1:60087__xqv c:collection1 x:collection1] o.a.s.s.IndexSchema default search field in schema is text
[junit4] 2> 2686752 INFO (coreLoadExecutor-8340-thread-1-processing-n:127.0.0.1:60087__xqv) [n:127.0.0.1:60087__xqv c:collection1 x:collection1] o.a.s.s.IndexSchema unique key field: id
[junit4] 2> 2686767 INFO (coreLoadExecutor-8340-thread-1-processing-n:127.0.0.1:60087__xqv) [n:127.0.0.1:60087__xqv c:collection1 x:collection1] o.a.s.s.FileExchangeRateProvider Reloading exchange rates from file currency.xml
[junit4] 2> 2686769 INFO (coreLoadExecutor-8340-thread-1-processing-n:127.0.0.1:60087__xqv) [n:127.0.0.1:60087__xqv c:collection1 x:collection1] o.a.s.s.FileExchangeRateProvider Reloading exchange rates from file currency.xml
[junit4] 2> 2686772 INFO (coreLoadExecutor-8340-thread-1-processing-n:127.0.0.1:60087__xqv) [n:127.0.0.1:60087__xqv c:collection1 x:collection1] o.a.s.s.OpenExchangeRatesOrgProvider Reloading exchange rates from open-exchange-rates.json
[junit4] 2> 2686773 INFO (coreLoadExecutor-8340-thread-1-processing-n:127.0.0.1:60087__xqv) [n:127.0.0.1:60087__xqv c:collection1 x:collection1] o.a.s.s.OpenExchangeRatesOrgProvider Reloading exchange rates from open-exchange-rates.json
[junit4] 2> 2686776 INFO (coreLoadExecutor-8340-thread-1-processing-n:127.0.0.1:60087__xqv) [n:127.0.0.1:60087__xqv c:collection1 x:collection1] o.a.s.c.ConfigSetProperties Did not find ConfigSet properties, assuming default properties: Can't find resource 'configsetprops.json' in classpath or '/configs/conf1', cwd=/Users/jenkins/workspace/Lucene-Solr-trunk-MacOSX/solr/build/solr-core/test/J0
[junit4] 2> 2686776 INFO (coreLoadExecutor-8340-thread-1-processing-n:127.0.0.1:60087__xqv) [n:127.0.0.1:60087__xqv c:collection1 x:collection1] o.a.s.c.CoreContainer Creating SolrCore 'collection1' using configuration from collection collection1
[junit4] 2> 2686776 INFO (coreLoadExecutor-8340-thread-1-processing-n:127.0.0.1:60087__xqv) [n:127.0.0.1:60087__xqv c:collection1 s:shard2 r:core_node1 x:collection1] o.a.s.c.SolrCore org.apache.solr.core.MockDirectoryFactory
[junit4] 2> 2686777 INFO (coreLoadExecutor-8340-thread-1-processing-n:127.0.0.1:60087__xqv) [n:127.0.0.1:60087__xqv c:collection1 s:shard2 r:core_node1 x:collection1] o.a.s.c.SolrCore [[collection1] ] Opening new SolrCore at [/Users/jenkins/workspace/Lucene-Solr-trunk-MacOSX/solr/build/solr-core/test/J0/temp/solr.cloud.TestRandomRequestDistribution_89098B5E74BC35D6-001/shard-1-001/cores/collection1], dataDir=[/Users/jenkins/workspace/Lucene-Solr-trunk-MacOSX/solr/build/solr-core/test/J0/temp/solr.cloud.TestRandomRequestDistribution_89098B5E74BC35D6-001/shard-1-001/cores/collection1/data/]
[junit4] 2> 2686777 INFO (coreLoadExecutor-8340-thread-1-processing-n:127.0.0.1:60087__xqv) [n:127.0.0.1:60087__xqv c:collection1 s:shard2 r:core_node1 x:collection1] o.a.s.c.JmxMonitoredMap JMX monitoring is enabled. Adding Solr mbeans to JMX Server: com.sun.jmx.mbeanserver.JmxMBeanServer@e5d1b76
[junit4] 2> 2686777 INFO (coreLoadExecutor-8340-thread-1-processing-n:127.0.0.1:60087__xqv) [n:127.0.0.1:60087__xqv c:collection1 s:shard2 r:core_node1 x:collection1] o.a.s.c.CachingDirectoryFactory return new directory for /Users/jenkins/workspace/Lucene-Solr-trunk-MacOSX/solr/build/solr-core/test/J0/temp/solr.cloud.TestRandomRequestDistribution_89098B5E74BC35D6-001/shard-1-001/cores/collection1/data
[junit4] 2> 2686777 INFO (coreLoadExecutor-8340-thread-1-processing-n:127.0.0.1:60087__xqv) [n:127.0.0.1:60087__xqv c:collection1 s:shard2 r:core_node1 x:collection1] o.a.s.c.SolrCore New index directory detected: old=null new=/Users/jenkins/workspace/Lucene-Solr-trunk-MacOSX/solr/build/solr-
[...truncated too long message...]
5)
[junit4] 2> 2716913 INFO (TEST-TestRandomRequestDistribution.test-seed#[89098B5E74BC35D6]) [ ] o.e.j.s.ServerConnector Stopped ServerConnector@1ddbd218{HTTP/1.1}{127.0.0.1:0}
[junit4] 2> 2716913 INFO (TEST-TestRandomRequestDistribution.test-seed#[89098B5E74BC35D6]) [ ] o.e.j.s.h.ContextHandler Stopped o.e.j.s.ServletContextHandler@1c5fa06a{/_xqv,null,UNAVAILABLE}
[junit4] 2> 2716915 INFO (TEST-TestRandomRequestDistribution.test-seed#[89098B5E74BC35D6]) [ ] o.a.s.c.ZkTestServer connecting to 127.0.0.1:60078 60078
[junit4] 2> 2716930 INFO (Thread-6378) [ ] o.a.s.c.ZkTestServer connecting to 127.0.0.1:60078 60078
[junit4] 2> 2718273 WARN (Thread-6378) [ ] o.a.s.c.ZkTestServer Watch limit violations:
[junit4] 2> Maximum concurrent create/delete watches above limit:
[junit4] 2>
[junit4] 2> 5 /solr/aliases.json
[junit4] 2> 4 /solr/security.json
[junit4] 2> 4 /solr/configs/conf1
[junit4] 2>
[junit4] 2> Maximum concurrent data watches above limit:
[junit4] 2>
[junit4] 2> 5 /solr/clusterstate.json
[junit4] 2> 3 /solr/collections/collection1/state.json
[junit4] 2> 2 /solr/collections/a1x2/state.json
[junit4] 2>
[junit4] 2> Maximum concurrent children watches above limit:
[junit4] 2>
[junit4] 2> 5 /solr/live_nodes
[junit4] 2> 5 /solr/collections
[junit4] 2> 2 /solr/overseer/queue
[junit4] 2>
[junit4] 2> NOTE: reproduce with: ant test -Dtestcase=TestRandomRequestDistribution -Dtests.method=test -Dtests.seed=89098B5E74BC35D6 -Dtests.slow=true -Dtests.locale=ca -Dtests.timezone=MST -Dtests.asserts=true -Dtests.file.encoding=UTF-8
[junit4] FAILURE 36.1s J0 | TestRandomRequestDistribution.test <<<
[junit4] > Throwable #1: java.lang.AssertionError: Shard a1x2_shard1_replica1 received all 10 requests
[junit4] > at __randomizedtesting.SeedInfo.seed([89098B5E74BC35D6:15DB484DA40582E]:0)
[junit4] > at org.apache.solr.cloud.TestRandomRequestDistribution.testRequestTracking(TestRandomRequestDistribution.java:121)
[junit4] > at org.apache.solr.cloud.TestRandomRequestDistribution.test(TestRandomRequestDistribution.java:65)
[junit4] > at org.apache.solr.BaseDistributedSearchTestCase$ShardsRepeatRule$ShardsFixedStatement.callStatement(BaseDistributedSearchTestCase.java:964)
[junit4] > at org.apache.solr.BaseDistributedSearchTestCase$ShardsRepeatRule$ShardsStatement.evaluate(BaseDistributedSearchTestCase.java:939)
[junit4] > at java.lang.Thread.run(Thread.java:745)
[junit4] 2> 2718279 INFO (SUITE-TestRandomRequestDistribution-seed#[89098B5E74BC35D6]-worker) [ ] o.a.s.SolrTestCaseJ4 ###deleteCore
[junit4] 2> NOTE: leaving temporary files on disk at: /Users/jenkins/workspace/Lucene-Solr-trunk-MacOSX/solr/build/solr-core/test/J0/temp/solr.cloud.TestRandomRequestDistribution_89098B5E74BC35D6-001
[junit4] 2> NOTE: test params are: codec=Asserting(Lucene60), sim=ClassicSimilarity, locale=ca, timezone=MST
[junit4] 2> NOTE: Mac OS X 10.8.5 x86_64/Oracle Corporation 1.8.0_72 (64-bit)/cpus=3,threads=1,free=155792760,total=518979584
[junit4] 2> NOTE: All tests run in this JVM: [TestInitQParser, UUIDFieldTest, SampleTest, MBeansHandlerTest, TestBlobHandler, TestDistributedSearch, JsonLoaderTest, SystemInfoHandlerTest, TestInitParams, HLLUtilTest, DistributedFacetPivotLargeTest, TestRandomCollapseQParserPlugin, DOMUtilTest, PreAnalyzedUpdateProcessorTest, UnloadDistributedZkTest, TestDFISimilarityFactory, QueryEqualityTest, RuleEngineTest, TestFaceting, TestReRankQParserPlugin, TestDownShardTolerantSearch, TestRemoveLastDynamicCopyField, JSONWriterTest, RequiredFieldsTest, HdfsChaosMonkeyNothingIsSafeTest, PolyFieldTest, DistributedSpellCheckComponentTest, TestManagedResource, SolrRequestParserTest, TestReplicationHandlerBackup, TestMissingGroups, TestCloudInspectUtil, SolrTestCaseJ4Test, SuggesterFSTTest, HdfsRecoverLeaseTest, TestDocSet, TestManagedSchema, StandardRequestHandlerTest, TestCodecSupport, TestManagedSynonymFilterFactory, TestWordDelimiterFilterFactory, TestStressLucene, TestRemoteStreaming, TestManagedSchemaFieldResource, TestSolr4Spatial2, TestReplicationHandler, TermsComponentTest, TestCursorMarkWithoutUniqueKey, CloneFieldUpdateProcessorFactoryTest, TestCollectionAPI, DocValuesTest, TestImplicitCoreProperties, SharedFSAutoReplicaFailoverTest, ActionThrottleTest, XmlUpdateRequestHandlerTest, TriLevelCompositeIdRoutingTest, TestFieldTypeResource, PeerSyncTest, TestIBSimilarityFactory, TestGroupingSearch, TestUpdate, TestAddFieldRealTimeGet, TestSurroundQueryParser, TestMinMaxOnMultiValuedField, TestPostingsSolrHighlighter, HdfsThreadLeakTest, TestFileDictionaryLookup, CircularListTest, TestRequestStatusCollectionAPI, IndexSchemaTest, CloudExitableDirectoryReaderTest, TestChildDocTransformer, HttpPartitionTest, QueryElevationComponentTest, TestHighFrequencyDictionaryFactory, ZkCLITest, BigEndianAscendingWordDeserializerTest, SliceStateTest, MoreLikeThisHandlerTest, TestCollapseQParserPlugin, TestXIncludeConfig, QueryResultKeyTest, CachingDirectoryFactoryTest, FacetPivotSmallTest, ClusterStateTest, HighlighterTest, TestAnalyzeInfixSuggestions, TestSolrQueryParserDefaultOperatorResource, OverseerTest, TestCustomSort, CdcrUpdateLogTest, DisMaxRequestHandlerTest, TestFilteredDocIdSet, HdfsBasicDistributedZk2Test, TestSort, SpatialFilterTest, ChaosMonkeyNothingIsSafeTest, TestSchemaResource, TestCloudManagedSchema, TestDynamicFieldResource, TestHighlightDedupGrouping, SimpleFacetsTest, ExitableDirectoryReaderTest, PathHierarchyTokenizerFactoryTest, UUIDUpdateProcessorFallbackTest, BasicAuthIntegrationTest, DocumentAnalysisRequestHandlerTest, AsyncMigrateRouteKeyTest, AddSchemaFieldsUpdateProcessorFactoryTest, TestDocumentBuilder, DistributedQueryComponentOptimizationTest, TestAuthorizationFramework, IndexBasedSpellCheckerTest, DistribJoinFromCollectionTest, TestUseDocValuesAsStored, RankQueryTest, TestJmxIntegration, TestExactStatsCache, TestExtendedDismaxParser, CursorPagingTest, PrimUtilsTest, SimplePostToolTest, OverseerCollectionConfigSetProcessorTest, TestRuleBasedAuthorizationPlugin, TestSolrConfigHandler, TestMergePolicyConfig, TestSolrDeletionPolicy1, TestOverriddenPrefixQueryForCustomFieldType, TestSolrConfigHandlerCloud, TestReloadAndDeleteDocs, CustomCollectionTest, TestPivotHelperCode, StressHdfsTest, TestFieldResource, TestSchemaVersionResource, FullHLLTest, SecurityConfHandlerTest, MigrateRouteKeyTest, TestConfig, TestAnalyzedSuggestions, TestReloadDeadlock, BasicDistributedZkTest, SyncSliceTest, OpenCloseCoreStressTest, ShardRoutingTest, BasicZkTest, RecoveryZkTest, ClusterStateUpdateTest, LeaderElectionTest, TestZkChroot, TestRandomDVFaceting, ShardRoutingCustomTest, TestRecovery, ZkControllerTest, TestRealTimeGet, TestStressReorder, HardAutoCommitTest, StatsComponentTest, DirectUpdateHandlerTest, TestBadConfig, ShowFileRequestHandlerTest, DistributedQueryElevationComponentTest, SolrIndexSplitterTest, AnalysisAfterCoreReloadTest, SignatureUpdateProcessorFactoryTest, SuggesterTSTTest, TestCSVLoader, TestPseudoReturnFields, FieldMutatingUpdateProcessorTest, StatelessScriptUpdateProcessorFactoryTest, DebugComponentTest, PrimitiveFieldTypeTest, RequestHandlersTest, DocumentBuilderTest, TermVectorComponentTest, TestArbitraryIndexDir, IndexSchemaRuntimeFieldTest, TestCollationField, UpdateRequestProcessorFactoryTest, QueryParsingTest, UniqFieldsUpdateProcessorFactoryTest, TestPHPSerializedResponseWriter, CSVRequestHandlerTest, TestComponentsName, SearchHandlerTest, TestBinaryResponseWriter, TestLFUCache, EchoParamsTest, TestSweetSpotSimilarityFactory, TestPerFieldSimilarity, TestJmxMonitoredMap, OpenExchangeRatesOrgProviderTest, TestFastLRUCache, PreAnalyzedFieldTest, RAMDirectoryFactoryTest, TestUtils, TestRTGBase, DistributedIntervalFacetingTest, TestEmbeddedSolrServerConstructors, AssignTest, BaseCdcrDistributedZkTest, CdcrReplicationDistributedZkTest, CdcrReplicationHandlerTest, CdcrRequestHandlerTest, CdcrVersionReplicationTest, CollectionStateFormat2Test, ConcurrentDeleteAndCreateCollectionTest, ConfigSetsAPITest, DeleteLastCustomShardedReplicaTest, DeleteShardTest, DistribCursorPagingTest, LeaderFailoverAfterPartitionTest, LeaderInitiatedRecoveryOnShardRestartTest, MultiThreadedOCPTest, OverseerStatusTest, RecoveryAfterSoftCommitTest, SSLMigrationTest, SaslZkACLProviderTest, SharedFSAutoReplicaFailoverUtilsTest, SimpleCollectionCreateDeleteTest, SolrXmlInZkTest, TestAuthenticationFramework, TestLeaderInitiatedRecoveryThread, TestRandomRequestDistribution]
[junit4] Completed [463/579 (1!)] on J0 in 36.13s, 1 test, 1 failure <<< FAILURES!
[...truncated 378 lines...]
BUILD FAILED
/Users/jenkins/workspace/Lucene-Solr-trunk-MacOSX/build.xml:740: The following error occurred while executing this line:
/Users/jenkins/workspace/Lucene-Solr-trunk-MacOSX/build.xml:684: The following error occurred while executing this line:
/Users/jenkins/workspace/Lucene-Solr-trunk-MacOSX/build.xml:59: The following error occurred while executing this line:
/Users/jenkins/workspace/Lucene-Solr-trunk-MacOSX/solr/build.xml:233: The following error occurred while executing this line:
/Users/jenkins/workspace/Lucene-Solr-trunk-MacOSX/solr/common-build.xml:524: The following error occurred while executing this line:
/Users/jenkins/workspace/Lucene-Solr-trunk-MacOSX/lucene/common-build.xml:1457: The following error occurred while executing this line:
/Users/jenkins/workspace/Lucene-Solr-trunk-MacOSX/lucene/common-build.xml:1014: There were test failures: 579 suites (8 ignored), 2323 tests, 1 failure, 121 ignored (71 assumptions) [seed: 89098B5E74BC35D6]
Total time: 72 minutes 8 seconds
Build step 'Invoke Ant' marked build as failure
Archiving artifacts
[WARNINGS] Skipping publisher since build result is FAILURE
Recording test results
Email was triggered for: Failure - Any
Sending email for trigger: Failure - Any