You are viewing a plain text version of this content. The canonical link for it is here.
Posted to builds@lucene.apache.org by Policeman Jenkins Server <je...@thetaphi.de> on 2025/01/17 04:32:10 UTC

[JENKINS-EA] Lucene-main-Linux (64bit/hotspot/jdk-24-ea+16) - Build # 52447 - Unstable!

Build: https://jenkins.thetaphi.de/job/Lucene-main-Linux/52447/
Java: 64bit/hotspot/jdk-24-ea+16 -XX:+UseCompressedOops -XX:+UseSerialGC

1 tests failed.
FAILED:  org.apache.lucene.search.TestLatLonPointQueries.testLowCardinality

Error Message:
java.lang.IllegalArgumentException: cost must be >= 0, got -468

Stack Trace:
java.lang.IllegalArgumentException: cost must be >= 0, got -468
	at __randomizedtesting.SeedInfo.seed([D5CF5E9D4A7CE588:9E54C21BFCFFD5FA]:0)
	at org.apache.lucene.util.BitSetIterator.<init>(BitSetIterator.java:61)
	at org.apache.lucene.document.LatLonPointDistanceQuery$1$1.get(LatLonPointDistanceQuery.java:157)
	at org.apache.lucene.search.ScorerSupplier.bulkScorer(ScorerSupplier.java:45)
	at org.apache.lucene.tests.search.AssertingWeight$1.bulkScorer(AssertingWeight.java:90)
	at org.apache.lucene.tests.search.AssertingWeight$1.bulkScorer(AssertingWeight.java:90)
	at org.apache.lucene.search.IndexSearcher.searchLeaf(IndexSearcher.java:843)
	at org.apache.lucene.search.IndexSearcher.search(IndexSearcher.java:810)
	at org.apache.lucene.tests.search.AssertingIndexSearcher.search(AssertingIndexSearcher.java:77)
	at org.apache.lucene.search.IndexSearcher.lambda$search$0(IndexSearcher.java:780)
	at java.base/java.util.concurrent.FutureTask.run(FutureTask.java:326)
	at org.apache.lucene.search.TaskExecutor$Task.run(TaskExecutor.java:173)
	at org.apache.lucene.search.TaskExecutor.invokeAll(TaskExecutor.java:111)
	at org.apache.lucene.search.IndexSearcher.search(IndexSearcher.java:784)
	at org.apache.lucene.search.IndexSearcher.search(IndexSearcher.java:751)
	at org.apache.lucene.tests.geo.BaseGeoPointTestCase.searchIndex(BaseGeoPointTestCase.java:1293)
	at org.apache.lucene.tests.geo.BaseGeoPointTestCase.verifyRandomDistances(BaseGeoPointTestCase.java:1046)
	at org.apache.lucene.tests.geo.BaseGeoPointTestCase.verify(BaseGeoPointTestCase.java:897)
	at org.apache.lucene.tests.geo.BaseGeoPointTestCase.testLowCardinality(BaseGeoPointTestCase.java:522)
	at java.base/jdk.internal.reflect.DirectMethodHandleAccessor.invoke(DirectMethodHandleAccessor.java:103)
	at java.base/java.lang.reflect.Method.invoke(Method.java:573)
	at com.carrotsearch.randomizedtesting.RandomizedRunner.invoke(RandomizedRunner.java:1758)
	at com.carrotsearch.randomizedtesting.RandomizedRunner$8.evaluate(RandomizedRunner.java:946)
	at com.carrotsearch.randomizedtesting.RandomizedRunner$9.evaluate(RandomizedRunner.java:982)
	at com.carrotsearch.randomizedtesting.RandomizedRunner$10.evaluate(RandomizedRunner.java:996)
	at org.apache.lucene.tests.util.TestRuleSetupTeardownChained$1.evaluate(TestRuleSetupTeardownChained.java:48)
	at org.apache.lucene.tests.util.AbstractBeforeAfterRule$1.evaluate(AbstractBeforeAfterRule.java:43)
	at org.apache.lucene.tests.util.TestRuleThreadAndTestName$1.evaluate(TestRuleThreadAndTestName.java:45)
	at org.apache.lucene.tests.util.TestRuleIgnoreAfterMaxFailures$1.evaluate(TestRuleIgnoreAfterMaxFailures.java:60)
	at org.apache.lucene.tests.util.TestRuleMarkFailure$1.evaluate(TestRuleMarkFailure.java:44)
	at org.junit.rules.RunRules.evaluate(RunRules.java:20)
	at com.carrotsearch.randomizedtesting.rules.StatementAdapter.evaluate(StatementAdapter.java:36)
	at com.carrotsearch.randomizedtesting.ThreadLeakControl$StatementRunner.run(ThreadLeakControl.java:390)
	at com.carrotsearch.randomizedtesting.ThreadLeakControl.forkTimeoutingTask(ThreadLeakControl.java:843)
	at com.carrotsearch.randomizedtesting.ThreadLeakControl$3.evaluate(ThreadLeakControl.java:490)
	at com.carrotsearch.randomizedtesting.RandomizedRunner.runSingleTest(RandomizedRunner.java:955)
	at com.carrotsearch.randomizedtesting.RandomizedRunner$5.evaluate(RandomizedRunner.java:840)
	at com.carrotsearch.randomizedtesting.RandomizedRunner$6.evaluate(RandomizedRunner.java:891)
	at com.carrotsearch.randomizedtesting.RandomizedRunner$7.evaluate(RandomizedRunner.java:902)
	at org.apache.lucene.tests.util.AbstractBeforeAfterRule$1.evaluate(AbstractBeforeAfterRule.java:43)
	at com.carrotsearch.randomizedtesting.rules.StatementAdapter.evaluate(StatementAdapter.java:36)
	at org.apache.lucene.tests.util.TestRuleStoreClassName$1.evaluate(TestRuleStoreClassName.java:38)
	at com.carrotsearch.randomizedtesting.rules.NoShadowingOrOverridesOnMethodsRule$1.evaluate(NoShadowingOrOverridesOnMethodsRule.java:40)
	at com.carrotsearch.randomizedtesting.rules.NoShadowingOrOverridesOnMethodsRule$1.evaluate(NoShadowingOrOverridesOnMethodsRule.java:40)
	at com.carrotsearch.randomizedtesting.rules.StatementAdapter.evaluate(StatementAdapter.java:36)
	at com.carrotsearch.randomizedtesting.rules.StatementAdapter.evaluate(StatementAdapter.java:36)
	at org.apache.lucene.tests.util.TestRuleAssertionsRequired$1.evaluate(TestRuleAssertionsRequired.java:53)
	at org.apache.lucene.tests.util.AbstractBeforeAfterRule$1.evaluate(AbstractBeforeAfterRule.java:43)
	at org.apache.lucene.tests.util.TestRuleMarkFailure$1.evaluate(TestRuleMarkFailure.java:44)
	at org.apache.lucene.tests.util.TestRuleIgnoreAfterMaxFailures$1.evaluate(TestRuleIgnoreAfterMaxFailures.java:60)
	at org.apache.lucene.tests.util.TestRuleIgnoreTestSuites$1.evaluate(TestRuleIgnoreTestSuites.java:47)
	at org.junit.rules.RunRules.evaluate(RunRules.java:20)
	at com.carrotsearch.randomizedtesting.rules.StatementAdapter.evaluate(StatementAdapter.java:36)
	at com.carrotsearch.randomizedtesting.ThreadLeakControl$StatementRunner.run(ThreadLeakControl.java:390)
	at com.carrotsearch.randomizedtesting.ThreadLeakControl.lambda$forkTimeoutingTask$0(ThreadLeakControl.java:850)
	at java.base/java.lang.Thread.run(Thread.java:1576)