You are viewing a plain text version of this content. The canonical link for it is here.
Posted to builds@beam.apache.org by Apache Jenkins Server <je...@builds.apache.org> on 2022/04/17 09:03:16 UTC
Build failed in Jenkins: beam_LoadTests_Go_CoGBK_Dataflow_batch #482
See <https://ci-beam.apache.org/job/beam_LoadTests_Go_CoGBK_Dataflow_batch/482/display/redirect>
Changes:
------------------------------------------
[...truncated 25.05 KB...]
value: <
urn: "beam:env:docker:v1"
payload: "\n\035apache/beam_go_sdk:2.39.0.dev"
capabilities: "beam:protocol:progress_reporting:v0"
capabilities: "beam:protocol:multi_core_bundle_processing:v1"
capabilities: "beam:version:sdk_base:go"
capabilities: "beam:coder:bytes:v1"
capabilities: "beam:coder:bool:v1"
capabilities: "beam:coder:varint:v1"
capabilities: "beam:coder:double:v1"
capabilities: "beam:coder:string_utf8:v1"
capabilities: "beam:coder:length_prefix:v1"
capabilities: "beam:coder:kv:v1"
capabilities: "beam:coder:iterable:v1"
capabilities: "beam:coder:state_backed_iterable:v1"
capabilities: "beam:coder:windowed_value:v1"
capabilities: "beam:coder:global_window:v1"
capabilities: "beam:coder:interval_window:v1"
capabilities: "beam:coder:row:v1"
capabilities: "beam:coder:nullable:v1"
dependencies: <
type_urn: "beam:artifact:type:url:v1"
type_payload: "\nJgs://temp-storage-for-perf-tests/loadtests/go-1-1650185983024472555/****\022@8c94fb9e96cd1d6d0661868c9be38f3125ce31b7ebba4b014ea647cd1176ddc5"
role_urn: "beam:artifact:role:go_****_binary:v1"
>
>
>
>
root_transform_ids: "s2"
root_transform_ids: "e8"
root_transform_ids: "s1"
root_transform_ids: "e4"
root_transform_ids: "e9_cogbk"
root_transform_ids: "e10"
root_transform_ids: "e11"
requirements: "beam:requirement:pardo:splittable_dofn:v1"
2022/04/17 08:59:43 Staged model pipeline: gs://temp-storage-for-perf-tests/loadtests/go-1-1650185983024472555/model
2022/04/17 08:59:43 {
"environment": {
"experiments": [
"use_unified_****",
"use_portable_job_submission",
"beam_fn_api"
],
"sdkPipelineOptions": {
"display_data": [
{
"key": "name",
"namespace": "options",
"type": "STRING",
"value": "load-tests-go-dataflow-batch-cogbk-1-0417065631"
},
{
"key": "experiments",
"namespace": "options",
"type": "STRING",
"value": "use_unified_****,use_portable_job_submission"
},
{
"key": "project",
"namespace": "options",
"type": "STRING",
"value": "apache-beam-testing"
},
{
"key": "region",
"namespace": "options",
"type": "STRING",
"value": "us-central1"
},
{
"key": "container_images",
"namespace": "options",
"type": "STRING",
"value": "apache/beam_go_sdk:2.39.0.dev"
},
{
"key": "temp_location",
"namespace": "options",
"type": "STRING",
"value": "gs://temp-storage-for-perf-tests/loadtests"
},
{
"key": "influx_measurement",
"namespace": "go_options",
"type": "STRING",
"value": "go_batch_cogbk_1"
},
{
"key": "input_options",
"namespace": "go_options",
"type": "STRING",
"value": "{\"num_records\": 20000000,\"key_size\": 10,\"value_size\": 90,\"num_hot_keys\": 1,\"hot_key_fraction\": 1}"
},
{
"key": "influx_namespace",
"namespace": "go_options",
"type": "STRING",
"value": "dataflow"
},
{
"key": "****_binary",
"namespace": "go_options",
"type": "STRING",
"value": "linux_amd64/cogbk"
},
{
"key": "hooks",
"namespace": "go_options",
"type": "STRING",
"value": "{\"default_remote_logging\":null}"
},
{
"key": "co_input_options",
"namespace": "go_options",
"type": "STRING",
"value": "{\"num_records\": 2000000,\"key_size\": 10,\"value_size\": 90,\"num_hot_keys\": 1000,\"hot_key_fraction\": 1}"
},
{
"key": "influx_db_name",
"namespace": "go_options",
"type": "STRING",
"value": "beam_test_metrics"
},
{
"key": "influx_hostname",
"namespace": "go_options",
"type": "STRING",
"value": "http://10.128.0.96:8086"
},
{
"key": "iterations",
"namespace": "go_options",
"type": "STRING",
"value": "1"
},
{
"key": "hookOrder",
"namespace": "go_options",
"type": "STRING",
"value": "[\"default_remote_logging\"]"
}
],
"options": {
"experiments": [
"use_unified_****",
"use_portable_job_submission",
"beam_fn_api"
],
"pipelineUrl": "gs://temp-storage-for-perf-tests/loadtests/go-1-1650185983024472555/model",
"region": "us-central1",
"tempLocation": "gs://temp-storage-for-perf-tests/loadtests"
},
"beam:option:go_options:v1": {
"options": {
"co_input_options": "{\"num_records\": 2000000,\"key_size\": 10,\"value_size\": 90,\"num_hot_keys\": 1000,\"hot_key_fraction\": 1}",
"hookOrder": "[\"default_remote_logging\"]",
"hooks": "{\"default_remote_logging\":null}",
"influx_db_name": "beam_test_metrics",
"influx_hostname": "http://10.128.0.96:8086",
"influx_measurement": "go_batch_cogbk_1",
"influx_namespace": "dataflow",
"input_options": "{\"num_records\": 20000000,\"key_size\": 10,\"value_size\": 90,\"num_hot_keys\": 1,\"hot_key_fraction\": 1}",
"iterations": "1",
"****_binary": "linux_amd64/cogbk"
}
}
},
"tempStoragePrefix": "gs://temp-storage-for-perf-tests/loadtests",
"userAgent": {
"name": "Apache Beam SDK for Go",
"version": "2.39.0.dev"
},
"version": {
"job_type": "FNAPI_BATCH",
"major": "6"
},
"****Pools": [
{
"autoscalingSettings": {
"algorithm": "AUTOSCALING_ALGORITHM_NONE"
},
"ipConfiguration": "WORKER_IP_UNSPECIFIED",
"kind": "harness",
"numWorkers": 5,
"packages": [
{
"location": "gs://temp-storage-for-perf-tests/loadtests/go-1-1650185983024472555/****",
"name": "****"
}
],
"sdkHarnessContainerImages": [
{
"containerImage": "apache/beam_go_sdk:2.39.0.dev"
}
],
"****HarnessContainerImage": "apache/beam_go_sdk:2.39.0.dev"
}
]
},
"name": "load-tests-go-dataflow-batch-cogbk-1-0417065631",
"projectId": "apache-beam-testing",
"type": "JOB_TYPE_BATCH"
}
2022/04/17 08:59:44 Submitted job: 2022-04-17_01_59_43-2718758616642052438
2022/04/17 08:59:44 Console: https://console.cloud.google.com/dataflow/jobs/us-central1/2022-04-17_01_59_43-2718758616642052438?project=apache-beam-testing
2022/04/17 08:59:44 Logs: https://console.cloud.google.com/logs/viewer?project=apache-beam-testing&resource=dataflow_step%2Fjob_id%2F2022-04-17_01_59_43-2718758616642052438
2022/04/17 08:59:44 Job state: JOB_STATE_PENDING ...
2022/04/17 09:00:14 Job still running ...
2022/04/17 09:00:44 Job still running ...
2022/04/17 09:01:14 Job still running ...
2022/04/17 09:01:44 Job still running ...
2022/04/17 09:02:14 Job still running ...
2022/04/17 09:02:44 Job still running ...
2022/04/17 09:03:14 Failed to execute job: job 2022-04-17_01_59_43-2718758616642052438 failed
panic: Failed to execute job: job 2022-04-17_01_59_43-2718758616642052438 failed
goroutine 1 [running]:
github.com/apache/beam/sdks/v2/go/pkg/beam/log.Fatalf(0x1203108, 0xc0000480c0, 0x10e1911, 0x19, 0xc000855df0, 0x1, 0x1)
<https://ci-beam.apache.org/job/beam_LoadTests_Go_CoGBK_Dataflow_batch/ws/src/sdks/go/pkg/beam/log/log.go>:153 +0xec
main.main()
<https://ci-beam.apache.org/job/beam_LoadTests_Go_CoGBK_Dataflow_batch/ws/src/sdks/go/test/load/cogbk/cogbk.go>:99 +0x52a
> Task :sdks:go:test:load:run FAILED
FAILURE: Build failed with an exception.
* Where:
Build file '<https://ci-beam.apache.org/job/beam_LoadTests_Go_CoGBK_Dataflow_batch/ws/src/sdks/go/test/load/build.gradle'> line: 31
* What went wrong:
Execution failed for task ':sdks:go:test:load:run'.
> Process 'command 'sh'' finished with non-zero exit value 2
* Try:
> Run with --stacktrace option to get the stack trace.
> Run with --info or --debug option to get more log output.
> Run with --scan to get full insights.
* Get more help at https://help.gradle.org
BUILD FAILED in 3m 47s
12 actionable tasks: 6 executed, 4 from cache, 2 up-to-date
Publishing build scan...
https://gradle.com/s/bcxejmamay3fa
Build step 'Invoke Gradle script' changed build result to FAILURE
Build step 'Invoke Gradle script' marked build as failure
---------------------------------------------------------------------
To unsubscribe, e-mail: builds-unsubscribe@beam.apache.org
For additional commands, e-mail: builds-help@beam.apache.org
Jenkins build is back to normal : beam_LoadTests_Go_CoGBK_Dataflow_batch #502
Posted by Apache Jenkins Server <je...@builds.apache.org>.
See <https://ci-beam.apache.org/job/beam_LoadTests_Go_CoGBK_Dataflow_batch/502/display/redirect>
---------------------------------------------------------------------
To unsubscribe, e-mail: builds-unsubscribe@beam.apache.org
For additional commands, e-mail: builds-help@beam.apache.org
Build failed in Jenkins: beam_LoadTests_Go_CoGBK_Dataflow_batch #501
Posted by Apache Jenkins Server <je...@builds.apache.org>.
See <https://ci-beam.apache.org/job/beam_LoadTests_Go_CoGBK_Dataflow_batch/501/display/redirect?page=changes>
Changes:
[zyichi] Move master readme.md to 2.40.0
[noreply] [BEAM-14173] Fix Go Loadtests on Dataflow & partial fix for Flink
------------------------------------------
[...truncated 25.54 KB...]
capabilities: "beam:protocol:progress_reporting:v0"
capabilities: "beam:protocol:multi_core_bundle_processing:v1"
capabilities: "beam:version:sdk_base:go"
capabilities: "beam:coder:bytes:v1"
capabilities: "beam:coder:bool:v1"
capabilities: "beam:coder:varint:v1"
capabilities: "beam:coder:double:v1"
capabilities: "beam:coder:string_utf8:v1"
capabilities: "beam:coder:length_prefix:v1"
capabilities: "beam:coder:kv:v1"
capabilities: "beam:coder:iterable:v1"
capabilities: "beam:coder:state_backed_iterable:v1"
capabilities: "beam:coder:windowed_value:v1"
capabilities: "beam:coder:global_window:v1"
capabilities: "beam:coder:interval_window:v1"
capabilities: "beam:coder:row:v1"
capabilities: "beam:coder:nullable:v1"
dependencies: <
type_urn: "beam:artifact:type:url:v1"
type_payload: "\nJgs://temp-storage-for-perf-tests/loadtests/go-1-1651770483920939626/****\022@8b4fc97c79be3e1b632e6395d5832375e5a0d77438b346d72de8de175e2ead2b"
role_urn: "beam:artifact:role:go_****_binary:v1"
>
>
>
>
root_transform_ids: "s1"
root_transform_ids: "e4"
root_transform_ids: "s2"
root_transform_ids: "e8"
root_transform_ids: "e9_cogbk"
root_transform_ids: "e10"
root_transform_ids: "e11"
requirements: "beam:requirement:pardo:splittable_dofn:v1"
2022/05/05 17:08:05 Staged model pipeline: gs://temp-storage-for-perf-tests/loadtests/go-1-1651770483920939626/model
2022/05/05 17:08:05 {
"environment": {
"experiments": [
"use_unified_****",
"use_portable_job_submission",
"beam_fn_api"
],
"sdkPipelineOptions": {
"display_data": [
{
"key": "name",
"namespace": "options",
"type": "STRING",
"value": "load-tests-go-dataflow-batch-cogbk-1-0505150518"
},
{
"key": "experiments",
"namespace": "options",
"type": "STRING",
"value": "use_unified_****,use_portable_job_submission"
},
{
"key": "project",
"namespace": "options",
"type": "STRING",
"value": "apache-beam-testing"
},
{
"key": "region",
"namespace": "options",
"type": "STRING",
"value": "us-central1"
},
{
"key": "container_images",
"namespace": "options",
"type": "STRING",
"value": "apache/beam_go_sdk:2.40.0.dev"
},
{
"key": "temp_location",
"namespace": "options",
"type": "STRING",
"value": "gs://temp-storage-for-perf-tests/loadtests"
},
{
"key": "hookOrder",
"namespace": "go_options",
"type": "STRING",
"value": "[\"default_remote_logging\"]"
},
{
"key": "iterations",
"namespace": "go_options",
"type": "STRING",
"value": "1"
},
{
"key": "hooks",
"namespace": "go_options",
"type": "STRING",
"value": "{\"default_remote_logging\":null}"
},
{
"key": "co_input_options",
"namespace": "go_options",
"type": "STRING",
"value": "{\"num_records\": 2000000,\"key_size\": 10,\"value_size\": 90,\"num_hot_keys\": 1000,\"hot_key_fraction\": 1}"
},
{
"key": "influx_db_name",
"namespace": "go_options",
"type": "STRING",
"value": "beam_test_metrics"
},
{
"key": "influx_hostname",
"namespace": "go_options",
"type": "STRING",
"value": "http://10.128.0.96:8086"
},
{
"key": "input_options",
"namespace": "go_options",
"type": "STRING",
"value": "{\"num_records\": 20000000,\"key_size\": 10,\"value_size\": 90,\"num_hot_keys\": 1,\"hot_key_fraction\": 1}"
},
{
"key": "****_binary",
"namespace": "go_options",
"type": "STRING",
"value": "linux_amd64/cogbk"
},
{
"key": "influx_namespace",
"namespace": "go_options",
"type": "STRING",
"value": "dataflow"
},
{
"key": "influx_measurement",
"namespace": "go_options",
"type": "STRING",
"value": "go_batch_cogbk_1"
}
],
"options": {
"experiments": [
"use_unified_****",
"use_portable_job_submission",
"beam_fn_api"
],
"pipelineUrl": "gs://temp-storage-for-perf-tests/loadtests/go-1-1651770483920939626/model",
"region": "us-central1",
"tempLocation": "gs://temp-storage-for-perf-tests/loadtests"
},
"beam:option:go_options:v1": {
"options": {
"co_input_options": "{\"num_records\": 2000000,\"key_size\": 10,\"value_size\": 90,\"num_hot_keys\": 1000,\"hot_key_fraction\": 1}",
"hookOrder": "[\"default_remote_logging\"]",
"hooks": "{\"default_remote_logging\":null}",
"influx_db_name": "beam_test_metrics",
"influx_hostname": "http://10.128.0.96:8086",
"influx_measurement": "go_batch_cogbk_1",
"influx_namespace": "dataflow",
"input_options": "{\"num_records\": 20000000,\"key_size\": 10,\"value_size\": 90,\"num_hot_keys\": 1,\"hot_key_fraction\": 1}",
"iterations": "1",
"****_binary": "linux_amd64/cogbk"
}
}
},
"tempStoragePrefix": "gs://temp-storage-for-perf-tests/loadtests",
"userAgent": {
"name": "Apache Beam SDK for Go",
"version": "2.40.0.dev"
},
"version": {
"job_type": "FNAPI_BATCH",
"major": "6"
},
"****Pools": [
{
"autoscalingSettings": {
"algorithm": "AUTOSCALING_ALGORITHM_NONE"
},
"ipConfiguration": "WORKER_IP_UNSPECIFIED",
"kind": "harness",
"numWorkers": 5,
"packages": [
{
"location": "gs://temp-storage-for-perf-tests/loadtests/go-1-1651770483920939626/****",
"name": "****"
}
],
"sdkHarnessContainerImages": [
{
"containerImage": "apache/beam_go_sdk:2.40.0.dev"
}
],
"****HarnessContainerImage": "apache/beam_go_sdk:2.40.0.dev"
}
]
},
"name": "load-tests-go-dataflow-batch-cogbk-1-0505150518",
"projectId": "apache-beam-testing",
"type": "JOB_TYPE_BATCH"
}
2022/05/05 17:08:05 Submitted job: 2022-05-05_10_08_05-219944056484027230
2022/05/05 17:08:05 Console: https://console.cloud.google.com/dataflow/jobs/us-central1/2022-05-05_10_08_05-219944056484027230?project=apache-beam-testing
2022/05/05 17:08:05 Logs: https://console.cloud.google.com/logs/viewer?project=apache-beam-testing&resource=dataflow_step%2Fjob_id%2F2022-05-05_10_08_05-219944056484027230
2022/05/05 17:08:05 Job state: JOB_STATE_PENDING ...
2022/05/05 17:08:35 Job still running ...
2022/05/05 17:09:05 Job still running ...
2022/05/05 17:09:36 Job still running ...
2022/05/05 17:10:06 Job still running ...
2022/05/05 17:10:36 Job still running ...
2022/05/05 17:11:06 Job still running ...
2022/05/05 17:11:36 Job still running ...
2022/05/05 17:12:06 Job still running ...
2022/05/05 17:12:36 Job still running ...
2022/05/05 17:13:06 Failed to execute job: job 2022-05-05_10_08_05-219944056484027230 failed
panic: Failed to execute job: job 2022-05-05_10_08_05-219944056484027230 failed
goroutine 1 [running]:
github.com/apache/beam/sdks/v2/go/pkg/beam/log.Fatalf(0x1231cc8, 0xc0000480c0, 0x110e910, 0x19, 0xc0007dbe68, 0x1, 0x1)
<https://ci-beam.apache.org/job/beam_LoadTests_Go_CoGBK_Dataflow_batch/ws/src/sdks/go/pkg/beam/log/log.go>:153 +0xec
main.main()
<https://ci-beam.apache.org/job/beam_LoadTests_Go_CoGBK_Dataflow_batch/ws/src/sdks/go/test/load/cogbk/cogbk.go>:99 +0x52a
> Task :sdks:go:test:load:run FAILED
FAILURE: Build failed with an exception.
* Where:
Build file '<https://ci-beam.apache.org/job/beam_LoadTests_Go_CoGBK_Dataflow_batch/ws/src/sdks/go/test/load/build.gradle'> line: 31
* What went wrong:
Execution failed for task ':sdks:go:test:load:run'.
> Process 'command 'sh'' finished with non-zero exit value 2
* Try:
> Run with --stacktrace option to get the stack trace.
> Run with --info or --debug option to get more log output.
> Run with --scan to get full insights.
* Get more help at https://help.gradle.org
BUILD FAILED in 7m 13s
12 actionable tasks: 6 executed, 4 from cache, 2 up-to-date
Publishing build scan...
https://gradle.com/s/5bdmxtskf5mvm
Build step 'Invoke Gradle script' changed build result to FAILURE
Build step 'Invoke Gradle script' marked build as failure
---------------------------------------------------------------------
To unsubscribe, e-mail: builds-unsubscribe@beam.apache.org
For additional commands, e-mail: builds-help@beam.apache.org
Build failed in Jenkins: beam_LoadTests_Go_CoGBK_Dataflow_batch #500
Posted by Apache Jenkins Server <je...@builds.apache.org>.
See <https://ci-beam.apache.org/job/beam_LoadTests_Go_CoGBK_Dataflow_batch/500/display/redirect?page=changes>
Changes:
[Heejong Lee] [BEAM-9245] Unable to pull datatore Entity which contains dict
[bulat.safiullin] [BEAM-14382] [Website] add banner container for with css, images, html
[Jan Lukavský] [BEAM-14196] add test verifying output watermark propagation in bundle
[Jan Lukavský] [BEAM-14196] Fix FlinkRunner mid-bundle output watermark handling
[nielm] [BEAM-14405] Fix NPE when ProjectID is not specified in a template
[bulat.safiullin] [BEAM-14382] change mobile banner img, add padding to banner section
[ahmedabualsaud] fix test decotrator typo
[noreply] Merge pull request #17440 from [BEAM-14329] Enable exponential backoff
[noreply] [BEAM-11104] Fix output forwarding issue for ProcessContinuations
[noreply] re-add testing package to pydoc (#17524)
[Heejong Lee] add test
[noreply] [BEAM-14250] Amended the workaround (#17531)
[noreply] [BEAM-11104] Fix broken split result validation (#17546)
[noreply] Fixed a SQL and screenshots in the Beam SQL blog (#17545)
[noreply] Merge pull request #17417: [BEAM-14388] Address some performance
[noreply] [BEAM-14386] [Flink] Support for scala 2.12 (#17512)
[noreply] [BEAM-14294] Worker changes to support trivial Batched DoFns (#17384)
[zyichi] Moving to 2.40.0-SNAPSHOT on master branch.
[noreply] [BEAM-14048] [CdapIO] Add ConfigWrapper for building CDAP PluginConfigs
------------------------------------------
[...truncated 25.37 KB...]
capabilities: "beam:protocol:progress_reporting:v0"
capabilities: "beam:protocol:multi_core_bundle_processing:v1"
capabilities: "beam:version:sdk_base:go"
capabilities: "beam:coder:bytes:v1"
capabilities: "beam:coder:bool:v1"
capabilities: "beam:coder:varint:v1"
capabilities: "beam:coder:double:v1"
capabilities: "beam:coder:string_utf8:v1"
capabilities: "beam:coder:length_prefix:v1"
capabilities: "beam:coder:kv:v1"
capabilities: "beam:coder:iterable:v1"
capabilities: "beam:coder:state_backed_iterable:v1"
capabilities: "beam:coder:windowed_value:v1"
capabilities: "beam:coder:global_window:v1"
capabilities: "beam:coder:interval_window:v1"
capabilities: "beam:coder:row:v1"
capabilities: "beam:coder:nullable:v1"
dependencies: <
type_urn: "beam:artifact:type:url:v1"
type_payload: "\nJgs://temp-storage-for-perf-tests/loadtests/go-1-1651741190190624315/****\022@12f43621d6fa22fb224a2e9ed726972f071a9d5d5f7d1076335e3c38f2aef599"
role_urn: "beam:artifact:role:go_****_binary:v1"
>
>
>
>
root_transform_ids: "s2"
root_transform_ids: "s1"
root_transform_ids: "e8"
root_transform_ids: "e4"
root_transform_ids: "e9_cogbk"
root_transform_ids: "e10"
root_transform_ids: "e11"
requirements: "beam:requirement:pardo:splittable_dofn:v1"
2022/05/05 08:59:50 Staged model pipeline: gs://temp-storage-for-perf-tests/loadtests/go-1-1651741190190624315/model
2022/05/05 08:59:50 {
"environment": {
"experiments": [
"use_unified_****",
"use_portable_job_submission",
"beam_fn_api"
],
"sdkPipelineOptions": {
"display_data": [
{
"key": "name",
"namespace": "options",
"type": "STRING",
"value": "load-tests-go-dataflow-batch-cogbk-1-0505065639"
},
{
"key": "experiments",
"namespace": "options",
"type": "STRING",
"value": "use_unified_****,use_portable_job_submission"
},
{
"key": "project",
"namespace": "options",
"type": "STRING",
"value": "apache-beam-testing"
},
{
"key": "region",
"namespace": "options",
"type": "STRING",
"value": "us-central1"
},
{
"key": "container_images",
"namespace": "options",
"type": "STRING",
"value": "apache/beam_go_sdk:2.40.0.dev"
},
{
"key": "temp_location",
"namespace": "options",
"type": "STRING",
"value": "gs://temp-storage-for-perf-tests/loadtests"
},
{
"key": "hooks",
"namespace": "go_options",
"type": "STRING",
"value": "{\"default_remote_logging\":null}"
},
{
"key": "influx_hostname",
"namespace": "go_options",
"type": "STRING",
"value": "http://10.128.0.96:8086"
},
{
"key": "input_options",
"namespace": "go_options",
"type": "STRING",
"value": "{\"num_records\": 20000000,\"key_size\": 10,\"value_size\": 90,\"num_hot_keys\": 1,\"hot_key_fraction\": 1}"
},
{
"key": "iterations",
"namespace": "go_options",
"type": "STRING",
"value": "1"
},
{
"key": "hookOrder",
"namespace": "go_options",
"type": "STRING",
"value": "[\"default_remote_logging\"]"
},
{
"key": "influx_measurement",
"namespace": "go_options",
"type": "STRING",
"value": "go_batch_cogbk_1"
},
{
"key": "****_binary",
"namespace": "go_options",
"type": "STRING",
"value": "linux_amd64/cogbk"
},
{
"key": "influx_db_name",
"namespace": "go_options",
"type": "STRING",
"value": "beam_test_metrics"
},
{
"key": "influx_namespace",
"namespace": "go_options",
"type": "STRING",
"value": "dataflow"
},
{
"key": "co_input_options",
"namespace": "go_options",
"type": "STRING",
"value": "{\"num_records\": 2000000,\"key_size\": 10,\"value_size\": 90,\"num_hot_keys\": 1000,\"hot_key_fraction\": 1}"
}
],
"options": {
"experiments": [
"use_unified_****",
"use_portable_job_submission",
"beam_fn_api"
],
"pipelineUrl": "gs://temp-storage-for-perf-tests/loadtests/go-1-1651741190190624315/model",
"region": "us-central1",
"tempLocation": "gs://temp-storage-for-perf-tests/loadtests"
},
"beam:option:go_options:v1": {
"options": {
"co_input_options": "{\"num_records\": 2000000,\"key_size\": 10,\"value_size\": 90,\"num_hot_keys\": 1000,\"hot_key_fraction\": 1}",
"hookOrder": "[\"default_remote_logging\"]",
"hooks": "{\"default_remote_logging\":null}",
"influx_db_name": "beam_test_metrics",
"influx_hostname": "http://10.128.0.96:8086",
"influx_measurement": "go_batch_cogbk_1",
"influx_namespace": "dataflow",
"input_options": "{\"num_records\": 20000000,\"key_size\": 10,\"value_size\": 90,\"num_hot_keys\": 1,\"hot_key_fraction\": 1}",
"iterations": "1",
"****_binary": "linux_amd64/cogbk"
}
}
},
"tempStoragePrefix": "gs://temp-storage-for-perf-tests/loadtests",
"userAgent": {
"name": "Apache Beam SDK for Go",
"version": "2.40.0.dev"
},
"version": {
"job_type": "FNAPI_BATCH",
"major": "6"
},
"****Pools": [
{
"autoscalingSettings": {
"algorithm": "AUTOSCALING_ALGORITHM_NONE"
},
"ipConfiguration": "WORKER_IP_UNSPECIFIED",
"kind": "harness",
"numWorkers": 5,
"packages": [
{
"location": "gs://temp-storage-for-perf-tests/loadtests/go-1-1651741190190624315/****",
"name": "****"
}
],
"sdkHarnessContainerImages": [
{
"containerImage": "apache/beam_go_sdk:2.40.0.dev"
}
],
"****HarnessContainerImage": "apache/beam_go_sdk:2.40.0.dev"
}
]
},
"name": "load-tests-go-dataflow-batch-cogbk-1-0505065639",
"projectId": "apache-beam-testing",
"type": "JOB_TYPE_BATCH"
}
2022/05/05 08:59:51 Submitted job: 2022-05-05_01_59_50-6104742215596577622
2022/05/05 08:59:51 Console: https://console.cloud.google.com/dataflow/jobs/us-central1/2022-05-05_01_59_50-6104742215596577622?project=apache-beam-testing
2022/05/05 08:59:51 Logs: https://console.cloud.google.com/logs/viewer?project=apache-beam-testing&resource=dataflow_step%2Fjob_id%2F2022-05-05_01_59_50-6104742215596577622
2022/05/05 08:59:51 Job state: JOB_STATE_PENDING ...
2022/05/05 09:00:21 Job still running ...
2022/05/05 09:00:51 Job still running ...
2022/05/05 09:01:21 Job still running ...
2022/05/05 09:01:51 Job still running ...
2022/05/05 09:02:21 Job still running ...
2022/05/05 09:02:51 Job still running ...
2022/05/05 09:03:21 Job still running ...
2022/05/05 09:03:51 Job still running ...
2022/05/05 09:04:22 Job still running ...
2022/05/05 09:04:52 Failed to execute job: job 2022-05-05_01_59_50-6104742215596577622 failed
panic: Failed to execute job: job 2022-05-05_01_59_50-6104742215596577622 failed
goroutine 1 [running]:
github.com/apache/beam/sdks/v2/go/pkg/beam/log.Fatalf(0x1231c68, 0xc0000480c0, 0x110e8b0, 0x19, 0xc000427e68, 0x1, 0x1)
<https://ci-beam.apache.org/job/beam_LoadTests_Go_CoGBK_Dataflow_batch/ws/src/sdks/go/pkg/beam/log/log.go>:153 +0xec
main.main()
<https://ci-beam.apache.org/job/beam_LoadTests_Go_CoGBK_Dataflow_batch/ws/src/sdks/go/test/load/cogbk/cogbk.go>:99 +0x52a
> Task :sdks:go:test:load:run FAILED
FAILURE: Build failed with an exception.
* Where:
Build file '<https://ci-beam.apache.org/job/beam_LoadTests_Go_CoGBK_Dataflow_batch/ws/src/sdks/go/test/load/build.gradle'> line: 31
* What went wrong:
Execution failed for task ':sdks:go:test:load:run'.
> Process 'command 'sh'' finished with non-zero exit value 2
* Try:
> Run with --stacktrace option to get the stack trace.
> Run with --info or --debug option to get more log output.
> Run with --scan to get full insights.
* Get more help at https://help.gradle.org
BUILD FAILED in 5m 24s
12 actionable tasks: 6 executed, 4 from cache, 2 up-to-date
Publishing build scan...
https://gradle.com/s/af5lorkpttzfg
Build step 'Invoke Gradle script' changed build result to FAILURE
Build step 'Invoke Gradle script' marked build as failure
---------------------------------------------------------------------
To unsubscribe, e-mail: builds-unsubscribe@beam.apache.org
For additional commands, e-mail: builds-help@beam.apache.org
Build failed in Jenkins: beam_LoadTests_Go_CoGBK_Dataflow_batch #499
Posted by Apache Jenkins Server <je...@builds.apache.org>.
See <https://ci-beam.apache.org/job/beam_LoadTests_Go_CoGBK_Dataflow_batch/499/display/redirect?page=changes>
Changes:
[noreply] fix: JDBC config schema fields order
[Brian Hulette] Revert "Merge pull request #17255 from kileys/test-revert"
[Brian Hulette] BEAM-14231: bypass schema cache for
[noreply] [BEAM-13657] Follow up update version warning in __init__ (#17493)
[noreply] Merge pull request #17431 from [BEAM-14273] Add integration tests for BQ
[noreply] Merge pull request #17205 from [BEAM-14145] [Website] add carousel to
[noreply] [BEAM-14064] fix es io windowing (#17112)
[noreply] [BEAM-13670] Upgraded ipython from v7 to v8 (#17529)
[noreply] [BEAM-11104] Enable ProcessContinuation return values, add unit test
[Robert Bradshaw] [BEAM-14403] Allow Prime to be used with legacy workers.
[noreply] [BEAM-11106] Support drain in Go SDK (#17432)
[noreply] add __Init__ to inference. (#17514)
------------------------------------------
[...truncated 25.36 KB...]
capabilities: "beam:protocol:multi_core_bundle_processing:v1"
capabilities: "beam:version:sdk_base:go"
capabilities: "beam:coder:bytes:v1"
capabilities: "beam:coder:bool:v1"
capabilities: "beam:coder:varint:v1"
capabilities: "beam:coder:double:v1"
capabilities: "beam:coder:string_utf8:v1"
capabilities: "beam:coder:length_prefix:v1"
capabilities: "beam:coder:kv:v1"
capabilities: "beam:coder:iterable:v1"
capabilities: "beam:coder:state_backed_iterable:v1"
capabilities: "beam:coder:windowed_value:v1"
capabilities: "beam:coder:global_window:v1"
capabilities: "beam:coder:interval_window:v1"
capabilities: "beam:coder:row:v1"
capabilities: "beam:coder:nullable:v1"
dependencies: <
type_urn: "beam:artifact:type:url:v1"
type_payload: "\nJgs://temp-storage-for-perf-tests/loadtests/go-1-1651654982677033301/****\022@be83bf2a90738eb6e70a1e09f135cf25fbfc968e0a33e2e4cefcd37425687cf7"
role_urn: "beam:artifact:role:go_****_binary:v1"
>
>
>
>
root_transform_ids: "s1"
root_transform_ids: "s2"
root_transform_ids: "e4"
root_transform_ids: "e8"
root_transform_ids: "e9_cogbk"
root_transform_ids: "e10"
root_transform_ids: "e11"
requirements: "beam:requirement:pardo:splittable_dofn:v1"
2022/05/04 09:03:03 Staged model pipeline: gs://temp-storage-for-perf-tests/loadtests/go-1-1651654982677033301/model
2022/05/04 09:03:03 {
"environment": {
"experiments": [
"use_unified_****",
"use_portable_job_submission",
"beam_fn_api"
],
"sdkPipelineOptions": {
"display_data": [
{
"key": "name",
"namespace": "options",
"type": "STRING",
"value": "load-tests-go-dataflow-batch-cogbk-1-0428111113"
},
{
"key": "experiments",
"namespace": "options",
"type": "STRING",
"value": "use_unified_****,use_portable_job_submission"
},
{
"key": "project",
"namespace": "options",
"type": "STRING",
"value": "apache-beam-testing"
},
{
"key": "region",
"namespace": "options",
"type": "STRING",
"value": "us-central1"
},
{
"key": "container_images",
"namespace": "options",
"type": "STRING",
"value": "apache/beam_go_sdk:2.39.0.dev"
},
{
"key": "temp_location",
"namespace": "options",
"type": "STRING",
"value": "gs://temp-storage-for-perf-tests/loadtests"
},
{
"key": "hookOrder",
"namespace": "go_options",
"type": "STRING",
"value": "[\"default_remote_logging\"]"
},
{
"key": "influx_namespace",
"namespace": "go_options",
"type": "STRING",
"value": "dataflow"
},
{
"key": "co_input_options",
"namespace": "go_options",
"type": "STRING",
"value": "{\"num_records\": 2000000,\"key_size\": 10,\"value_size\": 90,\"num_hot_keys\": 1000,\"hot_key_fraction\": 1}"
},
{
"key": "influx_measurement",
"namespace": "go_options",
"type": "STRING",
"value": "go_batch_cogbk_1"
},
{
"key": "input_options",
"namespace": "go_options",
"type": "STRING",
"value": "{\"num_records\": 20000000,\"key_size\": 10,\"value_size\": 90,\"num_hot_keys\": 1,\"hot_key_fraction\": 1}"
},
{
"key": "****_binary",
"namespace": "go_options",
"type": "STRING",
"value": "linux_amd64/cogbk"
},
{
"key": "hooks",
"namespace": "go_options",
"type": "STRING",
"value": "{\"default_remote_logging\":null}"
},
{
"key": "influx_hostname",
"namespace": "go_options",
"type": "STRING",
"value": "http://10.128.0.96:8086"
},
{
"key": "iterations",
"namespace": "go_options",
"type": "STRING",
"value": "1"
},
{
"key": "influx_db_name",
"namespace": "go_options",
"type": "STRING",
"value": "beam_test_metrics"
}
],
"options": {
"experiments": [
"use_unified_****",
"use_portable_job_submission",
"beam_fn_api"
],
"pipelineUrl": "gs://temp-storage-for-perf-tests/loadtests/go-1-1651654982677033301/model",
"region": "us-central1",
"tempLocation": "gs://temp-storage-for-perf-tests/loadtests"
},
"beam:option:go_options:v1": {
"options": {
"co_input_options": "{\"num_records\": 2000000,\"key_size\": 10,\"value_size\": 90,\"num_hot_keys\": 1000,\"hot_key_fraction\": 1}",
"hookOrder": "[\"default_remote_logging\"]",
"hooks": "{\"default_remote_logging\":null}",
"influx_db_name": "beam_test_metrics",
"influx_hostname": "http://10.128.0.96:8086",
"influx_measurement": "go_batch_cogbk_1",
"influx_namespace": "dataflow",
"input_options": "{\"num_records\": 20000000,\"key_size\": 10,\"value_size\": 90,\"num_hot_keys\": 1,\"hot_key_fraction\": 1}",
"iterations": "1",
"****_binary": "linux_amd64/cogbk"
}
}
},
"tempStoragePrefix": "gs://temp-storage-for-perf-tests/loadtests",
"userAgent": {
"name": "Apache Beam SDK for Go",
"version": "2.39.0.dev"
},
"version": {
"job_type": "FNAPI_BATCH",
"major": "6"
},
"****Pools": [
{
"autoscalingSettings": {
"algorithm": "AUTOSCALING_ALGORITHM_NONE"
},
"ipConfiguration": "WORKER_IP_UNSPECIFIED",
"kind": "harness",
"numWorkers": 5,
"packages": [
{
"location": "gs://temp-storage-for-perf-tests/loadtests/go-1-1651654982677033301/****",
"name": "****"
}
],
"sdkHarnessContainerImages": [
{
"containerImage": "apache/beam_go_sdk:2.39.0.dev"
}
],
"****HarnessContainerImage": "apache/beam_go_sdk:2.39.0.dev"
}
]
},
"name": "load-tests-go-dataflow-batch-cogbk-1-0428111113",
"projectId": "apache-beam-testing",
"type": "JOB_TYPE_BATCH"
}
2022/05/04 09:03:04 Submitted job: 2022-05-04_02_03_03-16177773235875381780
2022/05/04 09:03:04 Console: https://console.cloud.google.com/dataflow/jobs/us-central1/2022-05-04_02_03_03-16177773235875381780?project=apache-beam-testing
2022/05/04 09:03:04 Logs: https://console.cloud.google.com/logs/viewer?project=apache-beam-testing&resource=dataflow_step%2Fjob_id%2F2022-05-04_02_03_03-16177773235875381780
2022/05/04 09:03:04 Job state: JOB_STATE_PENDING ...
2022/05/04 09:03:34 Job still running ...
2022/05/04 09:04:04 Job still running ...
2022/05/04 09:04:34 Job still running ...
2022/05/04 09:05:04 Job still running ...
2022/05/04 09:05:34 Job still running ...
2022/05/04 09:06:04 Job still running ...
2022/05/04 09:06:34 Job still running ...
2022/05/04 09:07:04 Job still running ...
2022/05/04 09:07:34 Job still running ...
2022/05/04 09:08:04 Job still running ...
2022/05/04 09:08:35 Failed to execute job: job 2022-05-04_02_03_03-16177773235875381780 failed
panic: Failed to execute job: job 2022-05-04_02_03_03-16177773235875381780 failed
goroutine 1 [running]:
github.com/apache/beam/sdks/v2/go/pkg/beam/log.Fatalf(0x1231c68, 0xc00019a000, 0x110e8b0, 0x19, 0xc000353e68, 0x1, 0x1)
<https://ci-beam.apache.org/job/beam_LoadTests_Go_CoGBK_Dataflow_batch/ws/src/sdks/go/pkg/beam/log/log.go>:153 +0xec
main.main()
<https://ci-beam.apache.org/job/beam_LoadTests_Go_CoGBK_Dataflow_batch/ws/src/sdks/go/test/load/cogbk/cogbk.go>:99 +0x52a
> Task :sdks:go:test:load:run FAILED
FAILURE: Build failed with an exception.
* Where:
Build file '<https://ci-beam.apache.org/job/beam_LoadTests_Go_CoGBK_Dataflow_batch/ws/src/sdks/go/test/load/build.gradle'> line: 31
* What went wrong:
Execution failed for task ':sdks:go:test:load:run'.
> Process 'command 'sh'' finished with non-zero exit value 2
* Try:
> Run with --stacktrace option to get the stack trace.
> Run with --info or --debug option to get more log output.
> Run with --scan to get full insights.
* Get more help at https://help.gradle.org
BUILD FAILED in 7m 27s
12 actionable tasks: 6 executed, 4 from cache, 2 up-to-date
Publishing build scan...
https://gradle.com/s/dgwhajnlnm7as
Build step 'Invoke Gradle script' changed build result to FAILURE
Build step 'Invoke Gradle script' marked build as failure
---------------------------------------------------------------------
To unsubscribe, e-mail: builds-unsubscribe@beam.apache.org
For additional commands, e-mail: builds-help@beam.apache.org
Build failed in Jenkins: beam_LoadTests_Go_CoGBK_Dataflow_batch #498
Posted by Apache Jenkins Server <je...@builds.apache.org>.
See <https://ci-beam.apache.org/job/beam_LoadTests_Go_CoGBK_Dataflow_batch/498/display/redirect?page=changes>
Changes:
[yathu] [BEAM-14375] Fix Java Wordcount Dataflow postcommit
[Robert Bradshaw] Allow arithmetic between deferred scalars.
[noreply] [BEAM-14390] Set user-agent when pulling licenses to avoid 403s (#17521)
[noreply] [BEAM-8688] Upgrade GCSIO to 2.2.6 (#17486)
[noreply] [BEAM-14253] patch SubscriptionPartitionLoader to work around a dataflow
[noreply] Add website link log to notify user of pre-build workflow. (#17498)
[noreply] [BEAM-11105] Add timestamp observing watermark estimation (#17476)
[noreply] Merge pull request #17487 from Adding user-agent to GCS client in Python
[noreply] [BEAM-10265] Display error message if trying to infer recursive schema
[noreply] [BEAM-12575] Upgraded ipykernel from v5 to v6 (#17526)
[noreply] [BEAM-11105] Add docs + CHANGES.md entry for Go Watermark Estimation
[noreply] Merge pull request #17380 from [BEAM-14314][BEAM-9532] Add last_updated
------------------------------------------
[...truncated 25.30 KB...]
key: "go"
value: <
urn: "beam:env:docker:v1"
payload: "\n\035apache/beam_go_sdk:2.39.0.dev"
capabilities: "beam:protocol:progress_reporting:v0"
capabilities: "beam:protocol:multi_core_bundle_processing:v1"
capabilities: "beam:version:sdk_base:go"
capabilities: "beam:coder:bytes:v1"
capabilities: "beam:coder:bool:v1"
capabilities: "beam:coder:varint:v1"
capabilities: "beam:coder:double:v1"
capabilities: "beam:coder:string_utf8:v1"
capabilities: "beam:coder:length_prefix:v1"
capabilities: "beam:coder:kv:v1"
capabilities: "beam:coder:iterable:v1"
capabilities: "beam:coder:state_backed_iterable:v1"
capabilities: "beam:coder:windowed_value:v1"
capabilities: "beam:coder:global_window:v1"
capabilities: "beam:coder:interval_window:v1"
capabilities: "beam:coder:row:v1"
capabilities: "beam:coder:nullable:v1"
dependencies: <
type_urn: "beam:artifact:type:url:v1"
type_payload: "\nJgs://temp-storage-for-perf-tests/loadtests/go-1-1651568397593071762/****\022@f4796777cccf2da4f8622139c4c681b54a8aa369cc580b1a0dbd6f8a4c75e278"
role_urn: "beam:artifact:role:go_****_binary:v1"
>
>
>
>
root_transform_ids: "s1"
root_transform_ids: "s2"
root_transform_ids: "e8"
root_transform_ids: "e4"
root_transform_ids: "e9_cogbk"
root_transform_ids: "e10"
root_transform_ids: "e11"
requirements: "beam:requirement:pardo:splittable_dofn:v1"
2022/05/03 08:59:58 Staged model pipeline: gs://temp-storage-for-perf-tests/loadtests/go-1-1651568397593071762/model
2022/05/03 08:59:58 {
"environment": {
"experiments": [
"use_unified_****",
"use_portable_job_submission",
"beam_fn_api"
],
"sdkPipelineOptions": {
"display_data": [
{
"key": "name",
"namespace": "options",
"type": "STRING",
"value": "load-tests-go-dataflow-batch-cogbk-1-0428111113"
},
{
"key": "experiments",
"namespace": "options",
"type": "STRING",
"value": "use_unified_****,use_portable_job_submission"
},
{
"key": "project",
"namespace": "options",
"type": "STRING",
"value": "apache-beam-testing"
},
{
"key": "region",
"namespace": "options",
"type": "STRING",
"value": "us-central1"
},
{
"key": "container_images",
"namespace": "options",
"type": "STRING",
"value": "apache/beam_go_sdk:2.39.0.dev"
},
{
"key": "temp_location",
"namespace": "options",
"type": "STRING",
"value": "gs://temp-storage-for-perf-tests/loadtests"
},
{
"key": "influx_namespace",
"namespace": "go_options",
"type": "STRING",
"value": "dataflow"
},
{
"key": "input_options",
"namespace": "go_options",
"type": "STRING",
"value": "{\"num_records\": 20000000,\"key_size\": 10,\"value_size\": 90,\"num_hot_keys\": 1,\"hot_key_fraction\": 1}"
},
{
"key": "****_binary",
"namespace": "go_options",
"type": "STRING",
"value": "linux_amd64/cogbk"
},
{
"key": "hooks",
"namespace": "go_options",
"type": "STRING",
"value": "{\"default_remote_logging\":null}"
},
{
"key": "influx_hostname",
"namespace": "go_options",
"type": "STRING",
"value": "http://10.128.0.96:8086"
},
{
"key": "influx_measurement",
"namespace": "go_options",
"type": "STRING",
"value": "go_batch_cogbk_1"
},
{
"key": "iterations",
"namespace": "go_options",
"type": "STRING",
"value": "1"
},
{
"key": "co_input_options",
"namespace": "go_options",
"type": "STRING",
"value": "{\"num_records\": 2000000,\"key_size\": 10,\"value_size\": 90,\"num_hot_keys\": 1000,\"hot_key_fraction\": 1}"
},
{
"key": "hookOrder",
"namespace": "go_options",
"type": "STRING",
"value": "[\"default_remote_logging\"]"
},
{
"key": "influx_db_name",
"namespace": "go_options",
"type": "STRING",
"value": "beam_test_metrics"
}
],
"options": {
"experiments": [
"use_unified_****",
"use_portable_job_submission",
"beam_fn_api"
],
"pipelineUrl": "gs://temp-storage-for-perf-tests/loadtests/go-1-1651568397593071762/model",
"region": "us-central1",
"tempLocation": "gs://temp-storage-for-perf-tests/loadtests"
},
"beam:option:go_options:v1": {
"options": {
"co_input_options": "{\"num_records\": 2000000,\"key_size\": 10,\"value_size\": 90,\"num_hot_keys\": 1000,\"hot_key_fraction\": 1}",
"hookOrder": "[\"default_remote_logging\"]",
"hooks": "{\"default_remote_logging\":null}",
"influx_db_name": "beam_test_metrics",
"influx_hostname": "http://10.128.0.96:8086",
"influx_measurement": "go_batch_cogbk_1",
"influx_namespace": "dataflow",
"input_options": "{\"num_records\": 20000000,\"key_size\": 10,\"value_size\": 90,\"num_hot_keys\": 1,\"hot_key_fraction\": 1}",
"iterations": "1",
"****_binary": "linux_amd64/cogbk"
}
}
},
"tempStoragePrefix": "gs://temp-storage-for-perf-tests/loadtests",
"userAgent": {
"name": "Apache Beam SDK for Go",
"version": "2.39.0.dev"
},
"version": {
"job_type": "FNAPI_BATCH",
"major": "6"
},
"****Pools": [
{
"autoscalingSettings": {
"algorithm": "AUTOSCALING_ALGORITHM_NONE"
},
"ipConfiguration": "WORKER_IP_UNSPECIFIED",
"kind": "harness",
"numWorkers": 5,
"packages": [
{
"location": "gs://temp-storage-for-perf-tests/loadtests/go-1-1651568397593071762/****",
"name": "****"
}
],
"sdkHarnessContainerImages": [
{
"containerImage": "apache/beam_go_sdk:2.39.0.dev"
}
],
"****HarnessContainerImage": "apache/beam_go_sdk:2.39.0.dev"
}
]
},
"name": "load-tests-go-dataflow-batch-cogbk-1-0428111113",
"projectId": "apache-beam-testing",
"type": "JOB_TYPE_BATCH"
}
2022/05/03 08:59:58 Submitted job: 2022-05-03_01_59_58-15340143660352117157
2022/05/03 08:59:58 Console: https://console.cloud.google.com/dataflow/jobs/us-central1/2022-05-03_01_59_58-15340143660352117157?project=apache-beam-testing
2022/05/03 08:59:58 Logs: https://console.cloud.google.com/logs/viewer?project=apache-beam-testing&resource=dataflow_step%2Fjob_id%2F2022-05-03_01_59_58-15340143660352117157
2022/05/03 08:59:59 Job state: JOB_STATE_PENDING ...
2022/05/03 09:00:29 Job still running ...
2022/05/03 09:00:59 Job still running ...
2022/05/03 09:01:29 Job still running ...
2022/05/03 09:02:00 Job still running ...
2022/05/03 09:02:30 Job still running ...
2022/05/03 09:03:00 Failed to execute job: job 2022-05-03_01_59_58-15340143660352117157 failed
panic: Failed to execute job: job 2022-05-03_01_59_58-15340143660352117157 failed
goroutine 1 [running]:
github.com/apache/beam/sdks/v2/go/pkg/beam/log.Fatalf(0x122e228, 0xc0000480c0, 0x110b39d, 0x19, 0xc00065de68, 0x1, 0x1)
<https://ci-beam.apache.org/job/beam_LoadTests_Go_CoGBK_Dataflow_batch/ws/src/sdks/go/pkg/beam/log/log.go>:153 +0xec
main.main()
<https://ci-beam.apache.org/job/beam_LoadTests_Go_CoGBK_Dataflow_batch/ws/src/sdks/go/test/load/cogbk/cogbk.go>:99 +0x52a
> Task :sdks:go:test:load:run FAILED
FAILURE: Build failed with an exception.
* Where:
Build file '<https://ci-beam.apache.org/job/beam_LoadTests_Go_CoGBK_Dataflow_batch/ws/src/sdks/go/test/load/build.gradle'> line: 31
* What went wrong:
Execution failed for task ':sdks:go:test:load:run'.
> Process 'command 'sh'' finished with non-zero exit value 2
* Try:
> Run with --stacktrace option to get the stack trace.
> Run with --info or --debug option to get more log output.
> Run with --scan to get full insights.
* Get more help at https://help.gradle.org
BUILD FAILED in 3m 25s
12 actionable tasks: 6 executed, 4 from cache, 2 up-to-date
Publishing build scan...
https://gradle.com/s/ldy7sf3zxxk66
Build step 'Invoke Gradle script' changed build result to FAILURE
Build step 'Invoke Gradle script' marked build as failure
---------------------------------------------------------------------
To unsubscribe, e-mail: builds-unsubscribe@beam.apache.org
For additional commands, e-mail: builds-help@beam.apache.org
Build failed in Jenkins: beam_LoadTests_Go_CoGBK_Dataflow_batch #497
Posted by Apache Jenkins Server <je...@builds.apache.org>.
See <https://ci-beam.apache.org/job/beam_LoadTests_Go_CoGBK_Dataflow_batch/497/display/redirect?page=changes>
Changes:
[noreply] [BEAM-11105] Add manual watermark estimation (#17475)
------------------------------------------
[...truncated 25.33 KB...]
capabilities: "beam:protocol:progress_reporting:v0"
capabilities: "beam:protocol:multi_core_bundle_processing:v1"
capabilities: "beam:version:sdk_base:go"
capabilities: "beam:coder:bytes:v1"
capabilities: "beam:coder:bool:v1"
capabilities: "beam:coder:varint:v1"
capabilities: "beam:coder:double:v1"
capabilities: "beam:coder:string_utf8:v1"
capabilities: "beam:coder:length_prefix:v1"
capabilities: "beam:coder:kv:v1"
capabilities: "beam:coder:iterable:v1"
capabilities: "beam:coder:state_backed_iterable:v1"
capabilities: "beam:coder:windowed_value:v1"
capabilities: "beam:coder:global_window:v1"
capabilities: "beam:coder:interval_window:v1"
capabilities: "beam:coder:row:v1"
capabilities: "beam:coder:nullable:v1"
dependencies: <
type_urn: "beam:artifact:type:url:v1"
type_payload: "\nJgs://temp-storage-for-perf-tests/loadtests/go-1-1651481999805261866/****\022@beab3533de096dd53b55658b5e9a85522316e4a75c4115c681cca4cd787089f5"
role_urn: "beam:artifact:role:go_****_binary:v1"
>
>
>
>
root_transform_ids: "s2"
root_transform_ids: "e8"
root_transform_ids: "s1"
root_transform_ids: "e4"
root_transform_ids: "e9_cogbk"
root_transform_ids: "e10"
root_transform_ids: "e11"
requirements: "beam:requirement:pardo:splittable_dofn:v1"
2022/05/02 09:00:00 Staged model pipeline: gs://temp-storage-for-perf-tests/loadtests/go-1-1651481999805261866/model
2022/05/02 09:00:00 {
"environment": {
"experiments": [
"use_unified_****",
"use_portable_job_submission",
"beam_fn_api"
],
"sdkPipelineOptions": {
"display_data": [
{
"key": "name",
"namespace": "options",
"type": "STRING",
"value": "load-tests-go-dataflow-batch-cogbk-1-0428111113"
},
{
"key": "experiments",
"namespace": "options",
"type": "STRING",
"value": "use_unified_****,use_portable_job_submission"
},
{
"key": "project",
"namespace": "options",
"type": "STRING",
"value": "apache-beam-testing"
},
{
"key": "region",
"namespace": "options",
"type": "STRING",
"value": "us-central1"
},
{
"key": "container_images",
"namespace": "options",
"type": "STRING",
"value": "apache/beam_go_sdk:2.39.0.dev"
},
{
"key": "temp_location",
"namespace": "options",
"type": "STRING",
"value": "gs://temp-storage-for-perf-tests/loadtests"
},
{
"key": "influx_measurement",
"namespace": "go_options",
"type": "STRING",
"value": "go_batch_cogbk_1"
},
{
"key": "influx_db_name",
"namespace": "go_options",
"type": "STRING",
"value": "beam_test_metrics"
},
{
"key": "input_options",
"namespace": "go_options",
"type": "STRING",
"value": "{\"num_records\": 20000000,\"key_size\": 10,\"value_size\": 90,\"num_hot_keys\": 1,\"hot_key_fraction\": 1}"
},
{
"key": "co_input_options",
"namespace": "go_options",
"type": "STRING",
"value": "{\"num_records\": 2000000,\"key_size\": 10,\"value_size\": 90,\"num_hot_keys\": 1000,\"hot_key_fraction\": 1}"
},
{
"key": "influx_namespace",
"namespace": "go_options",
"type": "STRING",
"value": "dataflow"
},
{
"key": "iterations",
"namespace": "go_options",
"type": "STRING",
"value": "1"
},
{
"key": "****_binary",
"namespace": "go_options",
"type": "STRING",
"value": "linux_amd64/cogbk"
},
{
"key": "hooks",
"namespace": "go_options",
"type": "STRING",
"value": "{\"default_remote_logging\":null}"
},
{
"key": "hookOrder",
"namespace": "go_options",
"type": "STRING",
"value": "[\"default_remote_logging\"]"
},
{
"key": "influx_hostname",
"namespace": "go_options",
"type": "STRING",
"value": "http://10.128.0.96:8086"
}
],
"options": {
"experiments": [
"use_unified_****",
"use_portable_job_submission",
"beam_fn_api"
],
"pipelineUrl": "gs://temp-storage-for-perf-tests/loadtests/go-1-1651481999805261866/model",
"region": "us-central1",
"tempLocation": "gs://temp-storage-for-perf-tests/loadtests"
},
"beam:option:go_options:v1": {
"options": {
"co_input_options": "{\"num_records\": 2000000,\"key_size\": 10,\"value_size\": 90,\"num_hot_keys\": 1000,\"hot_key_fraction\": 1}",
"hookOrder": "[\"default_remote_logging\"]",
"hooks": "{\"default_remote_logging\":null}",
"influx_db_name": "beam_test_metrics",
"influx_hostname": "http://10.128.0.96:8086",
"influx_measurement": "go_batch_cogbk_1",
"influx_namespace": "dataflow",
"input_options": "{\"num_records\": 20000000,\"key_size\": 10,\"value_size\": 90,\"num_hot_keys\": 1,\"hot_key_fraction\": 1}",
"iterations": "1",
"****_binary": "linux_amd64/cogbk"
}
}
},
"tempStoragePrefix": "gs://temp-storage-for-perf-tests/loadtests",
"userAgent": {
"name": "Apache Beam SDK for Go",
"version": "2.39.0.dev"
},
"version": {
"job_type": "FNAPI_BATCH",
"major": "6"
},
"****Pools": [
{
"autoscalingSettings": {
"algorithm": "AUTOSCALING_ALGORITHM_NONE"
},
"ipConfiguration": "WORKER_IP_UNSPECIFIED",
"kind": "harness",
"numWorkers": 5,
"packages": [
{
"location": "gs://temp-storage-for-perf-tests/loadtests/go-1-1651481999805261866/****",
"name": "****"
}
],
"sdkHarnessContainerImages": [
{
"containerImage": "apache/beam_go_sdk:2.39.0.dev"
}
],
"****HarnessContainerImage": "apache/beam_go_sdk:2.39.0.dev"
}
]
},
"name": "load-tests-go-dataflow-batch-cogbk-1-0428111113",
"projectId": "apache-beam-testing",
"type": "JOB_TYPE_BATCH"
}
2022/05/02 09:00:02 Submitted job: 2022-05-02_02_00_00-11018270308611985779
2022/05/02 09:00:02 Console: https://console.cloud.google.com/dataflow/jobs/us-central1/2022-05-02_02_00_00-11018270308611985779?project=apache-beam-testing
2022/05/02 09:00:02 Logs: https://console.cloud.google.com/logs/viewer?project=apache-beam-testing&resource=dataflow_step%2Fjob_id%2F2022-05-02_02_00_00-11018270308611985779
2022/05/02 09:00:02 Job state: JOB_STATE_PENDING ...
2022/05/02 09:00:32 Job still running ...
2022/05/02 09:01:02 Job still running ...
2022/05/02 09:01:32 Job still running ...
2022/05/02 09:02:02 Job still running ...
2022/05/02 09:02:32 Job still running ...
2022/05/02 09:03:02 Job still running ...
2022/05/02 09:03:32 Job still running ...
2022/05/02 09:04:02 Job still running ...
2022/05/02 09:04:32 Job still running ...
2022/05/02 09:05:02 Failed to execute job: job 2022-05-02_02_00_00-11018270308611985779 failed
panic: Failed to execute job: job 2022-05-02_02_00_00-11018270308611985779 failed
goroutine 1 [running]:
github.com/apache/beam/sdks/v2/go/pkg/beam/log.Fatalf(0x120aa88, 0xc000120000, 0x10e803a, 0x19, 0xc0004d7e68, 0x1, 0x1)
<https://ci-beam.apache.org/job/beam_LoadTests_Go_CoGBK_Dataflow_batch/ws/src/sdks/go/pkg/beam/log/log.go>:153 +0xec
main.main()
<https://ci-beam.apache.org/job/beam_LoadTests_Go_CoGBK_Dataflow_batch/ws/src/sdks/go/test/load/cogbk/cogbk.go>:99 +0x52a
> Task :sdks:go:test:load:run FAILED
FAILURE: Build failed with an exception.
* Where:
Build file '<https://ci-beam.apache.org/job/beam_LoadTests_Go_CoGBK_Dataflow_batch/ws/src/sdks/go/test/load/build.gradle'> line: 31
* What went wrong:
Execution failed for task ':sdks:go:test:load:run'.
> Process 'command 'sh'' finished with non-zero exit value 2
* Try:
> Run with --stacktrace option to get the stack trace.
> Run with --info or --debug option to get more log output.
> Run with --scan to get full insights.
* Get more help at https://help.gradle.org
BUILD FAILED in 5m 28s
12 actionable tasks: 6 executed, 4 from cache, 2 up-to-date
Publishing build scan...
https://gradle.com/s/3k2ayczzpaoq6
Build step 'Invoke Gradle script' changed build result to FAILURE
Build step 'Invoke Gradle script' marked build as failure
---------------------------------------------------------------------
To unsubscribe, e-mail: builds-unsubscribe@beam.apache.org
For additional commands, e-mail: builds-help@beam.apache.org
Build failed in Jenkins: beam_LoadTests_Go_CoGBK_Dataflow_batch #496
Posted by Apache Jenkins Server <je...@builds.apache.org>.
See <https://ci-beam.apache.org/job/beam_LoadTests_Go_CoGBK_Dataflow_batch/496/display/redirect?page=changes>
Changes:
[noreply] Revert "Improvement to Seed job configuration to launch against PRs
[ilion.beyst] Minor: fix typo
[noreply] Merge pull request #17422 from [BEAM-14344]: remove tracing from
------------------------------------------
[...truncated 25.40 KB...]
capabilities: "beam:protocol:progress_reporting:v0"
capabilities: "beam:protocol:multi_core_bundle_processing:v1"
capabilities: "beam:version:sdk_base:go"
capabilities: "beam:coder:bytes:v1"
capabilities: "beam:coder:bool:v1"
capabilities: "beam:coder:varint:v1"
capabilities: "beam:coder:double:v1"
capabilities: "beam:coder:string_utf8:v1"
capabilities: "beam:coder:length_prefix:v1"
capabilities: "beam:coder:kv:v1"
capabilities: "beam:coder:iterable:v1"
capabilities: "beam:coder:state_backed_iterable:v1"
capabilities: "beam:coder:windowed_value:v1"
capabilities: "beam:coder:global_window:v1"
capabilities: "beam:coder:interval_window:v1"
capabilities: "beam:coder:row:v1"
capabilities: "beam:coder:nullable:v1"
dependencies: <
type_urn: "beam:artifact:type:url:v1"
type_payload: "\nJgs://temp-storage-for-perf-tests/loadtests/go-1-1651395584037683403/****\022@02167ce37eaf34e7e1107f6999e93b0d14b39169bdb4e9b2712fdcfeb7e25008"
role_urn: "beam:artifact:role:go_****_binary:v1"
>
>
>
>
root_transform_ids: "s1"
root_transform_ids: "e4"
root_transform_ids: "s2"
root_transform_ids: "e8"
root_transform_ids: "e9_cogbk"
root_transform_ids: "e10"
root_transform_ids: "e11"
requirements: "beam:requirement:pardo:splittable_dofn:v1"
2022/05/01 08:59:44 Staged model pipeline: gs://temp-storage-for-perf-tests/loadtests/go-1-1651395584037683403/model
2022/05/01 08:59:44 {
"environment": {
"experiments": [
"use_unified_****",
"use_portable_job_submission",
"beam_fn_api"
],
"sdkPipelineOptions": {
"display_data": [
{
"key": "name",
"namespace": "options",
"type": "STRING",
"value": "load-tests-go-dataflow-batch-cogbk-1-0428111113"
},
{
"key": "experiments",
"namespace": "options",
"type": "STRING",
"value": "use_unified_****,use_portable_job_submission"
},
{
"key": "project",
"namespace": "options",
"type": "STRING",
"value": "apache-beam-testing"
},
{
"key": "region",
"namespace": "options",
"type": "STRING",
"value": "us-central1"
},
{
"key": "container_images",
"namespace": "options",
"type": "STRING",
"value": "apache/beam_go_sdk:2.39.0.dev"
},
{
"key": "temp_location",
"namespace": "options",
"type": "STRING",
"value": "gs://temp-storage-for-perf-tests/loadtests"
},
{
"key": "influx_hostname",
"namespace": "go_options",
"type": "STRING",
"value": "http://10.128.0.96:8086"
},
{
"key": "influx_namespace",
"namespace": "go_options",
"type": "STRING",
"value": "dataflow"
},
{
"key": "hooks",
"namespace": "go_options",
"type": "STRING",
"value": "{\"default_remote_logging\":null}"
},
{
"key": "co_input_options",
"namespace": "go_options",
"type": "STRING",
"value": "{\"num_records\": 2000000,\"key_size\": 10,\"value_size\": 90,\"num_hot_keys\": 1000,\"hot_key_fraction\": 1}"
},
{
"key": "influx_db_name",
"namespace": "go_options",
"type": "STRING",
"value": "beam_test_metrics"
},
{
"key": "****_binary",
"namespace": "go_options",
"type": "STRING",
"value": "linux_amd64/cogbk"
},
{
"key": "influx_measurement",
"namespace": "go_options",
"type": "STRING",
"value": "go_batch_cogbk_1"
},
{
"key": "input_options",
"namespace": "go_options",
"type": "STRING",
"value": "{\"num_records\": 20000000,\"key_size\": 10,\"value_size\": 90,\"num_hot_keys\": 1,\"hot_key_fraction\": 1}"
},
{
"key": "iterations",
"namespace": "go_options",
"type": "STRING",
"value": "1"
},
{
"key": "hookOrder",
"namespace": "go_options",
"type": "STRING",
"value": "[\"default_remote_logging\"]"
}
],
"options": {
"experiments": [
"use_unified_****",
"use_portable_job_submission",
"beam_fn_api"
],
"pipelineUrl": "gs://temp-storage-for-perf-tests/loadtests/go-1-1651395584037683403/model",
"region": "us-central1",
"tempLocation": "gs://temp-storage-for-perf-tests/loadtests"
},
"beam:option:go_options:v1": {
"options": {
"co_input_options": "{\"num_records\": 2000000,\"key_size\": 10,\"value_size\": 90,\"num_hot_keys\": 1000,\"hot_key_fraction\": 1}",
"hookOrder": "[\"default_remote_logging\"]",
"hooks": "{\"default_remote_logging\":null}",
"influx_db_name": "beam_test_metrics",
"influx_hostname": "http://10.128.0.96:8086",
"influx_measurement": "go_batch_cogbk_1",
"influx_namespace": "dataflow",
"input_options": "{\"num_records\": 20000000,\"key_size\": 10,\"value_size\": 90,\"num_hot_keys\": 1,\"hot_key_fraction\": 1}",
"iterations": "1",
"****_binary": "linux_amd64/cogbk"
}
}
},
"tempStoragePrefix": "gs://temp-storage-for-perf-tests/loadtests",
"userAgent": {
"name": "Apache Beam SDK for Go",
"version": "2.39.0.dev"
},
"version": {
"job_type": "FNAPI_BATCH",
"major": "6"
},
"****Pools": [
{
"autoscalingSettings": {
"algorithm": "AUTOSCALING_ALGORITHM_NONE"
},
"ipConfiguration": "WORKER_IP_UNSPECIFIED",
"kind": "harness",
"numWorkers": 5,
"packages": [
{
"location": "gs://temp-storage-for-perf-tests/loadtests/go-1-1651395584037683403/****",
"name": "****"
}
],
"sdkHarnessContainerImages": [
{
"containerImage": "apache/beam_go_sdk:2.39.0.dev"
}
],
"****HarnessContainerImage": "apache/beam_go_sdk:2.39.0.dev"
}
]
},
"name": "load-tests-go-dataflow-batch-cogbk-1-0428111113",
"projectId": "apache-beam-testing",
"type": "JOB_TYPE_BATCH"
}
2022/05/01 08:59:47 Submitted job: 2022-05-01_01_59_44-16983222494204514587
2022/05/01 08:59:47 Console: https://console.cloud.google.com/dataflow/jobs/us-central1/2022-05-01_01_59_44-16983222494204514587?project=apache-beam-testing
2022/05/01 08:59:47 Logs: https://console.cloud.google.com/logs/viewer?project=apache-beam-testing&resource=dataflow_step%2Fjob_id%2F2022-05-01_01_59_44-16983222494204514587
2022/05/01 08:59:47 Job state: JOB_STATE_PENDING ...
2022/05/01 09:00:17 Job still running ...
2022/05/01 09:00:47 Job still running ...
2022/05/01 09:01:17 Job still running ...
2022/05/01 09:01:47 Job still running ...
2022/05/01 09:02:17 Job still running ...
2022/05/01 09:02:47 Job still running ...
2022/05/01 09:03:17 Job still running ...
2022/05/01 09:03:47 Job still running ...
2022/05/01 09:04:17 Job still running ...
2022/05/01 09:04:47 Failed to execute job: job 2022-05-01_01_59_44-16983222494204514587 failed
panic: Failed to execute job: job 2022-05-01_01_59_44-16983222494204514587 failed
goroutine 1 [running]:
github.com/apache/beam/sdks/v2/go/pkg/beam/log.Fatalf(0x1209788, 0xc000120000, 0x10e6f88, 0x19, 0xc0008e1e68, 0x1, 0x1)
<https://ci-beam.apache.org/job/beam_LoadTests_Go_CoGBK_Dataflow_batch/ws/src/sdks/go/pkg/beam/log/log.go>:153 +0xec
main.main()
<https://ci-beam.apache.org/job/beam_LoadTests_Go_CoGBK_Dataflow_batch/ws/src/sdks/go/test/load/cogbk/cogbk.go>:99 +0x52a
> Task :sdks:go:test:load:run FAILED
FAILURE: Build failed with an exception.
* Where:
Build file '<https://ci-beam.apache.org/job/beam_LoadTests_Go_CoGBK_Dataflow_batch/ws/src/sdks/go/test/load/build.gradle'> line: 31
* What went wrong:
Execution failed for task ':sdks:go:test:load:run'.
> Process 'command 'sh'' finished with non-zero exit value 2
* Try:
> Run with --stacktrace option to get the stack trace.
> Run with --info or --debug option to get more log output.
> Run with --scan to get full insights.
* Get more help at https://help.gradle.org
BUILD FAILED in 5m 20s
12 actionable tasks: 6 executed, 4 from cache, 2 up-to-date
Publishing build scan...
https://gradle.com/s/lluq5mh5xn5m4
Build step 'Invoke Gradle script' changed build result to FAILURE
Build step 'Invoke Gradle script' marked build as failure
---------------------------------------------------------------------
To unsubscribe, e-mail: builds-unsubscribe@beam.apache.org
For additional commands, e-mail: builds-help@beam.apache.org
Build failed in Jenkins: beam_LoadTests_Go_CoGBK_Dataflow_batch #495
Posted by Apache Jenkins Server <je...@builds.apache.org>.
See <https://ci-beam.apache.org/job/beam_LoadTests_Go_CoGBK_Dataflow_batch/495/display/redirect?page=changes>
Changes:
[Robert Bradshaw] Add element weighting parameter to BatchElements.
[Robert Bradshaw] Clearer test.
[noreply] Revert "Merge pull request #17260 from [BEAM-13229] [Website] bug side
[noreply] [BEAM-14351] Fix the template and move the announcement to the next
[noreply] [BEAM-14001] Add missing test cases to existing suites in exec package
[noreply] [BEAM-14243] Add staticcheck to Github Actions Precommits (#17479)
[noreply] [BEAM-14368][BEAM-13984]Change model loading from constructor to
[noreply] [BEAM-13983] changed file name from sklearn_loader to sklearn_inference
[noreply] Add SQL in Notebooks blog post (#17481)
[noreply] Merge pull request #17404: [BEAM-13990] support date and timestamp
------------------------------------------
[...truncated 25.40 KB...]
capabilities: "beam:protocol:multi_core_bundle_processing:v1"
capabilities: "beam:version:sdk_base:go"
capabilities: "beam:coder:bytes:v1"
capabilities: "beam:coder:bool:v1"
capabilities: "beam:coder:varint:v1"
capabilities: "beam:coder:double:v1"
capabilities: "beam:coder:string_utf8:v1"
capabilities: "beam:coder:length_prefix:v1"
capabilities: "beam:coder:kv:v1"
capabilities: "beam:coder:iterable:v1"
capabilities: "beam:coder:state_backed_iterable:v1"
capabilities: "beam:coder:windowed_value:v1"
capabilities: "beam:coder:global_window:v1"
capabilities: "beam:coder:interval_window:v1"
capabilities: "beam:coder:row:v1"
capabilities: "beam:coder:nullable:v1"
dependencies: <
type_urn: "beam:artifact:type:url:v1"
type_payload: "\nJgs://temp-storage-for-perf-tests/loadtests/go-1-1651309191940185099/****\022@02167ce37eaf34e7e1107f6999e93b0d14b39169bdb4e9b2712fdcfeb7e25008"
role_urn: "beam:artifact:role:go_****_binary:v1"
>
>
>
>
root_transform_ids: "s1"
root_transform_ids: "s2"
root_transform_ids: "e8"
root_transform_ids: "e4"
root_transform_ids: "e9_cogbk"
root_transform_ids: "e10"
root_transform_ids: "e11"
requirements: "beam:requirement:pardo:splittable_dofn:v1"
2022/04/30 08:59:52 Staged model pipeline: gs://temp-storage-for-perf-tests/loadtests/go-1-1651309191940185099/model
2022/04/30 08:59:52 {
"environment": {
"experiments": [
"use_unified_****",
"use_portable_job_submission",
"beam_fn_api"
],
"sdkPipelineOptions": {
"display_data": [
{
"key": "name",
"namespace": "options",
"type": "STRING",
"value": "load-tests-go-dataflow-batch-cogbk-1-0428111113"
},
{
"key": "experiments",
"namespace": "options",
"type": "STRING",
"value": "use_unified_****,use_portable_job_submission"
},
{
"key": "project",
"namespace": "options",
"type": "STRING",
"value": "apache-beam-testing"
},
{
"key": "region",
"namespace": "options",
"type": "STRING",
"value": "us-central1"
},
{
"key": "container_images",
"namespace": "options",
"type": "STRING",
"value": "apache/beam_go_sdk:2.39.0.dev"
},
{
"key": "temp_location",
"namespace": "options",
"type": "STRING",
"value": "gs://temp-storage-for-perf-tests/loadtests"
},
{
"key": "co_input_options",
"namespace": "go_options",
"type": "STRING",
"value": "{\"num_records\": 2000000,\"key_size\": 10,\"value_size\": 90,\"num_hot_keys\": 1000,\"hot_key_fraction\": 1}"
},
{
"key": "influx_measurement",
"namespace": "go_options",
"type": "STRING",
"value": "go_batch_cogbk_1"
},
{
"key": "iterations",
"namespace": "go_options",
"type": "STRING",
"value": "1"
},
{
"key": "****_binary",
"namespace": "go_options",
"type": "STRING",
"value": "linux_amd64/cogbk"
},
{
"key": "influx_namespace",
"namespace": "go_options",
"type": "STRING",
"value": "dataflow"
},
{
"key": "influx_db_name",
"namespace": "go_options",
"type": "STRING",
"value": "beam_test_metrics"
},
{
"key": "influx_hostname",
"namespace": "go_options",
"type": "STRING",
"value": "http://10.128.0.96:8086"
},
{
"key": "input_options",
"namespace": "go_options",
"type": "STRING",
"value": "{\"num_records\": 20000000,\"key_size\": 10,\"value_size\": 90,\"num_hot_keys\": 1,\"hot_key_fraction\": 1}"
},
{
"key": "hooks",
"namespace": "go_options",
"type": "STRING",
"value": "{\"default_remote_logging\":null}"
},
{
"key": "hookOrder",
"namespace": "go_options",
"type": "STRING",
"value": "[\"default_remote_logging\"]"
}
],
"options": {
"experiments": [
"use_unified_****",
"use_portable_job_submission",
"beam_fn_api"
],
"pipelineUrl": "gs://temp-storage-for-perf-tests/loadtests/go-1-1651309191940185099/model",
"region": "us-central1",
"tempLocation": "gs://temp-storage-for-perf-tests/loadtests"
},
"beam:option:go_options:v1": {
"options": {
"co_input_options": "{\"num_records\": 2000000,\"key_size\": 10,\"value_size\": 90,\"num_hot_keys\": 1000,\"hot_key_fraction\": 1}",
"hookOrder": "[\"default_remote_logging\"]",
"hooks": "{\"default_remote_logging\":null}",
"influx_db_name": "beam_test_metrics",
"influx_hostname": "http://10.128.0.96:8086",
"influx_measurement": "go_batch_cogbk_1",
"influx_namespace": "dataflow",
"input_options": "{\"num_records\": 20000000,\"key_size\": 10,\"value_size\": 90,\"num_hot_keys\": 1,\"hot_key_fraction\": 1}",
"iterations": "1",
"****_binary": "linux_amd64/cogbk"
}
}
},
"tempStoragePrefix": "gs://temp-storage-for-perf-tests/loadtests",
"userAgent": {
"name": "Apache Beam SDK for Go",
"version": "2.39.0.dev"
},
"version": {
"job_type": "FNAPI_BATCH",
"major": "6"
},
"****Pools": [
{
"autoscalingSettings": {
"algorithm": "AUTOSCALING_ALGORITHM_NONE"
},
"ipConfiguration": "WORKER_IP_UNSPECIFIED",
"kind": "harness",
"numWorkers": 5,
"packages": [
{
"location": "gs://temp-storage-for-perf-tests/loadtests/go-1-1651309191940185099/****",
"name": "****"
}
],
"sdkHarnessContainerImages": [
{
"containerImage": "apache/beam_go_sdk:2.39.0.dev"
}
],
"****HarnessContainerImage": "apache/beam_go_sdk:2.39.0.dev"
}
]
},
"name": "load-tests-go-dataflow-batch-cogbk-1-0428111113",
"projectId": "apache-beam-testing",
"type": "JOB_TYPE_BATCH"
}
2022/04/30 08:59:53 Submitted job: 2022-04-30_01_59_52-15330114570241396564
2022/04/30 08:59:53 Console: https://console.cloud.google.com/dataflow/jobs/us-central1/2022-04-30_01_59_52-15330114570241396564?project=apache-beam-testing
2022/04/30 08:59:53 Logs: https://console.cloud.google.com/logs/viewer?project=apache-beam-testing&resource=dataflow_step%2Fjob_id%2F2022-04-30_01_59_52-15330114570241396564
2022/04/30 08:59:53 Job state: JOB_STATE_PENDING ...
2022/04/30 09:00:23 Job still running ...
2022/04/30 09:00:53 Job still running ...
2022/04/30 09:01:23 Job still running ...
2022/04/30 09:01:53 Job still running ...
2022/04/30 09:02:23 Job still running ...
2022/04/30 09:02:53 Job still running ...
2022/04/30 09:03:23 Job still running ...
2022/04/30 09:03:53 Job still running ...
2022/04/30 09:04:23 Job still running ...
2022/04/30 09:04:53 Job still running ...
2022/04/30 09:05:23 Failed to execute job: job 2022-04-30_01_59_52-15330114570241396564 failed
panic: Failed to execute job: job 2022-04-30_01_59_52-15330114570241396564 failed
goroutine 1 [running]:
github.com/apache/beam/sdks/v2/go/pkg/beam/log.Fatalf(0x1209788, 0xc0000480c0, 0x10e6f88, 0x19, 0xc000873e68, 0x1, 0x1)
<https://ci-beam.apache.org/job/beam_LoadTests_Go_CoGBK_Dataflow_batch/ws/src/sdks/go/pkg/beam/log/log.go>:153 +0xec
main.main()
<https://ci-beam.apache.org/job/beam_LoadTests_Go_CoGBK_Dataflow_batch/ws/src/sdks/go/test/load/cogbk/cogbk.go>:99 +0x52a
> Task :sdks:go:test:load:run FAILED
FAILURE: Build failed with an exception.
* Where:
Build file '<https://ci-beam.apache.org/job/beam_LoadTests_Go_CoGBK_Dataflow_batch/ws/src/sdks/go/test/load/build.gradle'> line: 31
* What went wrong:
Execution failed for task ':sdks:go:test:load:run'.
> Process 'command 'sh'' finished with non-zero exit value 2
* Try:
> Run with --stacktrace option to get the stack trace.
> Run with --info or --debug option to get more log output.
> Run with --scan to get full insights.
* Get more help at https://help.gradle.org
BUILD FAILED in 5m 51s
12 actionable tasks: 6 executed, 4 from cache, 2 up-to-date
Publishing build scan...
https://gradle.com/s/debmcguqicvvk
Build step 'Invoke Gradle script' changed build result to FAILURE
Build step 'Invoke Gradle script' marked build as failure
---------------------------------------------------------------------
To unsubscribe, e-mail: builds-unsubscribe@beam.apache.org
For additional commands, e-mail: builds-help@beam.apache.org
Build failed in Jenkins: beam_LoadTests_Go_CoGBK_Dataflow_batch #494
Posted by Apache Jenkins Server <je...@builds.apache.org>.
See <https://ci-beam.apache.org/job/beam_LoadTests_Go_CoGBK_Dataflow_batch/494/display/redirect?page=changes>
Changes:
[ihr] Update Java katas to Beam 2.38
[noreply] [BEAM-14369] Fix "target/options: no such file or directory" error while
[noreply] [BEAM-14351] Inherit from Coder. (#17437)
[noreply] [BEAM-14297] Enable nullable key and value arrays for xlang kafka io
[noreply] Merge pull request #17444 from [BEAM-14310] [Website] bug home
[noreply] Merge pull request #17388 from [BEAM-14311] [Website] Home Page
[noreply] [BEAM-14376] Typo in method description doc
[noreply] Add default classpath when not present (#17491)
[thiagotnunes] fix: update javadocs for ChangeStreamMetrics
[noreply] Merge pull request #17443 from [BEAM-12164]: use the end timestamp for
[noreply] Merge pull request #17260 from [BEAM-13229] [Website] bug side nav
------------------------------------------
[...truncated 25.26 KB...]
key: "go"
value: <
urn: "beam:env:docker:v1"
payload: "\n\035apache/beam_go_sdk:2.39.0.dev"
capabilities: "beam:protocol:progress_reporting:v0"
capabilities: "beam:protocol:multi_core_bundle_processing:v1"
capabilities: "beam:version:sdk_base:go"
capabilities: "beam:coder:bytes:v1"
capabilities: "beam:coder:bool:v1"
capabilities: "beam:coder:varint:v1"
capabilities: "beam:coder:double:v1"
capabilities: "beam:coder:string_utf8:v1"
capabilities: "beam:coder:length_prefix:v1"
capabilities: "beam:coder:kv:v1"
capabilities: "beam:coder:iterable:v1"
capabilities: "beam:coder:state_backed_iterable:v1"
capabilities: "beam:coder:windowed_value:v1"
capabilities: "beam:coder:global_window:v1"
capabilities: "beam:coder:interval_window:v1"
capabilities: "beam:coder:row:v1"
capabilities: "beam:coder:nullable:v1"
dependencies: <
type_urn: "beam:artifact:type:url:v1"
type_payload: "\nJgs://temp-storage-for-perf-tests/loadtests/go-1-1651222789562320256/****\022@02167ce37eaf34e7e1107f6999e93b0d14b39169bdb4e9b2712fdcfeb7e25008"
role_urn: "beam:artifact:role:go_****_binary:v1"
>
>
>
>
root_transform_ids: "s2"
root_transform_ids: "e8"
root_transform_ids: "s1"
root_transform_ids: "e4"
root_transform_ids: "e9_cogbk"
root_transform_ids: "e10"
root_transform_ids: "e11"
requirements: "beam:requirement:pardo:splittable_dofn:v1"
2022/04/29 08:59:50 Staged model pipeline: gs://temp-storage-for-perf-tests/loadtests/go-1-1651222789562320256/model
2022/04/29 08:59:50 {
"environment": {
"experiments": [
"use_unified_****",
"use_portable_job_submission",
"beam_fn_api"
],
"sdkPipelineOptions": {
"display_data": [
{
"key": "name",
"namespace": "options",
"type": "STRING",
"value": "load-tests-go-dataflow-batch-cogbk-1-0428111113"
},
{
"key": "experiments",
"namespace": "options",
"type": "STRING",
"value": "use_unified_****,use_portable_job_submission"
},
{
"key": "project",
"namespace": "options",
"type": "STRING",
"value": "apache-beam-testing"
},
{
"key": "region",
"namespace": "options",
"type": "STRING",
"value": "us-central1"
},
{
"key": "container_images",
"namespace": "options",
"type": "STRING",
"value": "apache/beam_go_sdk:2.39.0.dev"
},
{
"key": "temp_location",
"namespace": "options",
"type": "STRING",
"value": "gs://temp-storage-for-perf-tests/loadtests"
},
{
"key": "co_input_options",
"namespace": "go_options",
"type": "STRING",
"value": "{\"num_records\": 2000000,\"key_size\": 10,\"value_size\": 90,\"num_hot_keys\": 1000,\"hot_key_fraction\": 1}"
},
{
"key": "hooks",
"namespace": "go_options",
"type": "STRING",
"value": "{\"default_remote_logging\":null}"
},
{
"key": "influx_db_name",
"namespace": "go_options",
"type": "STRING",
"value": "beam_test_metrics"
},
{
"key": "influx_namespace",
"namespace": "go_options",
"type": "STRING",
"value": "dataflow"
},
{
"key": "input_options",
"namespace": "go_options",
"type": "STRING",
"value": "{\"num_records\": 20000000,\"key_size\": 10,\"value_size\": 90,\"num_hot_keys\": 1,\"hot_key_fraction\": 1}"
},
{
"key": "iterations",
"namespace": "go_options",
"type": "STRING",
"value": "1"
},
{
"key": "****_binary",
"namespace": "go_options",
"type": "STRING",
"value": "linux_amd64/cogbk"
},
{
"key": "influx_hostname",
"namespace": "go_options",
"type": "STRING",
"value": "http://10.128.0.96:8086"
},
{
"key": "influx_measurement",
"namespace": "go_options",
"type": "STRING",
"value": "go_batch_cogbk_1"
},
{
"key": "hookOrder",
"namespace": "go_options",
"type": "STRING",
"value": "[\"default_remote_logging\"]"
}
],
"options": {
"experiments": [
"use_unified_****",
"use_portable_job_submission",
"beam_fn_api"
],
"pipelineUrl": "gs://temp-storage-for-perf-tests/loadtests/go-1-1651222789562320256/model",
"region": "us-central1",
"tempLocation": "gs://temp-storage-for-perf-tests/loadtests"
},
"beam:option:go_options:v1": {
"options": {
"co_input_options": "{\"num_records\": 2000000,\"key_size\": 10,\"value_size\": 90,\"num_hot_keys\": 1000,\"hot_key_fraction\": 1}",
"hookOrder": "[\"default_remote_logging\"]",
"hooks": "{\"default_remote_logging\":null}",
"influx_db_name": "beam_test_metrics",
"influx_hostname": "http://10.128.0.96:8086",
"influx_measurement": "go_batch_cogbk_1",
"influx_namespace": "dataflow",
"input_options": "{\"num_records\": 20000000,\"key_size\": 10,\"value_size\": 90,\"num_hot_keys\": 1,\"hot_key_fraction\": 1}",
"iterations": "1",
"****_binary": "linux_amd64/cogbk"
}
}
},
"tempStoragePrefix": "gs://temp-storage-for-perf-tests/loadtests",
"userAgent": {
"name": "Apache Beam SDK for Go",
"version": "2.39.0.dev"
},
"version": {
"job_type": "FNAPI_BATCH",
"major": "6"
},
"****Pools": [
{
"autoscalingSettings": {
"algorithm": "AUTOSCALING_ALGORITHM_NONE"
},
"ipConfiguration": "WORKER_IP_UNSPECIFIED",
"kind": "harness",
"numWorkers": 5,
"packages": [
{
"location": "gs://temp-storage-for-perf-tests/loadtests/go-1-1651222789562320256/****",
"name": "****"
}
],
"sdkHarnessContainerImages": [
{
"containerImage": "apache/beam_go_sdk:2.39.0.dev"
}
],
"****HarnessContainerImage": "apache/beam_go_sdk:2.39.0.dev"
}
]
},
"name": "load-tests-go-dataflow-batch-cogbk-1-0428111113",
"projectId": "apache-beam-testing",
"type": "JOB_TYPE_BATCH"
}
2022/04/29 08:59:50 Submitted job: 2022-04-29_01_59_50-12242162761561907738
2022/04/29 08:59:50 Console: https://console.cloud.google.com/dataflow/jobs/us-central1/2022-04-29_01_59_50-12242162761561907738?project=apache-beam-testing
2022/04/29 08:59:50 Logs: https://console.cloud.google.com/logs/viewer?project=apache-beam-testing&resource=dataflow_step%2Fjob_id%2F2022-04-29_01_59_50-12242162761561907738
2022/04/29 08:59:50 Job state: JOB_STATE_PENDING ...
2022/04/29 09:00:20 Job still running ...
2022/04/29 09:00:50 Job still running ...
2022/04/29 09:01:20 Job still running ...
2022/04/29 09:01:51 Job still running ...
2022/04/29 09:02:21 Job still running ...
2022/04/29 09:02:51 Failed to execute job: job 2022-04-29_01_59_50-12242162761561907738 failed
panic: Failed to execute job: job 2022-04-29_01_59_50-12242162761561907738 failed
goroutine 1 [running]:
github.com/apache/beam/sdks/v2/go/pkg/beam/log.Fatalf(0x1209788, 0xc000128000, 0x10e6f88, 0x19, 0xc000403e68, 0x1, 0x1)
<https://ci-beam.apache.org/job/beam_LoadTests_Go_CoGBK_Dataflow_batch/ws/src/sdks/go/pkg/beam/log/log.go>:153 +0xec
main.main()
<https://ci-beam.apache.org/job/beam_LoadTests_Go_CoGBK_Dataflow_batch/ws/src/sdks/go/test/load/cogbk/cogbk.go>:99 +0x52a
> Task :sdks:go:test:load:run FAILED
FAILURE: Build failed with an exception.
* Where:
Build file '<https://ci-beam.apache.org/job/beam_LoadTests_Go_CoGBK_Dataflow_batch/ws/src/sdks/go/test/load/build.gradle'> line: 31
* What went wrong:
Execution failed for task ':sdks:go:test:load:run'.
> Process 'command 'sh'' finished with non-zero exit value 2
* Try:
> Run with --stacktrace option to get the stack trace.
> Run with --info or --debug option to get more log output.
> Run with --scan to get full insights.
* Get more help at https://help.gradle.org
BUILD FAILED in 3m 21s
12 actionable tasks: 6 executed, 4 from cache, 2 up-to-date
Publishing build scan...
https://gradle.com/s/5yd6pnbvr36qu
Build step 'Invoke Gradle script' changed build result to FAILURE
Build step 'Invoke Gradle script' marked build as failure
---------------------------------------------------------------------
To unsubscribe, e-mail: builds-unsubscribe@beam.apache.org
For additional commands, e-mail: builds-help@beam.apache.org
Build failed in Jenkins: beam_LoadTests_Go_CoGBK_Dataflow_batch #493
Posted by Apache Jenkins Server <je...@builds.apache.org>.
See <https://ci-beam.apache.org/job/beam_LoadTests_Go_CoGBK_Dataflow_batch/493/display/redirect?page=changes>
Changes:
[nick.caballero] [BEAM-14363] Fixes WatermarkParameters builder for Kinesis
[noreply] [BEAM-11104] Add Checkpointing split to Go SDK (#17386)
[noreply] Merge pull request #17226 from [BEAM-14204] [Playground] Tests for
[noreply] [BEAM-13015, BEAM-14184] Address unbounded number of messages being
[noreply] Improvement to Seed job configuration to launch against PRs (#17468)
[noreply] [BEAM-13983] Small changes to sklearn runinference (#17459)
[chamikaramj] Renames ExternalPythonTransform to PythonExternalTransform
------------------------------------------
[...truncated 25.29 KB...]
key: "go"
value: <
urn: "beam:env:docker:v1"
payload: "\n\035apache/beam_go_sdk:2.39.0.dev"
capabilities: "beam:protocol:progress_reporting:v0"
capabilities: "beam:protocol:multi_core_bundle_processing:v1"
capabilities: "beam:version:sdk_base:go"
capabilities: "beam:coder:bytes:v1"
capabilities: "beam:coder:bool:v1"
capabilities: "beam:coder:varint:v1"
capabilities: "beam:coder:double:v1"
capabilities: "beam:coder:string_utf8:v1"
capabilities: "beam:coder:length_prefix:v1"
capabilities: "beam:coder:kv:v1"
capabilities: "beam:coder:iterable:v1"
capabilities: "beam:coder:state_backed_iterable:v1"
capabilities: "beam:coder:windowed_value:v1"
capabilities: "beam:coder:global_window:v1"
capabilities: "beam:coder:interval_window:v1"
capabilities: "beam:coder:row:v1"
capabilities: "beam:coder:nullable:v1"
dependencies: <
type_urn: "beam:artifact:type:url:v1"
type_payload: "\nJgs://temp-storage-for-perf-tests/loadtests/go-1-1651136392255815660/****\022@02167ce37eaf34e7e1107f6999e93b0d14b39169bdb4e9b2712fdcfeb7e25008"
role_urn: "beam:artifact:role:go_****_binary:v1"
>
>
>
>
root_transform_ids: "s1"
root_transform_ids: "e4"
root_transform_ids: "s2"
root_transform_ids: "e8"
root_transform_ids: "e9_cogbk"
root_transform_ids: "e10"
root_transform_ids: "e11"
requirements: "beam:requirement:pardo:splittable_dofn:v1"
2022/04/28 08:59:52 Staged model pipeline: gs://temp-storage-for-perf-tests/loadtests/go-1-1651136392255815660/model
2022/04/28 08:59:52 {
"environment": {
"experiments": [
"use_unified_****",
"use_portable_job_submission",
"beam_fn_api"
],
"sdkPipelineOptions": {
"display_data": [
{
"key": "name",
"namespace": "options",
"type": "STRING",
"value": "load-tests-go-dataflow-batch-cogbk-1-0428000503"
},
{
"key": "experiments",
"namespace": "options",
"type": "STRING",
"value": "use_unified_****,use_portable_job_submission"
},
{
"key": "project",
"namespace": "options",
"type": "STRING",
"value": "apache-beam-testing"
},
{
"key": "region",
"namespace": "options",
"type": "STRING",
"value": "us-central1"
},
{
"key": "container_images",
"namespace": "options",
"type": "STRING",
"value": "apache/beam_go_sdk:2.39.0.dev"
},
{
"key": "temp_location",
"namespace": "options",
"type": "STRING",
"value": "gs://temp-storage-for-perf-tests/loadtests"
},
{
"key": "iterations",
"namespace": "go_options",
"type": "STRING",
"value": "1"
},
{
"key": "****_binary",
"namespace": "go_options",
"type": "STRING",
"value": "linux_amd64/cogbk"
},
{
"key": "hooks",
"namespace": "go_options",
"type": "STRING",
"value": "{\"default_remote_logging\":null}"
},
{
"key": "influx_db_name",
"namespace": "go_options",
"type": "STRING",
"value": "beam_test_metrics"
},
{
"key": "influx_hostname",
"namespace": "go_options",
"type": "STRING",
"value": "http://10.128.0.96:8086"
},
{
"key": "influx_namespace",
"namespace": "go_options",
"type": "STRING",
"value": "dataflow"
},
{
"key": "hookOrder",
"namespace": "go_options",
"type": "STRING",
"value": "[\"default_remote_logging\"]"
},
{
"key": "input_options",
"namespace": "go_options",
"type": "STRING",
"value": "{\"num_records\": 20000000,\"key_size\": 10,\"value_size\": 90,\"num_hot_keys\": 1,\"hot_key_fraction\": 1}"
},
{
"key": "co_input_options",
"namespace": "go_options",
"type": "STRING",
"value": "{\"num_records\": 2000000,\"key_size\": 10,\"value_size\": 90,\"num_hot_keys\": 1000,\"hot_key_fraction\": 1}"
},
{
"key": "influx_measurement",
"namespace": "go_options",
"type": "STRING",
"value": "go_batch_cogbk_1"
}
],
"options": {
"experiments": [
"use_unified_****",
"use_portable_job_submission",
"beam_fn_api"
],
"pipelineUrl": "gs://temp-storage-for-perf-tests/loadtests/go-1-1651136392255815660/model",
"region": "us-central1",
"tempLocation": "gs://temp-storage-for-perf-tests/loadtests"
},
"beam:option:go_options:v1": {
"options": {
"co_input_options": "{\"num_records\": 2000000,\"key_size\": 10,\"value_size\": 90,\"num_hot_keys\": 1000,\"hot_key_fraction\": 1}",
"hookOrder": "[\"default_remote_logging\"]",
"hooks": "{\"default_remote_logging\":null}",
"influx_db_name": "beam_test_metrics",
"influx_hostname": "http://10.128.0.96:8086",
"influx_measurement": "go_batch_cogbk_1",
"influx_namespace": "dataflow",
"input_options": "{\"num_records\": 20000000,\"key_size\": 10,\"value_size\": 90,\"num_hot_keys\": 1,\"hot_key_fraction\": 1}",
"iterations": "1",
"****_binary": "linux_amd64/cogbk"
}
}
},
"tempStoragePrefix": "gs://temp-storage-for-perf-tests/loadtests",
"userAgent": {
"name": "Apache Beam SDK for Go",
"version": "2.39.0.dev"
},
"version": {
"job_type": "FNAPI_BATCH",
"major": "6"
},
"****Pools": [
{
"autoscalingSettings": {
"algorithm": "AUTOSCALING_ALGORITHM_NONE"
},
"ipConfiguration": "WORKER_IP_UNSPECIFIED",
"kind": "harness",
"numWorkers": 5,
"packages": [
{
"location": "gs://temp-storage-for-perf-tests/loadtests/go-1-1651136392255815660/****",
"name": "****"
}
],
"sdkHarnessContainerImages": [
{
"containerImage": "apache/beam_go_sdk:2.39.0.dev"
}
],
"****HarnessContainerImage": "apache/beam_go_sdk:2.39.0.dev"
}
]
},
"name": "load-tests-go-dataflow-batch-cogbk-1-0428000503",
"projectId": "apache-beam-testing",
"type": "JOB_TYPE_BATCH"
}
2022/04/28 08:59:53 Submitted job: 2022-04-28_01_59_52-13933673901126042437
2022/04/28 08:59:53 Console: https://console.cloud.google.com/dataflow/jobs/us-central1/2022-04-28_01_59_52-13933673901126042437?project=apache-beam-testing
2022/04/28 08:59:53 Logs: https://console.cloud.google.com/logs/viewer?project=apache-beam-testing&resource=dataflow_step%2Fjob_id%2F2022-04-28_01_59_52-13933673901126042437
2022/04/28 08:59:53 Job state: JOB_STATE_PENDING ...
2022/04/28 09:00:23 Job still running ...
2022/04/28 09:00:53 Job still running ...
2022/04/28 09:01:23 Job still running ...
2022/04/28 09:01:53 Job still running ...
2022/04/28 09:02:23 Job still running ...
2022/04/28 09:02:53 Failed to execute job: job 2022-04-28_01_59_52-13933673901126042437 failed
panic: Failed to execute job: job 2022-04-28_01_59_52-13933673901126042437 failed
goroutine 1 [running]:
github.com/apache/beam/sdks/v2/go/pkg/beam/log.Fatalf(0x1209788, 0xc000120000, 0x10e6f88, 0x19, 0xc000841e68, 0x1, 0x1)
<https://ci-beam.apache.org/job/beam_LoadTests_Go_CoGBK_Dataflow_batch/ws/src/sdks/go/pkg/beam/log/log.go>:153 +0xec
main.main()
<https://ci-beam.apache.org/job/beam_LoadTests_Go_CoGBK_Dataflow_batch/ws/src/sdks/go/test/load/cogbk/cogbk.go>:99 +0x52a
> Task :sdks:go:test:load:run FAILED
FAILURE: Build failed with an exception.
* Where:
Build file '<https://ci-beam.apache.org/job/beam_LoadTests_Go_CoGBK_Dataflow_batch/ws/src/sdks/go/test/load/build.gradle'> line: 31
* What went wrong:
Execution failed for task ':sdks:go:test:load:run'.
> Process 'command 'sh'' finished with non-zero exit value 2
* Try:
> Run with --stacktrace option to get the stack trace.
> Run with --info or --debug option to get more log output.
> Run with --scan to get full insights.
* Get more help at https://help.gradle.org
BUILD FAILED in 3m 25s
12 actionable tasks: 6 executed, 4 from cache, 2 up-to-date
Publishing build scan...
https://gradle.com/s/pkzzxrl6eqwry
Build step 'Invoke Gradle script' changed build result to FAILURE
Build step 'Invoke Gradle script' marked build as failure
---------------------------------------------------------------------
To unsubscribe, e-mail: builds-unsubscribe@beam.apache.org
For additional commands, e-mail: builds-help@beam.apache.org
Build failed in Jenkins: beam_LoadTests_Go_CoGBK_Dataflow_batch #492
Posted by Apache Jenkins Server <je...@builds.apache.org>.
See <https://ci-beam.apache.org/job/beam_LoadTests_Go_CoGBK_Dataflow_batch/492/display/redirect?page=changes>
Changes:
[msbukal] FhirIO: use .search() or .searchType instead of .setResourceType()
[noreply] Remove unnecessary decorator from RunInference interface (#17463)
[noreply] [BEAM-13590] Minor deprecated warning fix (#17453)
[noreply] [BEAM-12164]: fix the negative throughput issue (#17461)
[noreply] Updated goldens for the screen diff integration tests (#17467)
[noreply] fixes copy by value error for bytes.Buffer in Error (#17469)
[noreply] Merge pull request #17354 from [BEAM-14170] - Create a test that runs
[noreply] Merge pull request #17447 from [BEAM-14357] Fix
[noreply] [BEAM-14324, BEAM-14325] Staticcheck cleanup in test files (#17393)
[noreply] BEAM-14187 Fix NPE (#17454)
[noreply] [BEAM-11105] Stateful watermark estimation (#17374)
[noreply] [BEAM-14304] implement parquetio to read/write parquet files (#17347)
------------------------------------------
[...truncated 25.34 KB...]
capabilities: "beam:protocol:progress_reporting:v0"
capabilities: "beam:protocol:multi_core_bundle_processing:v1"
capabilities: "beam:version:sdk_base:go"
capabilities: "beam:coder:bytes:v1"
capabilities: "beam:coder:bool:v1"
capabilities: "beam:coder:varint:v1"
capabilities: "beam:coder:double:v1"
capabilities: "beam:coder:string_utf8:v1"
capabilities: "beam:coder:length_prefix:v1"
capabilities: "beam:coder:kv:v1"
capabilities: "beam:coder:iterable:v1"
capabilities: "beam:coder:state_backed_iterable:v1"
capabilities: "beam:coder:windowed_value:v1"
capabilities: "beam:coder:global_window:v1"
capabilities: "beam:coder:interval_window:v1"
capabilities: "beam:coder:row:v1"
capabilities: "beam:coder:nullable:v1"
dependencies: <
type_urn: "beam:artifact:type:url:v1"
type_payload: "\nJgs://temp-storage-for-perf-tests/loadtests/go-1-1651050000548123764/****\022@831d6712110299ed4c541f12a64173d1d093209638ef5b959c70f393dd9e156f"
role_urn: "beam:artifact:role:go_****_binary:v1"
>
>
>
>
root_transform_ids: "s1"
root_transform_ids: "s2"
root_transform_ids: "e8"
root_transform_ids: "e4"
root_transform_ids: "e9_cogbk"
root_transform_ids: "e10"
root_transform_ids: "e11"
requirements: "beam:requirement:pardo:splittable_dofn:v1"
2022/04/27 09:00:01 Staged model pipeline: gs://temp-storage-for-perf-tests/loadtests/go-1-1651050000548123764/model
2022/04/27 09:00:01 {
"environment": {
"experiments": [
"use_unified_****",
"use_portable_job_submission",
"beam_fn_api"
],
"sdkPipelineOptions": {
"display_data": [
{
"key": "name",
"namespace": "options",
"type": "STRING",
"value": "load-tests-go-dataflow-batch-cogbk-1-0427065641"
},
{
"key": "experiments",
"namespace": "options",
"type": "STRING",
"value": "use_unified_****,use_portable_job_submission"
},
{
"key": "project",
"namespace": "options",
"type": "STRING",
"value": "apache-beam-testing"
},
{
"key": "region",
"namespace": "options",
"type": "STRING",
"value": "us-central1"
},
{
"key": "container_images",
"namespace": "options",
"type": "STRING",
"value": "apache/beam_go_sdk:2.39.0.dev"
},
{
"key": "temp_location",
"namespace": "options",
"type": "STRING",
"value": "gs://temp-storage-for-perf-tests/loadtests"
},
{
"key": "input_options",
"namespace": "go_options",
"type": "STRING",
"value": "{\"num_records\": 20000000,\"key_size\": 10,\"value_size\": 90,\"num_hot_keys\": 1,\"hot_key_fraction\": 1}"
},
{
"key": "****_binary",
"namespace": "go_options",
"type": "STRING",
"value": "linux_amd64/cogbk"
},
{
"key": "hooks",
"namespace": "go_options",
"type": "STRING",
"value": "{\"default_remote_logging\":null}"
},
{
"key": "hookOrder",
"namespace": "go_options",
"type": "STRING",
"value": "[\"default_remote_logging\"]"
},
{
"key": "influx_hostname",
"namespace": "go_options",
"type": "STRING",
"value": "http://10.128.0.96:8086"
},
{
"key": "influx_db_name",
"namespace": "go_options",
"type": "STRING",
"value": "beam_test_metrics"
},
{
"key": "influx_measurement",
"namespace": "go_options",
"type": "STRING",
"value": "go_batch_cogbk_1"
},
{
"key": "iterations",
"namespace": "go_options",
"type": "STRING",
"value": "1"
},
{
"key": "co_input_options",
"namespace": "go_options",
"type": "STRING",
"value": "{\"num_records\": 2000000,\"key_size\": 10,\"value_size\": 90,\"num_hot_keys\": 1000,\"hot_key_fraction\": 1}"
},
{
"key": "influx_namespace",
"namespace": "go_options",
"type": "STRING",
"value": "dataflow"
}
],
"options": {
"experiments": [
"use_unified_****",
"use_portable_job_submission",
"beam_fn_api"
],
"pipelineUrl": "gs://temp-storage-for-perf-tests/loadtests/go-1-1651050000548123764/model",
"region": "us-central1",
"tempLocation": "gs://temp-storage-for-perf-tests/loadtests"
},
"beam:option:go_options:v1": {
"options": {
"co_input_options": "{\"num_records\": 2000000,\"key_size\": 10,\"value_size\": 90,\"num_hot_keys\": 1000,\"hot_key_fraction\": 1}",
"hookOrder": "[\"default_remote_logging\"]",
"hooks": "{\"default_remote_logging\":null}",
"influx_db_name": "beam_test_metrics",
"influx_hostname": "http://10.128.0.96:8086",
"influx_measurement": "go_batch_cogbk_1",
"influx_namespace": "dataflow",
"input_options": "{\"num_records\": 20000000,\"key_size\": 10,\"value_size\": 90,\"num_hot_keys\": 1,\"hot_key_fraction\": 1}",
"iterations": "1",
"****_binary": "linux_amd64/cogbk"
}
}
},
"tempStoragePrefix": "gs://temp-storage-for-perf-tests/loadtests",
"userAgent": {
"name": "Apache Beam SDK for Go",
"version": "2.39.0.dev"
},
"version": {
"job_type": "FNAPI_BATCH",
"major": "6"
},
"****Pools": [
{
"autoscalingSettings": {
"algorithm": "AUTOSCALING_ALGORITHM_NONE"
},
"ipConfiguration": "WORKER_IP_UNSPECIFIED",
"kind": "harness",
"numWorkers": 5,
"packages": [
{
"location": "gs://temp-storage-for-perf-tests/loadtests/go-1-1651050000548123764/****",
"name": "****"
}
],
"sdkHarnessContainerImages": [
{
"containerImage": "apache/beam_go_sdk:2.39.0.dev"
}
],
"****HarnessContainerImage": "apache/beam_go_sdk:2.39.0.dev"
}
]
},
"name": "load-tests-go-dataflow-batch-cogbk-1-0427065641",
"projectId": "apache-beam-testing",
"type": "JOB_TYPE_BATCH"
}
2022/04/27 09:00:01 Submitted job: 2022-04-27_02_00_01-10880806066448843646
2022/04/27 09:00:01 Console: https://console.cloud.google.com/dataflow/jobs/us-central1/2022-04-27_02_00_01-10880806066448843646?project=apache-beam-testing
2022/04/27 09:00:01 Logs: https://console.cloud.google.com/logs/viewer?project=apache-beam-testing&resource=dataflow_step%2Fjob_id%2F2022-04-27_02_00_01-10880806066448843646
2022/04/27 09:00:01 Job state: JOB_STATE_PENDING ...
2022/04/27 09:00:32 Job still running ...
2022/04/27 09:01:02 Job still running ...
2022/04/27 09:01:32 Job still running ...
2022/04/27 09:02:02 Job still running ...
2022/04/27 09:02:32 Job still running ...
2022/04/27 09:03:02 Job still running ...
2022/04/27 09:03:32 Job still running ...
2022/04/27 09:04:02 Job still running ...
2022/04/27 09:04:34 Job still running ...
2022/04/27 09:05:05 Failed to execute job: job 2022-04-27_02_00_01-10880806066448843646 failed
panic: Failed to execute job: job 2022-04-27_02_00_01-10880806066448843646 failed
goroutine 1 [running]:
github.com/apache/beam/sdks/v2/go/pkg/beam/log.Fatalf(0x1208368, 0xc000120000, 0x10e5e68, 0x19, 0xc0004d9e68, 0x1, 0x1)
<https://ci-beam.apache.org/job/beam_LoadTests_Go_CoGBK_Dataflow_batch/ws/src/sdks/go/pkg/beam/log/log.go>:153 +0xec
main.main()
<https://ci-beam.apache.org/job/beam_LoadTests_Go_CoGBK_Dataflow_batch/ws/src/sdks/go/test/load/cogbk/cogbk.go>:99 +0x52a
> Task :sdks:go:test:load:run FAILED
FAILURE: Build failed with an exception.
* Where:
Build file '<https://ci-beam.apache.org/job/beam_LoadTests_Go_CoGBK_Dataflow_batch/ws/src/sdks/go/test/load/build.gradle'> line: 31
* What went wrong:
Execution failed for task ':sdks:go:test:load:run'.
> Process 'command 'sh'' finished with non-zero exit value 2
* Try:
> Run with --stacktrace option to get the stack trace.
> Run with --info or --debug option to get more log output.
> Run with --scan to get full insights.
* Get more help at https://help.gradle.org
BUILD FAILED in 5m 33s
12 actionable tasks: 6 executed, 4 from cache, 2 up-to-date
Publishing build scan...
https://gradle.com/s/bypntjijhg52o
Build step 'Invoke Gradle script' changed build result to FAILURE
Build step 'Invoke Gradle script' marked build as failure
---------------------------------------------------------------------
To unsubscribe, e-mail: builds-unsubscribe@beam.apache.org
For additional commands, e-mail: builds-help@beam.apache.org
Build failed in Jenkins: beam_LoadTests_Go_CoGBK_Dataflow_batch #491
Posted by Apache Jenkins Server <je...@builds.apache.org>.
See <https://ci-beam.apache.org/job/beam_LoadTests_Go_CoGBK_Dataflow_batch/491/display/redirect?page=changes>
Changes:
[Heejong Lee] [BEAM-14343] Allow expansion service override in ExternalPythonTransform
[Heejong Lee] update
[Heejong Lee] allows remote host
[Heejong Lee] improve compatibility with python rowcoder
[ahmedabualsaud] added tempLocation to test pipeline options
[ahmedabualsaud] using tempRoot for temp bucket location
[ahmedabualsaud] small fixes
[noreply] [BEAM-14320] Update programming-guide w/Java GroupByKey example (#17369)
[noreply] Minor: Fix release script for `current` symlinks (#17457)
[noreply] Minor: fix typo (#17452)
[noreply] Change return type for PytorchInferenceRunner (#17460)
[noreply] [BEAM-13608] JmsIO dynamic topics feature (#17163)
[Heejong Lee] add test
------------------------------------------
[...truncated 24.97 KB...]
key: "go"
value: <
urn: "beam:env:docker:v1"
payload: "\n\035apache/beam_go_sdk:2.39.0.dev"
capabilities: "beam:protocol:progress_reporting:v0"
capabilities: "beam:protocol:multi_core_bundle_processing:v1"
capabilities: "beam:version:sdk_base:go"
capabilities: "beam:coder:bytes:v1"
capabilities: "beam:coder:bool:v1"
capabilities: "beam:coder:varint:v1"
capabilities: "beam:coder:double:v1"
capabilities: "beam:coder:string_utf8:v1"
capabilities: "beam:coder:length_prefix:v1"
capabilities: "beam:coder:kv:v1"
capabilities: "beam:coder:iterable:v1"
capabilities: "beam:coder:state_backed_iterable:v1"
capabilities: "beam:coder:windowed_value:v1"
capabilities: "beam:coder:global_window:v1"
capabilities: "beam:coder:interval_window:v1"
capabilities: "beam:coder:row:v1"
capabilities: "beam:coder:nullable:v1"
dependencies: <
type_urn: "beam:artifact:type:url:v1"
type_payload: "\nJgs://temp-storage-for-perf-tests/loadtests/go-1-1650963586417460228/****\022@e6209095f34db620fc8140bde17e4628c948ceab23d48878c7458c187955c70e"
role_urn: "beam:artifact:role:go_****_binary:v1"
>
>
>
>
root_transform_ids: "s2"
root_transform_ids: "e8"
root_transform_ids: "s1"
root_transform_ids: "e4"
root_transform_ids: "e9_cogbk"
root_transform_ids: "e10"
root_transform_ids: "e11"
requirements: "beam:requirement:pardo:splittable_dofn:v1"
2022/04/26 08:59:47 Staged model pipeline: gs://temp-storage-for-perf-tests/loadtests/go-1-1650963586417460228/model
2022/04/26 08:59:47 {
"environment": {
"experiments": [
"use_unified_****",
"use_portable_job_submission",
"beam_fn_api"
],
"sdkPipelineOptions": {
"display_data": [
{
"key": "name",
"namespace": "options",
"type": "STRING",
"value": "load-tests-go-dataflow-batch-cogbk-1-0426065627"
},
{
"key": "experiments",
"namespace": "options",
"type": "STRING",
"value": "use_unified_****,use_portable_job_submission"
},
{
"key": "project",
"namespace": "options",
"type": "STRING",
"value": "apache-beam-testing"
},
{
"key": "region",
"namespace": "options",
"type": "STRING",
"value": "us-central1"
},
{
"key": "container_images",
"namespace": "options",
"type": "STRING",
"value": "apache/beam_go_sdk:2.39.0.dev"
},
{
"key": "temp_location",
"namespace": "options",
"type": "STRING",
"value": "gs://temp-storage-for-perf-tests/loadtests"
},
{
"key": "influx_namespace",
"namespace": "go_options",
"type": "STRING",
"value": "dataflow"
},
{
"key": "****_binary",
"namespace": "go_options",
"type": "STRING",
"value": "linux_amd64/cogbk"
},
{
"key": "co_input_options",
"namespace": "go_options",
"type": "STRING",
"value": "{\"num_records\": 2000000,\"key_size\": 10,\"value_size\": 90,\"num_hot_keys\": 1000,\"hot_key_fraction\": 1}"
},
{
"key": "hookOrder",
"namespace": "go_options",
"type": "STRING",
"value": "[\"default_remote_logging\"]"
},
{
"key": "influx_hostname",
"namespace": "go_options",
"type": "STRING",
"value": "http://10.128.0.96:8086"
},
{
"key": "influx_measurement",
"namespace": "go_options",
"type": "STRING",
"value": "go_batch_cogbk_1"
},
{
"key": "input_options",
"namespace": "go_options",
"type": "STRING",
"value": "{\"num_records\": 20000000,\"key_size\": 10,\"value_size\": 90,\"num_hot_keys\": 1,\"hot_key_fraction\": 1}"
},
{
"key": "iterations",
"namespace": "go_options",
"type": "STRING",
"value": "1"
},
{
"key": "hooks",
"namespace": "go_options",
"type": "STRING",
"value": "{\"default_remote_logging\":null}"
},
{
"key": "influx_db_name",
"namespace": "go_options",
"type": "STRING",
"value": "beam_test_metrics"
}
],
"options": {
"experiments": [
"use_unified_****",
"use_portable_job_submission",
"beam_fn_api"
],
"pipelineUrl": "gs://temp-storage-for-perf-tests/loadtests/go-1-1650963586417460228/model",
"region": "us-central1",
"tempLocation": "gs://temp-storage-for-perf-tests/loadtests"
},
"beam:option:go_options:v1": {
"options": {
"co_input_options": "{\"num_records\": 2000000,\"key_size\": 10,\"value_size\": 90,\"num_hot_keys\": 1000,\"hot_key_fraction\": 1}",
"hookOrder": "[\"default_remote_logging\"]",
"hooks": "{\"default_remote_logging\":null}",
"influx_db_name": "beam_test_metrics",
"influx_hostname": "http://10.128.0.96:8086",
"influx_measurement": "go_batch_cogbk_1",
"influx_namespace": "dataflow",
"input_options": "{\"num_records\": 20000000,\"key_size\": 10,\"value_size\": 90,\"num_hot_keys\": 1,\"hot_key_fraction\": 1}",
"iterations": "1",
"****_binary": "linux_amd64/cogbk"
}
}
},
"tempStoragePrefix": "gs://temp-storage-for-perf-tests/loadtests",
"userAgent": {
"name": "Apache Beam SDK for Go",
"version": "2.39.0.dev"
},
"version": {
"job_type": "FNAPI_BATCH",
"major": "6"
},
"****Pools": [
{
"autoscalingSettings": {
"algorithm": "AUTOSCALING_ALGORITHM_NONE"
},
"ipConfiguration": "WORKER_IP_UNSPECIFIED",
"kind": "harness",
"numWorkers": 5,
"packages": [
{
"location": "gs://temp-storage-for-perf-tests/loadtests/go-1-1650963586417460228/****",
"name": "****"
}
],
"sdkHarnessContainerImages": [
{
"containerImage": "apache/beam_go_sdk:2.39.0.dev"
}
],
"****HarnessContainerImage": "apache/beam_go_sdk:2.39.0.dev"
}
]
},
"name": "load-tests-go-dataflow-batch-cogbk-1-0426065627",
"projectId": "apache-beam-testing",
"type": "JOB_TYPE_BATCH"
}
2022/04/26 08:59:47 Submitted job: 2022-04-26_01_59_47-8226974572203910271
2022/04/26 08:59:47 Console: https://console.cloud.google.com/dataflow/jobs/us-central1/2022-04-26_01_59_47-8226974572203910271?project=apache-beam-testing
2022/04/26 08:59:47 Logs: https://console.cloud.google.com/logs/viewer?project=apache-beam-testing&resource=dataflow_step%2Fjob_id%2F2022-04-26_01_59_47-8226974572203910271
2022/04/26 08:59:47 Job state: JOB_STATE_PENDING ...
2022/04/26 09:00:17 Job still running ...
2022/04/26 09:00:48 Job still running ...
2022/04/26 09:01:18 Job still running ...
2022/04/26 09:01:48 Job still running ...
2022/04/26 09:02:18 Job still running ...
2022/04/26 09:02:48 Failed to execute job: job 2022-04-26_01_59_47-8226974572203910271 failed
panic: Failed to execute job: job 2022-04-26_01_59_47-8226974572203910271 failed
goroutine 1 [running]:
github.com/apache/beam/sdks/v2/go/pkg/beam/log.Fatalf(0x1203148, 0xc0000480c0, 0x10e1911, 0x19, 0xc0007fde68, 0x1, 0x1)
<https://ci-beam.apache.org/job/beam_LoadTests_Go_CoGBK_Dataflow_batch/ws/src/sdks/go/pkg/beam/log/log.go>:153 +0xec
main.main()
<https://ci-beam.apache.org/job/beam_LoadTests_Go_CoGBK_Dataflow_batch/ws/src/sdks/go/test/load/cogbk/cogbk.go>:99 +0x52a
> Task :sdks:go:test:load:run FAILED
FAILURE: Build failed with an exception.
* Where:
Build file '<https://ci-beam.apache.org/job/beam_LoadTests_Go_CoGBK_Dataflow_batch/ws/src/sdks/go/test/load/build.gradle'> line: 31
* What went wrong:
Execution failed for task ':sdks:go:test:load:run'.
> Process 'command 'sh'' finished with non-zero exit value 2
* Try:
> Run with --stacktrace option to get the stack trace.
> Run with --info or --debug option to get more log output.
> Run with --scan to get full insights.
* Get more help at https://help.gradle.org
BUILD FAILED in 3m 20s
12 actionable tasks: 6 executed, 4 from cache, 2 up-to-date
Publishing build scan...
https://gradle.com/s/wg6g3enhpqm7a
Build step 'Invoke Gradle script' changed build result to FAILURE
Build step 'Invoke Gradle script' marked build as failure
---------------------------------------------------------------------
To unsubscribe, e-mail: builds-unsubscribe@beam.apache.org
For additional commands, e-mail: builds-help@beam.apache.org
Build failed in Jenkins: beam_LoadTests_Go_CoGBK_Dataflow_batch #490
Posted by Apache Jenkins Server <je...@builds.apache.org>.
See <https://ci-beam.apache.org/job/beam_LoadTests_Go_CoGBK_Dataflow_batch/490/display/redirect>
Changes:
------------------------------------------
[...truncated 24.99 KB...]
key: "go"
value: <
urn: "beam:env:docker:v1"
payload: "\n\035apache/beam_go_sdk:2.39.0.dev"
capabilities: "beam:protocol:progress_reporting:v0"
capabilities: "beam:protocol:multi_core_bundle_processing:v1"
capabilities: "beam:version:sdk_base:go"
capabilities: "beam:coder:bytes:v1"
capabilities: "beam:coder:bool:v1"
capabilities: "beam:coder:varint:v1"
capabilities: "beam:coder:double:v1"
capabilities: "beam:coder:string_utf8:v1"
capabilities: "beam:coder:length_prefix:v1"
capabilities: "beam:coder:kv:v1"
capabilities: "beam:coder:iterable:v1"
capabilities: "beam:coder:state_backed_iterable:v1"
capabilities: "beam:coder:windowed_value:v1"
capabilities: "beam:coder:global_window:v1"
capabilities: "beam:coder:interval_window:v1"
capabilities: "beam:coder:row:v1"
capabilities: "beam:coder:nullable:v1"
dependencies: <
type_urn: "beam:artifact:type:url:v1"
type_payload: "\nJgs://temp-storage-for-perf-tests/loadtests/go-1-1650877187148511875/****\022@e6209095f34db620fc8140bde17e4628c948ceab23d48878c7458c187955c70e"
role_urn: "beam:artifact:role:go_****_binary:v1"
>
>
>
>
root_transform_ids: "s2"
root_transform_ids: "e8"
root_transform_ids: "s1"
root_transform_ids: "e4"
root_transform_ids: "e9_cogbk"
root_transform_ids: "e10"
root_transform_ids: "e11"
requirements: "beam:requirement:pardo:splittable_dofn:v1"
2022/04/25 08:59:47 Staged model pipeline: gs://temp-storage-for-perf-tests/loadtests/go-1-1650877187148511875/model
2022/04/25 08:59:47 {
"environment": {
"experiments": [
"use_unified_****",
"use_portable_job_submission",
"beam_fn_api"
],
"sdkPipelineOptions": {
"display_data": [
{
"key": "name",
"namespace": "options",
"type": "STRING",
"value": "load-tests-go-dataflow-batch-cogbk-1-0425065639"
},
{
"key": "experiments",
"namespace": "options",
"type": "STRING",
"value": "use_unified_****,use_portable_job_submission"
},
{
"key": "project",
"namespace": "options",
"type": "STRING",
"value": "apache-beam-testing"
},
{
"key": "region",
"namespace": "options",
"type": "STRING",
"value": "us-central1"
},
{
"key": "container_images",
"namespace": "options",
"type": "STRING",
"value": "apache/beam_go_sdk:2.39.0.dev"
},
{
"key": "temp_location",
"namespace": "options",
"type": "STRING",
"value": "gs://temp-storage-for-perf-tests/loadtests"
},
{
"key": "input_options",
"namespace": "go_options",
"type": "STRING",
"value": "{\"num_records\": 20000000,\"key_size\": 10,\"value_size\": 90,\"num_hot_keys\": 1,\"hot_key_fraction\": 1}"
},
{
"key": "****_binary",
"namespace": "go_options",
"type": "STRING",
"value": "linux_amd64/cogbk"
},
{
"key": "hookOrder",
"namespace": "go_options",
"type": "STRING",
"value": "[\"default_remote_logging\"]"
},
{
"key": "co_input_options",
"namespace": "go_options",
"type": "STRING",
"value": "{\"num_records\": 2000000,\"key_size\": 10,\"value_size\": 90,\"num_hot_keys\": 1000,\"hot_key_fraction\": 1}"
},
{
"key": "influx_namespace",
"namespace": "go_options",
"type": "STRING",
"value": "dataflow"
},
{
"key": "influx_db_name",
"namespace": "go_options",
"type": "STRING",
"value": "beam_test_metrics"
},
{
"key": "influx_hostname",
"namespace": "go_options",
"type": "STRING",
"value": "http://10.128.0.96:8086"
},
{
"key": "influx_measurement",
"namespace": "go_options",
"type": "STRING",
"value": "go_batch_cogbk_1"
},
{
"key": "iterations",
"namespace": "go_options",
"type": "STRING",
"value": "1"
},
{
"key": "hooks",
"namespace": "go_options",
"type": "STRING",
"value": "{\"default_remote_logging\":null}"
}
],
"options": {
"experiments": [
"use_unified_****",
"use_portable_job_submission",
"beam_fn_api"
],
"pipelineUrl": "gs://temp-storage-for-perf-tests/loadtests/go-1-1650877187148511875/model",
"region": "us-central1",
"tempLocation": "gs://temp-storage-for-perf-tests/loadtests"
},
"beam:option:go_options:v1": {
"options": {
"co_input_options": "{\"num_records\": 2000000,\"key_size\": 10,\"value_size\": 90,\"num_hot_keys\": 1000,\"hot_key_fraction\": 1}",
"hookOrder": "[\"default_remote_logging\"]",
"hooks": "{\"default_remote_logging\":null}",
"influx_db_name": "beam_test_metrics",
"influx_hostname": "http://10.128.0.96:8086",
"influx_measurement": "go_batch_cogbk_1",
"influx_namespace": "dataflow",
"input_options": "{\"num_records\": 20000000,\"key_size\": 10,\"value_size\": 90,\"num_hot_keys\": 1,\"hot_key_fraction\": 1}",
"iterations": "1",
"****_binary": "linux_amd64/cogbk"
}
}
},
"tempStoragePrefix": "gs://temp-storage-for-perf-tests/loadtests",
"userAgent": {
"name": "Apache Beam SDK for Go",
"version": "2.39.0.dev"
},
"version": {
"job_type": "FNAPI_BATCH",
"major": "6"
},
"****Pools": [
{
"autoscalingSettings": {
"algorithm": "AUTOSCALING_ALGORITHM_NONE"
},
"ipConfiguration": "WORKER_IP_UNSPECIFIED",
"kind": "harness",
"numWorkers": 5,
"packages": [
{
"location": "gs://temp-storage-for-perf-tests/loadtests/go-1-1650877187148511875/****",
"name": "****"
}
],
"sdkHarnessContainerImages": [
{
"containerImage": "apache/beam_go_sdk:2.39.0.dev"
}
],
"****HarnessContainerImage": "apache/beam_go_sdk:2.39.0.dev"
}
]
},
"name": "load-tests-go-dataflow-batch-cogbk-1-0425065639",
"projectId": "apache-beam-testing",
"type": "JOB_TYPE_BATCH"
}
2022/04/25 08:59:48 Submitted job: 2022-04-25_01_59_47-11315734402133377826
2022/04/25 08:59:48 Console: https://console.cloud.google.com/dataflow/jobs/us-central1/2022-04-25_01_59_47-11315734402133377826?project=apache-beam-testing
2022/04/25 08:59:48 Logs: https://console.cloud.google.com/logs/viewer?project=apache-beam-testing&resource=dataflow_step%2Fjob_id%2F2022-04-25_01_59_47-11315734402133377826
2022/04/25 08:59:48 Job state: JOB_STATE_PENDING ...
2022/04/25 09:00:18 Job still running ...
2022/04/25 09:00:48 Job still running ...
2022/04/25 09:01:18 Job still running ...
2022/04/25 09:01:48 Job still running ...
2022/04/25 09:02:18 Job still running ...
2022/04/25 09:02:48 Failed to execute job: job 2022-04-25_01_59_47-11315734402133377826 failed
panic: Failed to execute job: job 2022-04-25_01_59_47-11315734402133377826 failed
goroutine 1 [running]:
github.com/apache/beam/sdks/v2/go/pkg/beam/log.Fatalf(0x1203148, 0xc0000480c0, 0x10e1911, 0x19, 0xc0005dde68, 0x1, 0x1)
<https://ci-beam.apache.org/job/beam_LoadTests_Go_CoGBK_Dataflow_batch/ws/src/sdks/go/pkg/beam/log/log.go>:153 +0xec
main.main()
<https://ci-beam.apache.org/job/beam_LoadTests_Go_CoGBK_Dataflow_batch/ws/src/sdks/go/test/load/cogbk/cogbk.go>:99 +0x52a
> Task :sdks:go:test:load:run FAILED
FAILURE: Build failed with an exception.
* Where:
Build file '<https://ci-beam.apache.org/job/beam_LoadTests_Go_CoGBK_Dataflow_batch/ws/src/sdks/go/test/load/build.gradle'> line: 31
* What went wrong:
Execution failed for task ':sdks:go:test:load:run'.
> Process 'command 'sh'' finished with non-zero exit value 2
* Try:
> Run with --stacktrace option to get the stack trace.
> Run with --info or --debug option to get more log output.
> Run with --scan to get full insights.
* Get more help at https://help.gradle.org
BUILD FAILED in 3m 19s
12 actionable tasks: 6 executed, 4 from cache, 2 up-to-date
Publishing build scan...
https://gradle.com/s/c53zqo5cf37ak
Build step 'Invoke Gradle script' changed build result to FAILURE
Build step 'Invoke Gradle script' marked build as failure
---------------------------------------------------------------------
To unsubscribe, e-mail: builds-unsubscribe@beam.apache.org
For additional commands, e-mail: builds-help@beam.apache.org
Build failed in Jenkins: beam_LoadTests_Go_CoGBK_Dataflow_batch #489
Posted by Apache Jenkins Server <je...@builds.apache.org>.
See <https://ci-beam.apache.org/job/beam_LoadTests_Go_CoGBK_Dataflow_batch/489/display/redirect?page=changes>
Changes:
[noreply] [BEAM-13953] added documentation for BQ Storage Write API (#17391)
------------------------------------------
[...truncated 24.99 KB...]
key: "go"
value: <
urn: "beam:env:docker:v1"
payload: "\n\035apache/beam_go_sdk:2.39.0.dev"
capabilities: "beam:protocol:progress_reporting:v0"
capabilities: "beam:protocol:multi_core_bundle_processing:v1"
capabilities: "beam:version:sdk_base:go"
capabilities: "beam:coder:bytes:v1"
capabilities: "beam:coder:bool:v1"
capabilities: "beam:coder:varint:v1"
capabilities: "beam:coder:double:v1"
capabilities: "beam:coder:string_utf8:v1"
capabilities: "beam:coder:length_prefix:v1"
capabilities: "beam:coder:kv:v1"
capabilities: "beam:coder:iterable:v1"
capabilities: "beam:coder:state_backed_iterable:v1"
capabilities: "beam:coder:windowed_value:v1"
capabilities: "beam:coder:global_window:v1"
capabilities: "beam:coder:interval_window:v1"
capabilities: "beam:coder:row:v1"
capabilities: "beam:coder:nullable:v1"
dependencies: <
type_urn: "beam:artifact:type:url:v1"
type_payload: "\nJgs://temp-storage-for-perf-tests/loadtests/go-1-1650790785940167577/****\022@e6209095f34db620fc8140bde17e4628c948ceab23d48878c7458c187955c70e"
role_urn: "beam:artifact:role:go_****_binary:v1"
>
>
>
>
root_transform_ids: "s2"
root_transform_ids: "e8"
root_transform_ids: "s1"
root_transform_ids: "e4"
root_transform_ids: "e9_cogbk"
root_transform_ids: "e10"
root_transform_ids: "e11"
requirements: "beam:requirement:pardo:splittable_dofn:v1"
2022/04/24 08:59:46 Staged model pipeline: gs://temp-storage-for-perf-tests/loadtests/go-1-1650790785940167577/model
2022/04/24 08:59:46 {
"environment": {
"experiments": [
"use_unified_****",
"use_portable_job_submission",
"beam_fn_api"
],
"sdkPipelineOptions": {
"display_data": [
{
"key": "name",
"namespace": "options",
"type": "STRING",
"value": "load-tests-go-dataflow-batch-cogbk-1-0424065639"
},
{
"key": "experiments",
"namespace": "options",
"type": "STRING",
"value": "use_unified_****,use_portable_job_submission"
},
{
"key": "project",
"namespace": "options",
"type": "STRING",
"value": "apache-beam-testing"
},
{
"key": "region",
"namespace": "options",
"type": "STRING",
"value": "us-central1"
},
{
"key": "container_images",
"namespace": "options",
"type": "STRING",
"value": "apache/beam_go_sdk:2.39.0.dev"
},
{
"key": "temp_location",
"namespace": "options",
"type": "STRING",
"value": "gs://temp-storage-for-perf-tests/loadtests"
},
{
"key": "influx_db_name",
"namespace": "go_options",
"type": "STRING",
"value": "beam_test_metrics"
},
{
"key": "influx_namespace",
"namespace": "go_options",
"type": "STRING",
"value": "dataflow"
},
{
"key": "hookOrder",
"namespace": "go_options",
"type": "STRING",
"value": "[\"default_remote_logging\"]"
},
{
"key": "co_input_options",
"namespace": "go_options",
"type": "STRING",
"value": "{\"num_records\": 2000000,\"key_size\": 10,\"value_size\": 90,\"num_hot_keys\": 1000,\"hot_key_fraction\": 1}"
},
{
"key": "hooks",
"namespace": "go_options",
"type": "STRING",
"value": "{\"default_remote_logging\":null}"
},
{
"key": "iterations",
"namespace": "go_options",
"type": "STRING",
"value": "1"
},
{
"key": "****_binary",
"namespace": "go_options",
"type": "STRING",
"value": "linux_amd64/cogbk"
},
{
"key": "influx_hostname",
"namespace": "go_options",
"type": "STRING",
"value": "http://10.128.0.96:8086"
},
{
"key": "influx_measurement",
"namespace": "go_options",
"type": "STRING",
"value": "go_batch_cogbk_1"
},
{
"key": "input_options",
"namespace": "go_options",
"type": "STRING",
"value": "{\"num_records\": 20000000,\"key_size\": 10,\"value_size\": 90,\"num_hot_keys\": 1,\"hot_key_fraction\": 1}"
}
],
"options": {
"experiments": [
"use_unified_****",
"use_portable_job_submission",
"beam_fn_api"
],
"pipelineUrl": "gs://temp-storage-for-perf-tests/loadtests/go-1-1650790785940167577/model",
"region": "us-central1",
"tempLocation": "gs://temp-storage-for-perf-tests/loadtests"
},
"beam:option:go_options:v1": {
"options": {
"co_input_options": "{\"num_records\": 2000000,\"key_size\": 10,\"value_size\": 90,\"num_hot_keys\": 1000,\"hot_key_fraction\": 1}",
"hookOrder": "[\"default_remote_logging\"]",
"hooks": "{\"default_remote_logging\":null}",
"influx_db_name": "beam_test_metrics",
"influx_hostname": "http://10.128.0.96:8086",
"influx_measurement": "go_batch_cogbk_1",
"influx_namespace": "dataflow",
"input_options": "{\"num_records\": 20000000,\"key_size\": 10,\"value_size\": 90,\"num_hot_keys\": 1,\"hot_key_fraction\": 1}",
"iterations": "1",
"****_binary": "linux_amd64/cogbk"
}
}
},
"tempStoragePrefix": "gs://temp-storage-for-perf-tests/loadtests",
"userAgent": {
"name": "Apache Beam SDK for Go",
"version": "2.39.0.dev"
},
"version": {
"job_type": "FNAPI_BATCH",
"major": "6"
},
"****Pools": [
{
"autoscalingSettings": {
"algorithm": "AUTOSCALING_ALGORITHM_NONE"
},
"ipConfiguration": "WORKER_IP_UNSPECIFIED",
"kind": "harness",
"numWorkers": 5,
"packages": [
{
"location": "gs://temp-storage-for-perf-tests/loadtests/go-1-1650790785940167577/****",
"name": "****"
}
],
"sdkHarnessContainerImages": [
{
"containerImage": "apache/beam_go_sdk:2.39.0.dev"
}
],
"****HarnessContainerImage": "apache/beam_go_sdk:2.39.0.dev"
}
]
},
"name": "load-tests-go-dataflow-batch-cogbk-1-0424065639",
"projectId": "apache-beam-testing",
"type": "JOB_TYPE_BATCH"
}
2022/04/24 08:59:47 Submitted job: 2022-04-24_01_59_46-18000985266353785506
2022/04/24 08:59:47 Console: https://console.cloud.google.com/dataflow/jobs/us-central1/2022-04-24_01_59_46-18000985266353785506?project=apache-beam-testing
2022/04/24 08:59:47 Logs: https://console.cloud.google.com/logs/viewer?project=apache-beam-testing&resource=dataflow_step%2Fjob_id%2F2022-04-24_01_59_46-18000985266353785506
2022/04/24 08:59:47 Job state: JOB_STATE_PENDING ...
2022/04/24 09:00:17 Job still running ...
2022/04/24 09:00:47 Job still running ...
2022/04/24 09:01:17 Job still running ...
2022/04/24 09:01:47 Job still running ...
2022/04/24 09:02:17 Job still running ...
2022/04/24 09:02:47 Failed to execute job: job 2022-04-24_01_59_46-18000985266353785506 failed
panic: Failed to execute job: job 2022-04-24_01_59_46-18000985266353785506 failed
goroutine 1 [running]:
github.com/apache/beam/sdks/v2/go/pkg/beam/log.Fatalf(0x1203148, 0xc0000480c0, 0x10e1911, 0x19, 0xc00042de68, 0x1, 0x1)
<https://ci-beam.apache.org/job/beam_LoadTests_Go_CoGBK_Dataflow_batch/ws/src/sdks/go/pkg/beam/log/log.go>:153 +0xec
main.main()
<https://ci-beam.apache.org/job/beam_LoadTests_Go_CoGBK_Dataflow_batch/ws/src/sdks/go/test/load/cogbk/cogbk.go>:99 +0x52a
> Task :sdks:go:test:load:run FAILED
FAILURE: Build failed with an exception.
* Where:
Build file '<https://ci-beam.apache.org/job/beam_LoadTests_Go_CoGBK_Dataflow_batch/ws/src/sdks/go/test/load/build.gradle'> line: 31
* What went wrong:
Execution failed for task ':sdks:go:test:load:run'.
> Process 'command 'sh'' finished with non-zero exit value 2
* Try:
> Run with --stacktrace option to get the stack trace.
> Run with --info or --debug option to get more log output.
> Run with --scan to get full insights.
* Get more help at https://help.gradle.org
BUILD FAILED in 3m 18s
12 actionable tasks: 6 executed, 4 from cache, 2 up-to-date
Publishing build scan...
https://gradle.com/s/rifsgv5bqkxxq
Build step 'Invoke Gradle script' changed build result to FAILURE
Build step 'Invoke Gradle script' marked build as failure
---------------------------------------------------------------------
To unsubscribe, e-mail: builds-unsubscribe@beam.apache.org
For additional commands, e-mail: builds-help@beam.apache.org
Build failed in Jenkins: beam_LoadTests_Go_CoGBK_Dataflow_batch #488
Posted by Apache Jenkins Server <je...@builds.apache.org>.
See <https://ci-beam.apache.org/job/beam_LoadTests_Go_CoGBK_Dataflow_batch/488/display/redirect?page=changes>
Changes:
[Andrew Pilloud] [BEAM-14321] SQL passes Null for Null aggregates
[noreply] Create apache-hop-with-dataflow.md
[noreply] Add files via upload
[noreply] Delete website/www/site/content/en/blog/apache-hop-with-dataflow
[noreply] Add files via upload
[Andrew Pilloud] [BEAM-14348] Upgrade to ZetaSQL 2022.04.1
[Andrew Pilloud] [BEAM-13735] Enable ZetaSQL tests for Java 17
[noreply] Update apache-hop-with-dataflow.md
[noreply] Update apache-hop-with-dataflow.md
[noreply] Update apache-hop-with-dataflow.md
[danielamartinmtz] Moved up get-credentials instruction for getting the kubeconfig file
[noreply] [BEAM-13657] Add python 3.6 update to CHANGES.md (#17435)
[noreply] Merge pull request #17438: [BEAM-8127] The GCP module to declare
[noreply] Merge pull request #17428: [BEAM-14326] Make sure BigQuery daemon thread
[noreply] [BEAM-14301] Add lint:ignore to noescape() func (#17355)
[noreply] [BEAM-14286] Remove unused vars in harness package (#17392)
[noreply] [BEAM-14327] Convert Results to QueryResults directly (#17398)
[noreply] [BEAM-14302] Simplify boolean check in fn.go (#17399)
[noreply] [BEAM-13983] Sklearn Loader for RunInference (#17368)
[noreply] Update authors.yml
[noreply] [BEAM-14358] add retry to connect to testcontainer (#17449)
[noreply] [BEAM-13106] Bump flink docs to 1.14 (#17430)
------------------------------------------
[...truncated 25.05 KB...]
capabilities: "beam:protocol:progress_reporting:v0"
capabilities: "beam:protocol:multi_core_bundle_processing:v1"
capabilities: "beam:version:sdk_base:go"
capabilities: "beam:coder:bytes:v1"
capabilities: "beam:coder:bool:v1"
capabilities: "beam:coder:varint:v1"
capabilities: "beam:coder:double:v1"
capabilities: "beam:coder:string_utf8:v1"
capabilities: "beam:coder:length_prefix:v1"
capabilities: "beam:coder:kv:v1"
capabilities: "beam:coder:iterable:v1"
capabilities: "beam:coder:state_backed_iterable:v1"
capabilities: "beam:coder:windowed_value:v1"
capabilities: "beam:coder:global_window:v1"
capabilities: "beam:coder:interval_window:v1"
capabilities: "beam:coder:row:v1"
capabilities: "beam:coder:nullable:v1"
dependencies: <
type_urn: "beam:artifact:type:url:v1"
type_payload: "\nJgs://temp-storage-for-perf-tests/loadtests/go-1-1650704394876246636/****\022@e6209095f34db620fc8140bde17e4628c948ceab23d48878c7458c187955c70e"
role_urn: "beam:artifact:role:go_****_binary:v1"
>
>
>
>
root_transform_ids: "s1"
root_transform_ids: "s2"
root_transform_ids: "e8"
root_transform_ids: "e4"
root_transform_ids: "e9_cogbk"
root_transform_ids: "e10"
root_transform_ids: "e11"
requirements: "beam:requirement:pardo:splittable_dofn:v1"
2022/04/23 08:59:55 Staged model pipeline: gs://temp-storage-for-perf-tests/loadtests/go-1-1650704394876246636/model
2022/04/23 08:59:55 {
"environment": {
"experiments": [
"use_unified_****",
"use_portable_job_submission",
"beam_fn_api"
],
"sdkPipelineOptions": {
"display_data": [
{
"key": "name",
"namespace": "options",
"type": "STRING",
"value": "load-tests-go-dataflow-batch-cogbk-1-0423065638"
},
{
"key": "experiments",
"namespace": "options",
"type": "STRING",
"value": "use_unified_****,use_portable_job_submission"
},
{
"key": "project",
"namespace": "options",
"type": "STRING",
"value": "apache-beam-testing"
},
{
"key": "region",
"namespace": "options",
"type": "STRING",
"value": "us-central1"
},
{
"key": "container_images",
"namespace": "options",
"type": "STRING",
"value": "apache/beam_go_sdk:2.39.0.dev"
},
{
"key": "temp_location",
"namespace": "options",
"type": "STRING",
"value": "gs://temp-storage-for-perf-tests/loadtests"
},
{
"key": "iterations",
"namespace": "go_options",
"type": "STRING",
"value": "1"
},
{
"key": "hooks",
"namespace": "go_options",
"type": "STRING",
"value": "{\"default_remote_logging\":null}"
},
{
"key": "influx_hostname",
"namespace": "go_options",
"type": "STRING",
"value": "http://10.128.0.96:8086"
},
{
"key": "influx_namespace",
"namespace": "go_options",
"type": "STRING",
"value": "dataflow"
},
{
"key": "****_binary",
"namespace": "go_options",
"type": "STRING",
"value": "linux_amd64/cogbk"
},
{
"key": "co_input_options",
"namespace": "go_options",
"type": "STRING",
"value": "{\"num_records\": 2000000,\"key_size\": 10,\"value_size\": 90,\"num_hot_keys\": 1000,\"hot_key_fraction\": 1}"
},
{
"key": "input_options",
"namespace": "go_options",
"type": "STRING",
"value": "{\"num_records\": 20000000,\"key_size\": 10,\"value_size\": 90,\"num_hot_keys\": 1,\"hot_key_fraction\": 1}"
},
{
"key": "influx_measurement",
"namespace": "go_options",
"type": "STRING",
"value": "go_batch_cogbk_1"
},
{
"key": "hookOrder",
"namespace": "go_options",
"type": "STRING",
"value": "[\"default_remote_logging\"]"
},
{
"key": "influx_db_name",
"namespace": "go_options",
"type": "STRING",
"value": "beam_test_metrics"
}
],
"options": {
"experiments": [
"use_unified_****",
"use_portable_job_submission",
"beam_fn_api"
],
"pipelineUrl": "gs://temp-storage-for-perf-tests/loadtests/go-1-1650704394876246636/model",
"region": "us-central1",
"tempLocation": "gs://temp-storage-for-perf-tests/loadtests"
},
"beam:option:go_options:v1": {
"options": {
"co_input_options": "{\"num_records\": 2000000,\"key_size\": 10,\"value_size\": 90,\"num_hot_keys\": 1000,\"hot_key_fraction\": 1}",
"hookOrder": "[\"default_remote_logging\"]",
"hooks": "{\"default_remote_logging\":null}",
"influx_db_name": "beam_test_metrics",
"influx_hostname": "http://10.128.0.96:8086",
"influx_measurement": "go_batch_cogbk_1",
"influx_namespace": "dataflow",
"input_options": "{\"num_records\": 20000000,\"key_size\": 10,\"value_size\": 90,\"num_hot_keys\": 1,\"hot_key_fraction\": 1}",
"iterations": "1",
"****_binary": "linux_amd64/cogbk"
}
}
},
"tempStoragePrefix": "gs://temp-storage-for-perf-tests/loadtests",
"userAgent": {
"name": "Apache Beam SDK for Go",
"version": "2.39.0.dev"
},
"version": {
"job_type": "FNAPI_BATCH",
"major": "6"
},
"****Pools": [
{
"autoscalingSettings": {
"algorithm": "AUTOSCALING_ALGORITHM_NONE"
},
"ipConfiguration": "WORKER_IP_UNSPECIFIED",
"kind": "harness",
"numWorkers": 5,
"packages": [
{
"location": "gs://temp-storage-for-perf-tests/loadtests/go-1-1650704394876246636/****",
"name": "****"
}
],
"sdkHarnessContainerImages": [
{
"containerImage": "apache/beam_go_sdk:2.39.0.dev"
}
],
"****HarnessContainerImage": "apache/beam_go_sdk:2.39.0.dev"
}
]
},
"name": "load-tests-go-dataflow-batch-cogbk-1-0423065638",
"projectId": "apache-beam-testing",
"type": "JOB_TYPE_BATCH"
}
2022/04/23 08:59:56 Submitted job: 2022-04-23_01_59_55-1259190634671429444
2022/04/23 08:59:56 Console: https://console.cloud.google.com/dataflow/jobs/us-central1/2022-04-23_01_59_55-1259190634671429444?project=apache-beam-testing
2022/04/23 08:59:56 Logs: https://console.cloud.google.com/logs/viewer?project=apache-beam-testing&resource=dataflow_step%2Fjob_id%2F2022-04-23_01_59_55-1259190634671429444
2022/04/23 08:59:56 Job state: JOB_STATE_PENDING ...
2022/04/23 09:00:26 Job still running ...
2022/04/23 09:00:56 Job still running ...
2022/04/23 09:01:26 Job still running ...
2022/04/23 09:01:56 Job still running ...
2022/04/23 09:02:26 Job still running ...
2022/04/23 09:02:56 Job still running ...
2022/04/23 09:03:27 Job still running ...
2022/04/23 09:03:57 Job still running ...
2022/04/23 09:04:27 Job still running ...
2022/04/23 09:04:57 Failed to execute job: job 2022-04-23_01_59_55-1259190634671429444 failed
panic: Failed to execute job: job 2022-04-23_01_59_55-1259190634671429444 failed
goroutine 1 [running]:
github.com/apache/beam/sdks/v2/go/pkg/beam/log.Fatalf(0x1203148, 0xc000120000, 0x10e1911, 0x19, 0xc000761e68, 0x1, 0x1)
<https://ci-beam.apache.org/job/beam_LoadTests_Go_CoGBK_Dataflow_batch/ws/src/sdks/go/pkg/beam/log/log.go>:153 +0xec
main.main()
<https://ci-beam.apache.org/job/beam_LoadTests_Go_CoGBK_Dataflow_batch/ws/src/sdks/go/test/load/cogbk/cogbk.go>:99 +0x52a
> Task :sdks:go:test:load:run FAILED
FAILURE: Build failed with an exception.
* Where:
Build file '<https://ci-beam.apache.org/job/beam_LoadTests_Go_CoGBK_Dataflow_batch/ws/src/sdks/go/test/load/build.gradle'> line: 31
* What went wrong:
Execution failed for task ':sdks:go:test:load:run'.
> Process 'command 'sh'' finished with non-zero exit value 2
* Try:
> Run with --stacktrace option to get the stack trace.
> Run with --info or --debug option to get more log output.
> Run with --scan to get full insights.
* Get more help at https://help.gradle.org
BUILD FAILED in 5m 26s
12 actionable tasks: 6 executed, 4 from cache, 2 up-to-date
Publishing build scan...
https://gradle.com/s/jsjull36xwkpq
Build step 'Invoke Gradle script' changed build result to FAILURE
Build step 'Invoke Gradle script' marked build as failure
---------------------------------------------------------------------
To unsubscribe, e-mail: builds-unsubscribe@beam.apache.org
For additional commands, e-mail: builds-help@beam.apache.org
Build failed in Jenkins: beam_LoadTests_Go_CoGBK_Dataflow_batch #487
Posted by Apache Jenkins Server <je...@builds.apache.org>.
See <https://ci-beam.apache.org/job/beam_LoadTests_Go_CoGBK_Dataflow_batch/487/display/redirect?page=changes>
Changes:
[mmack] [BEAM-14335] Spotless Spark sources
[mmack] [BEAM-14345] Force paranamer 2.8 for Spark Hadoop version tests to avoid
[noreply] BEAM-13582 Fixing broken links in the documentation (#17300)
[kamil.bregula] Revert "[BEAM-14300] Fix Java precommit failure"
[kamil.bregula] Revert "Merge pull request #17223 from [BEAM-14215] Improve argument
[noreply] [BEAM-13657] Sunset python 3.6 (#17252)
[noreply] Removes unsupported Python 3.6 from the release validation script
[noreply] [BEAM-13984] Implement RunInference for PyTorch (#17196)
[noreply] [BEAM-13945] add json type support for java bigquery connector (#17209)
[noreply] [BEAM-14346] Fix incorrect error case index in ret2() (#17425)
[noreply] [BEAM-14342] Fix wrong default buffer type in fn_runner (#17420)
[noreply] Updates opencensus-api dependency to the latest version - 0.31.0
[noreply] [BEAM-14306] Add unit testing to pane coder (#17370)
[noreply] Updated the dep and golden for screen diff integration tests (#17442)
------------------------------------------
[...truncated 25.07 KB...]
capabilities: "beam:protocol:progress_reporting:v0"
capabilities: "beam:protocol:multi_core_bundle_processing:v1"
capabilities: "beam:version:sdk_base:go"
capabilities: "beam:coder:bytes:v1"
capabilities: "beam:coder:bool:v1"
capabilities: "beam:coder:varint:v1"
capabilities: "beam:coder:double:v1"
capabilities: "beam:coder:string_utf8:v1"
capabilities: "beam:coder:length_prefix:v1"
capabilities: "beam:coder:kv:v1"
capabilities: "beam:coder:iterable:v1"
capabilities: "beam:coder:state_backed_iterable:v1"
capabilities: "beam:coder:windowed_value:v1"
capabilities: "beam:coder:global_window:v1"
capabilities: "beam:coder:interval_window:v1"
capabilities: "beam:coder:row:v1"
capabilities: "beam:coder:nullable:v1"
dependencies: <
type_urn: "beam:artifact:type:url:v1"
type_payload: "\nJgs://temp-storage-for-perf-tests/loadtests/go-1-1650617992881443480/****\022@b564cea86b6b11f8da4718bbce66b400483fc61b63100ac92aa67265bb870222"
role_urn: "beam:artifact:role:go_****_binary:v1"
>
>
>
>
root_transform_ids: "s1"
root_transform_ids: "e4"
root_transform_ids: "s2"
root_transform_ids: "e8"
root_transform_ids: "e9_cogbk"
root_transform_ids: "e10"
root_transform_ids: "e11"
requirements: "beam:requirement:pardo:splittable_dofn:v1"
2022/04/22 08:59:53 Staged model pipeline: gs://temp-storage-for-perf-tests/loadtests/go-1-1650617992881443480/model
2022/04/22 08:59:53 {
"environment": {
"experiments": [
"use_unified_****",
"use_portable_job_submission",
"beam_fn_api"
],
"sdkPipelineOptions": {
"display_data": [
{
"key": "name",
"namespace": "options",
"type": "STRING",
"value": "load-tests-go-dataflow-batch-cogbk-1-0422065644"
},
{
"key": "experiments",
"namespace": "options",
"type": "STRING",
"value": "use_unified_****,use_portable_job_submission"
},
{
"key": "project",
"namespace": "options",
"type": "STRING",
"value": "apache-beam-testing"
},
{
"key": "region",
"namespace": "options",
"type": "STRING",
"value": "us-central1"
},
{
"key": "container_images",
"namespace": "options",
"type": "STRING",
"value": "apache/beam_go_sdk:2.39.0.dev"
},
{
"key": "temp_location",
"namespace": "options",
"type": "STRING",
"value": "gs://temp-storage-for-perf-tests/loadtests"
},
{
"key": "hooks",
"namespace": "go_options",
"type": "STRING",
"value": "{\"default_remote_logging\":null}"
},
{
"key": "****_binary",
"namespace": "go_options",
"type": "STRING",
"value": "linux_amd64/cogbk"
},
{
"key": "influx_hostname",
"namespace": "go_options",
"type": "STRING",
"value": "http://10.128.0.96:8086"
},
{
"key": "input_options",
"namespace": "go_options",
"type": "STRING",
"value": "{\"num_records\": 20000000,\"key_size\": 10,\"value_size\": 90,\"num_hot_keys\": 1,\"hot_key_fraction\": 1}"
},
{
"key": "hookOrder",
"namespace": "go_options",
"type": "STRING",
"value": "[\"default_remote_logging\"]"
},
{
"key": "influx_db_name",
"namespace": "go_options",
"type": "STRING",
"value": "beam_test_metrics"
},
{
"key": "influx_measurement",
"namespace": "go_options",
"type": "STRING",
"value": "go_batch_cogbk_1"
},
{
"key": "iterations",
"namespace": "go_options",
"type": "STRING",
"value": "1"
},
{
"key": "co_input_options",
"namespace": "go_options",
"type": "STRING",
"value": "{\"num_records\": 2000000,\"key_size\": 10,\"value_size\": 90,\"num_hot_keys\": 1000,\"hot_key_fraction\": 1}"
},
{
"key": "influx_namespace",
"namespace": "go_options",
"type": "STRING",
"value": "dataflow"
}
],
"options": {
"experiments": [
"use_unified_****",
"use_portable_job_submission",
"beam_fn_api"
],
"pipelineUrl": "gs://temp-storage-for-perf-tests/loadtests/go-1-1650617992881443480/model",
"region": "us-central1",
"tempLocation": "gs://temp-storage-for-perf-tests/loadtests"
},
"beam:option:go_options:v1": {
"options": {
"co_input_options": "{\"num_records\": 2000000,\"key_size\": 10,\"value_size\": 90,\"num_hot_keys\": 1000,\"hot_key_fraction\": 1}",
"hookOrder": "[\"default_remote_logging\"]",
"hooks": "{\"default_remote_logging\":null}",
"influx_db_name": "beam_test_metrics",
"influx_hostname": "http://10.128.0.96:8086",
"influx_measurement": "go_batch_cogbk_1",
"influx_namespace": "dataflow",
"input_options": "{\"num_records\": 20000000,\"key_size\": 10,\"value_size\": 90,\"num_hot_keys\": 1,\"hot_key_fraction\": 1}",
"iterations": "1",
"****_binary": "linux_amd64/cogbk"
}
}
},
"tempStoragePrefix": "gs://temp-storage-for-perf-tests/loadtests",
"userAgent": {
"name": "Apache Beam SDK for Go",
"version": "2.39.0.dev"
},
"version": {
"job_type": "FNAPI_BATCH",
"major": "6"
},
"****Pools": [
{
"autoscalingSettings": {
"algorithm": "AUTOSCALING_ALGORITHM_NONE"
},
"ipConfiguration": "WORKER_IP_UNSPECIFIED",
"kind": "harness",
"numWorkers": 5,
"packages": [
{
"location": "gs://temp-storage-for-perf-tests/loadtests/go-1-1650617992881443480/****",
"name": "****"
}
],
"sdkHarnessContainerImages": [
{
"containerImage": "apache/beam_go_sdk:2.39.0.dev"
}
],
"****HarnessContainerImage": "apache/beam_go_sdk:2.39.0.dev"
}
]
},
"name": "load-tests-go-dataflow-batch-cogbk-1-0422065644",
"projectId": "apache-beam-testing",
"type": "JOB_TYPE_BATCH"
}
2022/04/22 08:59:54 Submitted job: 2022-04-22_01_59_53-16836000842276181880
2022/04/22 08:59:54 Console: https://console.cloud.google.com/dataflow/jobs/us-central1/2022-04-22_01_59_53-16836000842276181880?project=apache-beam-testing
2022/04/22 08:59:54 Logs: https://console.cloud.google.com/logs/viewer?project=apache-beam-testing&resource=dataflow_step%2Fjob_id%2F2022-04-22_01_59_53-16836000842276181880
2022/04/22 08:59:54 Job state: JOB_STATE_PENDING ...
2022/04/22 09:00:24 Job still running ...
2022/04/22 09:00:54 Job still running ...
2022/04/22 09:01:24 Job still running ...
2022/04/22 09:01:54 Job still running ...
2022/04/22 09:02:24 Job still running ...
2022/04/22 09:02:54 Job still running ...
2022/04/22 09:03:24 Job still running ...
2022/04/22 09:03:54 Job still running ...
2022/04/22 09:04:24 Job still running ...
2022/04/22 09:04:55 Failed to execute job: job 2022-04-22_01_59_53-16836000842276181880 failed
panic: Failed to execute job: job 2022-04-22_01_59_53-16836000842276181880 failed
goroutine 1 [running]:
github.com/apache/beam/sdks/v2/go/pkg/beam/log.Fatalf(0x1203188, 0xc00019a000, 0x10e1911, 0x19, 0xc0003d5df0, 0x1, 0x1)
<https://ci-beam.apache.org/job/beam_LoadTests_Go_CoGBK_Dataflow_batch/ws/src/sdks/go/pkg/beam/log/log.go>:153 +0xec
main.main()
<https://ci-beam.apache.org/job/beam_LoadTests_Go_CoGBK_Dataflow_batch/ws/src/sdks/go/test/load/cogbk/cogbk.go>:99 +0x52a
> Task :sdks:go:test:load:run FAILED
FAILURE: Build failed with an exception.
* Where:
Build file '<https://ci-beam.apache.org/job/beam_LoadTests_Go_CoGBK_Dataflow_batch/ws/src/sdks/go/test/load/build.gradle'> line: 31
* What went wrong:
Execution failed for task ':sdks:go:test:load:run'.
> Process 'command 'sh'' finished with non-zero exit value 2
* Try:
> Run with --stacktrace option to get the stack trace.
> Run with --info or --debug option to get more log output.
> Run with --scan to get full insights.
* Get more help at https://help.gradle.org
BUILD FAILED in 5m 25s
12 actionable tasks: 6 executed, 4 from cache, 2 up-to-date
Publishing build scan...
https://gradle.com/s/pzwke5uu7n7m4
Build step 'Invoke Gradle script' changed build result to FAILURE
Build step 'Invoke Gradle script' marked build as failure
---------------------------------------------------------------------
To unsubscribe, e-mail: builds-unsubscribe@beam.apache.org
For additional commands, e-mail: builds-help@beam.apache.org
Build failed in Jenkins: beam_LoadTests_Go_CoGBK_Dataflow_batch #486
Posted by Apache Jenkins Server <je...@builds.apache.org>.
See <https://ci-beam.apache.org/job/beam_LoadTests_Go_CoGBK_Dataflow_batch/486/display/redirect?page=changes>
Changes:
[vachan] Annotating Read API tests.
[bulat.safiullin] [BEAM-14247] [Website] add image
[bulat.safiullin] [BEAM-14247] [Website] center image
[mattcasters] BEAM-1857 : CHANGES.md entry for 2.38.0
[mmack] [BEAM-14323] Improve IDE integration of Spark cross version builds
[noreply] [BEAM-14112] Fixed ReadFromBigQuery with Interactive Beam (#17306)
[noreply] Update .asf.yaml (#17409)
[noreply] [BEAM-14336] Sickbay flight delays test - dataset seems to be missing
[noreply] [BEAM-14338] Update watermark unit tests to use time.Time.Equals()
[noreply] [BEAM-14328] Tweaks to "Differences from pandas" page (#17413)
[Andrew Pilloud] [BEAM-14253] Disable broken test pending Dataflow fix
[yiru] fix: BigQuery Storage Connector trace id population missing bracket
[noreply] [BEAM-14330] Temporarily disable the clusters auto-cleanup (#17400)
[noreply] Update Beam website to release 2.38.0 (#17378)
[noreply] [BEAM-14213] Add API and construction time validation for Batched DoFns
[noreply] Minor: Update release guide regarding archive.apache.org (#17419)
[noreply] [BEAM-14017] beam_PreCommit_CommunityMetrics_Cron test failing (#17396)
------------------------------------------
[...truncated 24.91 KB...]
key: "go"
value: <
urn: "beam:env:docker:v1"
payload: "\n\035apache/beam_go_sdk:2.39.0.dev"
capabilities: "beam:protocol:progress_reporting:v0"
capabilities: "beam:protocol:multi_core_bundle_processing:v1"
capabilities: "beam:version:sdk_base:go"
capabilities: "beam:coder:bytes:v1"
capabilities: "beam:coder:bool:v1"
capabilities: "beam:coder:varint:v1"
capabilities: "beam:coder:double:v1"
capabilities: "beam:coder:string_utf8:v1"
capabilities: "beam:coder:length_prefix:v1"
capabilities: "beam:coder:kv:v1"
capabilities: "beam:coder:iterable:v1"
capabilities: "beam:coder:state_backed_iterable:v1"
capabilities: "beam:coder:windowed_value:v1"
capabilities: "beam:coder:global_window:v1"
capabilities: "beam:coder:interval_window:v1"
capabilities: "beam:coder:row:v1"
capabilities: "beam:coder:nullable:v1"
dependencies: <
type_urn: "beam:artifact:type:url:v1"
type_payload: "\nJgs://temp-storage-for-perf-tests/loadtests/go-1-1650531581723277201/****\022@9c4dd5527024d5f3512519808676e0d17616c5558ef5f9bc0f849c69762e3320"
role_urn: "beam:artifact:role:go_****_binary:v1"
>
>
>
>
root_transform_ids: "s2"
root_transform_ids: "s1"
root_transform_ids: "e4"
root_transform_ids: "e8"
root_transform_ids: "e9_cogbk"
root_transform_ids: "e10"
root_transform_ids: "e11"
requirements: "beam:requirement:pardo:splittable_dofn:v1"
2022/04/21 08:59:42 Staged model pipeline: gs://temp-storage-for-perf-tests/loadtests/go-1-1650531581723277201/model
2022/04/21 08:59:42 {
"environment": {
"experiments": [
"use_unified_****",
"use_portable_job_submission",
"beam_fn_api"
],
"sdkPipelineOptions": {
"display_data": [
{
"key": "name",
"namespace": "options",
"type": "STRING",
"value": "load-tests-go-dataflow-batch-cogbk-1-0421065624"
},
{
"key": "experiments",
"namespace": "options",
"type": "STRING",
"value": "use_unified_****,use_portable_job_submission"
},
{
"key": "project",
"namespace": "options",
"type": "STRING",
"value": "apache-beam-testing"
},
{
"key": "region",
"namespace": "options",
"type": "STRING",
"value": "us-central1"
},
{
"key": "container_images",
"namespace": "options",
"type": "STRING",
"value": "apache/beam_go_sdk:2.39.0.dev"
},
{
"key": "temp_location",
"namespace": "options",
"type": "STRING",
"value": "gs://temp-storage-for-perf-tests/loadtests"
},
{
"key": "iterations",
"namespace": "go_options",
"type": "STRING",
"value": "1"
},
{
"key": "hooks",
"namespace": "go_options",
"type": "STRING",
"value": "{\"default_remote_logging\":null}"
},
{
"key": "hookOrder",
"namespace": "go_options",
"type": "STRING",
"value": "[\"default_remote_logging\"]"
},
{
"key": "influx_db_name",
"namespace": "go_options",
"type": "STRING",
"value": "beam_test_metrics"
},
{
"key": "influx_hostname",
"namespace": "go_options",
"type": "STRING",
"value": "http://10.128.0.96:8086"
},
{
"key": "influx_namespace",
"namespace": "go_options",
"type": "STRING",
"value": "dataflow"
},
{
"key": "****_binary",
"namespace": "go_options",
"type": "STRING",
"value": "linux_amd64/cogbk"
},
{
"key": "co_input_options",
"namespace": "go_options",
"type": "STRING",
"value": "{\"num_records\": 2000000,\"key_size\": 10,\"value_size\": 90,\"num_hot_keys\": 1000,\"hot_key_fraction\": 1}"
},
{
"key": "influx_measurement",
"namespace": "go_options",
"type": "STRING",
"value": "go_batch_cogbk_1"
},
{
"key": "input_options",
"namespace": "go_options",
"type": "STRING",
"value": "{\"num_records\": 20000000,\"key_size\": 10,\"value_size\": 90,\"num_hot_keys\": 1,\"hot_key_fraction\": 1}"
}
],
"options": {
"experiments": [
"use_unified_****",
"use_portable_job_submission",
"beam_fn_api"
],
"pipelineUrl": "gs://temp-storage-for-perf-tests/loadtests/go-1-1650531581723277201/model",
"region": "us-central1",
"tempLocation": "gs://temp-storage-for-perf-tests/loadtests"
},
"beam:option:go_options:v1": {
"options": {
"co_input_options": "{\"num_records\": 2000000,\"key_size\": 10,\"value_size\": 90,\"num_hot_keys\": 1000,\"hot_key_fraction\": 1}",
"hookOrder": "[\"default_remote_logging\"]",
"hooks": "{\"default_remote_logging\":null}",
"influx_db_name": "beam_test_metrics",
"influx_hostname": "http://10.128.0.96:8086",
"influx_measurement": "go_batch_cogbk_1",
"influx_namespace": "dataflow",
"input_options": "{\"num_records\": 20000000,\"key_size\": 10,\"value_size\": 90,\"num_hot_keys\": 1,\"hot_key_fraction\": 1}",
"iterations": "1",
"****_binary": "linux_amd64/cogbk"
}
}
},
"tempStoragePrefix": "gs://temp-storage-for-perf-tests/loadtests",
"userAgent": {
"name": "Apache Beam SDK for Go",
"version": "2.39.0.dev"
},
"version": {
"job_type": "FNAPI_BATCH",
"major": "6"
},
"****Pools": [
{
"autoscalingSettings": {
"algorithm": "AUTOSCALING_ALGORITHM_NONE"
},
"ipConfiguration": "WORKER_IP_UNSPECIFIED",
"kind": "harness",
"numWorkers": 5,
"packages": [
{
"location": "gs://temp-storage-for-perf-tests/loadtests/go-1-1650531581723277201/****",
"name": "****"
}
],
"sdkHarnessContainerImages": [
{
"containerImage": "apache/beam_go_sdk:2.39.0.dev"
}
],
"****HarnessContainerImage": "apache/beam_go_sdk:2.39.0.dev"
}
]
},
"name": "load-tests-go-dataflow-batch-cogbk-1-0421065624",
"projectId": "apache-beam-testing",
"type": "JOB_TYPE_BATCH"
}
2022/04/21 08:59:42 Submitted job: 2022-04-21_01_59_42-8330691779526288329
2022/04/21 08:59:42 Console: https://console.cloud.google.com/dataflow/jobs/us-central1/2022-04-21_01_59_42-8330691779526288329?project=apache-beam-testing
2022/04/21 08:59:42 Logs: https://console.cloud.google.com/logs/viewer?project=apache-beam-testing&resource=dataflow_step%2Fjob_id%2F2022-04-21_01_59_42-8330691779526288329
2022/04/21 08:59:42 Job state: JOB_STATE_PENDING ...
2022/04/21 09:00:12 Job still running ...
2022/04/21 09:00:42 Job still running ...
2022/04/21 09:01:13 Job still running ...
2022/04/21 09:01:43 Job still running ...
2022/04/21 09:02:13 Job still running ...
2022/04/21 09:02:43 Failed to execute job: job 2022-04-21_01_59_42-8330691779526288329 failed
panic: Failed to execute job: job 2022-04-21_01_59_42-8330691779526288329 failed
goroutine 1 [running]:
github.com/apache/beam/sdks/v2/go/pkg/beam/log.Fatalf(0x1203108, 0xc0000480c0, 0x10e1911, 0x19, 0xc00035fdf0, 0x1, 0x1)
<https://ci-beam.apache.org/job/beam_LoadTests_Go_CoGBK_Dataflow_batch/ws/src/sdks/go/pkg/beam/log/log.go>:153 +0xec
main.main()
<https://ci-beam.apache.org/job/beam_LoadTests_Go_CoGBK_Dataflow_batch/ws/src/sdks/go/test/load/cogbk/cogbk.go>:99 +0x52a
> Task :sdks:go:test:load:run FAILED
FAILURE: Build failed with an exception.
* Where:
Build file '<https://ci-beam.apache.org/job/beam_LoadTests_Go_CoGBK_Dataflow_batch/ws/src/sdks/go/test/load/build.gradle'> line: 31
* What went wrong:
Execution failed for task ':sdks:go:test:load:run'.
> Process 'command 'sh'' finished with non-zero exit value 2
* Try:
> Run with --stacktrace option to get the stack trace.
> Run with --info or --debug option to get more log output.
> Run with --scan to get full insights.
* Get more help at https://help.gradle.org
BUILD FAILED in 3m 11s
12 actionable tasks: 6 executed, 4 from cache, 2 up-to-date
Publishing build scan...
https://gradle.com/s/56hlf6y3nqvh2
Build step 'Invoke Gradle script' changed build result to FAILURE
Build step 'Invoke Gradle script' marked build as failure
---------------------------------------------------------------------
To unsubscribe, e-mail: builds-unsubscribe@beam.apache.org
For additional commands, e-mail: builds-help@beam.apache.org
Build failed in Jenkins: beam_LoadTests_Go_CoGBK_Dataflow_batch #485
Posted by Apache Jenkins Server <je...@builds.apache.org>.
See <https://ci-beam.apache.org/job/beam_LoadTests_Go_CoGBK_Dataflow_batch/485/display/redirect?page=changes>
Changes:
[andyye333] Change func to PTransform
[noreply] Populate actual dataflow job id to bigquery write trace id (#17130)
[relax] mark static thread as a daemon thread
[noreply] [BEAM-13866] Add miscellaneous exec unit tests (#17363)
------------------------------------------
[...truncated 24.98 KB...]
key: "go"
value: <
urn: "beam:env:docker:v1"
payload: "\n\035apache/beam_go_sdk:2.39.0.dev"
capabilities: "beam:protocol:progress_reporting:v0"
capabilities: "beam:protocol:multi_core_bundle_processing:v1"
capabilities: "beam:version:sdk_base:go"
capabilities: "beam:coder:bytes:v1"
capabilities: "beam:coder:bool:v1"
capabilities: "beam:coder:varint:v1"
capabilities: "beam:coder:double:v1"
capabilities: "beam:coder:string_utf8:v1"
capabilities: "beam:coder:length_prefix:v1"
capabilities: "beam:coder:kv:v1"
capabilities: "beam:coder:iterable:v1"
capabilities: "beam:coder:state_backed_iterable:v1"
capabilities: "beam:coder:windowed_value:v1"
capabilities: "beam:coder:global_window:v1"
capabilities: "beam:coder:interval_window:v1"
capabilities: "beam:coder:row:v1"
capabilities: "beam:coder:nullable:v1"
dependencies: <
type_urn: "beam:artifact:type:url:v1"
type_payload: "\nJgs://temp-storage-for-perf-tests/loadtests/go-1-1650445190532782321/****\022@9c4dd5527024d5f3512519808676e0d17616c5558ef5f9bc0f849c69762e3320"
role_urn: "beam:artifact:role:go_****_binary:v1"
>
>
>
>
root_transform_ids: "s1"
root_transform_ids: "s2"
root_transform_ids: "e8"
root_transform_ids: "e4"
root_transform_ids: "e9_cogbk"
root_transform_ids: "e10"
root_transform_ids: "e11"
requirements: "beam:requirement:pardo:splittable_dofn:v1"
2022/04/20 08:59:51 Staged model pipeline: gs://temp-storage-for-perf-tests/loadtests/go-1-1650445190532782321/model
2022/04/20 08:59:51 {
"environment": {
"experiments": [
"use_unified_****",
"use_portable_job_submission",
"beam_fn_api"
],
"sdkPipelineOptions": {
"display_data": [
{
"key": "name",
"namespace": "options",
"type": "STRING",
"value": "load-tests-go-dataflow-batch-cogbk-1-0420065649"
},
{
"key": "experiments",
"namespace": "options",
"type": "STRING",
"value": "use_unified_****,use_portable_job_submission"
},
{
"key": "project",
"namespace": "options",
"type": "STRING",
"value": "apache-beam-testing"
},
{
"key": "region",
"namespace": "options",
"type": "STRING",
"value": "us-central1"
},
{
"key": "container_images",
"namespace": "options",
"type": "STRING",
"value": "apache/beam_go_sdk:2.39.0.dev"
},
{
"key": "temp_location",
"namespace": "options",
"type": "STRING",
"value": "gs://temp-storage-for-perf-tests/loadtests"
},
{
"key": "influx_namespace",
"namespace": "go_options",
"type": "STRING",
"value": "dataflow"
},
{
"key": "****_binary",
"namespace": "go_options",
"type": "STRING",
"value": "linux_amd64/cogbk"
},
{
"key": "hookOrder",
"namespace": "go_options",
"type": "STRING",
"value": "[\"default_remote_logging\"]"
},
{
"key": "co_input_options",
"namespace": "go_options",
"type": "STRING",
"value": "{\"num_records\": 2000000,\"key_size\": 10,\"value_size\": 90,\"num_hot_keys\": 1000,\"hot_key_fraction\": 1}"
},
{
"key": "influx_db_name",
"namespace": "go_options",
"type": "STRING",
"value": "beam_test_metrics"
},
{
"key": "influx_hostname",
"namespace": "go_options",
"type": "STRING",
"value": "http://10.128.0.96:8086"
},
{
"key": "influx_measurement",
"namespace": "go_options",
"type": "STRING",
"value": "go_batch_cogbk_1"
},
{
"key": "input_options",
"namespace": "go_options",
"type": "STRING",
"value": "{\"num_records\": 20000000,\"key_size\": 10,\"value_size\": 90,\"num_hot_keys\": 1,\"hot_key_fraction\": 1}"
},
{
"key": "iterations",
"namespace": "go_options",
"type": "STRING",
"value": "1"
},
{
"key": "hooks",
"namespace": "go_options",
"type": "STRING",
"value": "{\"default_remote_logging\":null}"
}
],
"options": {
"experiments": [
"use_unified_****",
"use_portable_job_submission",
"beam_fn_api"
],
"pipelineUrl": "gs://temp-storage-for-perf-tests/loadtests/go-1-1650445190532782321/model",
"region": "us-central1",
"tempLocation": "gs://temp-storage-for-perf-tests/loadtests"
},
"beam:option:go_options:v1": {
"options": {
"co_input_options": "{\"num_records\": 2000000,\"key_size\": 10,\"value_size\": 90,\"num_hot_keys\": 1000,\"hot_key_fraction\": 1}",
"hookOrder": "[\"default_remote_logging\"]",
"hooks": "{\"default_remote_logging\":null}",
"influx_db_name": "beam_test_metrics",
"influx_hostname": "http://10.128.0.96:8086",
"influx_measurement": "go_batch_cogbk_1",
"influx_namespace": "dataflow",
"input_options": "{\"num_records\": 20000000,\"key_size\": 10,\"value_size\": 90,\"num_hot_keys\": 1,\"hot_key_fraction\": 1}",
"iterations": "1",
"****_binary": "linux_amd64/cogbk"
}
}
},
"tempStoragePrefix": "gs://temp-storage-for-perf-tests/loadtests",
"userAgent": {
"name": "Apache Beam SDK for Go",
"version": "2.39.0.dev"
},
"version": {
"job_type": "FNAPI_BATCH",
"major": "6"
},
"****Pools": [
{
"autoscalingSettings": {
"algorithm": "AUTOSCALING_ALGORITHM_NONE"
},
"ipConfiguration": "WORKER_IP_UNSPECIFIED",
"kind": "harness",
"numWorkers": 5,
"packages": [
{
"location": "gs://temp-storage-for-perf-tests/loadtests/go-1-1650445190532782321/****",
"name": "****"
}
],
"sdkHarnessContainerImages": [
{
"containerImage": "apache/beam_go_sdk:2.39.0.dev"
}
],
"****HarnessContainerImage": "apache/beam_go_sdk:2.39.0.dev"
}
]
},
"name": "load-tests-go-dataflow-batch-cogbk-1-0420065649",
"projectId": "apache-beam-testing",
"type": "JOB_TYPE_BATCH"
}
2022/04/20 08:59:51 Submitted job: 2022-04-20_01_59_51-5299180278738528633
2022/04/20 08:59:51 Console: https://console.cloud.google.com/dataflow/jobs/us-central1/2022-04-20_01_59_51-5299180278738528633?project=apache-beam-testing
2022/04/20 08:59:51 Logs: https://console.cloud.google.com/logs/viewer?project=apache-beam-testing&resource=dataflow_step%2Fjob_id%2F2022-04-20_01_59_51-5299180278738528633
2022/04/20 08:59:51 Job state: JOB_STATE_PENDING ...
2022/04/20 09:00:21 Job still running ...
2022/04/20 09:00:51 Job still running ...
2022/04/20 09:01:21 Job still running ...
2022/04/20 09:01:51 Job still running ...
2022/04/20 09:02:21 Job still running ...
2022/04/20 09:02:52 Failed to execute job: job 2022-04-20_01_59_51-5299180278738528633 failed
panic: Failed to execute job: job 2022-04-20_01_59_51-5299180278738528633 failed
goroutine 1 [running]:
github.com/apache/beam/sdks/v2/go/pkg/beam/log.Fatalf(0x1203108, 0xc0000480c0, 0x10e1911, 0x19, 0xc00055ddf0, 0x1, 0x1)
<https://ci-beam.apache.org/job/beam_LoadTests_Go_CoGBK_Dataflow_batch/ws/src/sdks/go/pkg/beam/log/log.go>:153 +0xec
main.main()
<https://ci-beam.apache.org/job/beam_LoadTests_Go_CoGBK_Dataflow_batch/ws/src/sdks/go/test/load/cogbk/cogbk.go>:99 +0x52a
> Task :sdks:go:test:load:run FAILED
FAILURE: Build failed with an exception.
* Where:
Build file '<https://ci-beam.apache.org/job/beam_LoadTests_Go_CoGBK_Dataflow_batch/ws/src/sdks/go/test/load/build.gradle'> line: 31
* What went wrong:
Execution failed for task ':sdks:go:test:load:run'.
> Process 'command 'sh'' finished with non-zero exit value 2
* Try:
> Run with --stacktrace option to get the stack trace.
> Run with --info or --debug option to get more log output.
> Run with --scan to get full insights.
* Get more help at https://help.gradle.org
BUILD FAILED in 3m 20s
12 actionable tasks: 6 executed, 4 from cache, 2 up-to-date
Publishing build scan...
https://gradle.com/s/c7bn75tfjrzzm
Build step 'Invoke Gradle script' changed build result to FAILURE
Build step 'Invoke Gradle script' marked build as failure
---------------------------------------------------------------------
To unsubscribe, e-mail: builds-unsubscribe@beam.apache.org
For additional commands, e-mail: builds-help@beam.apache.org
Build failed in Jenkins: beam_LoadTests_Go_CoGBK_Dataflow_batch #484
Posted by Apache Jenkins Server <je...@builds.apache.org>.
See <https://ci-beam.apache.org/job/beam_LoadTests_Go_CoGBK_Dataflow_batch/484/display/redirect?page=changes>
Changes:
[Heejong Lee] [BEAM-14251] add output_coder_override to ExpansionRequest
[Heejong Lee] remove null
[rarokni] [BEAM-14307] Fix Slow Side input pattern bug in sample
[Heejong Lee] better error msg
[Heejong Lee] update from comments
[noreply] [BEAM-14316] Introducing KafkaIO.Read implementation compatibility
[noreply] [BEAM-14290] Address staticcheck warnings in the reflectx package
[noreply] [BEAM-14302] Simply bools in fn.go, genx_test.go (#17356)
[noreply] Merge pull request #17382: [BEAM-12356] Close DatasetService leak as
------------------------------------------
[...truncated 25.03 KB...]
value: <
urn: "beam:env:docker:v1"
payload: "\n\035apache/beam_go_sdk:2.39.0.dev"
capabilities: "beam:protocol:progress_reporting:v0"
capabilities: "beam:protocol:multi_core_bundle_processing:v1"
capabilities: "beam:version:sdk_base:go"
capabilities: "beam:coder:bytes:v1"
capabilities: "beam:coder:bool:v1"
capabilities: "beam:coder:varint:v1"
capabilities: "beam:coder:double:v1"
capabilities: "beam:coder:string_utf8:v1"
capabilities: "beam:coder:length_prefix:v1"
capabilities: "beam:coder:kv:v1"
capabilities: "beam:coder:iterable:v1"
capabilities: "beam:coder:state_backed_iterable:v1"
capabilities: "beam:coder:windowed_value:v1"
capabilities: "beam:coder:global_window:v1"
capabilities: "beam:coder:interval_window:v1"
capabilities: "beam:coder:row:v1"
capabilities: "beam:coder:nullable:v1"
dependencies: <
type_urn: "beam:artifact:type:url:v1"
type_payload: "\nJgs://temp-storage-for-perf-tests/loadtests/go-1-1650358792523074022/****\022@9c4dd5527024d5f3512519808676e0d17616c5558ef5f9bc0f849c69762e3320"
role_urn: "beam:artifact:role:go_****_binary:v1"
>
>
>
>
root_transform_ids: "s1"
root_transform_ids: "s2"
root_transform_ids: "e8"
root_transform_ids: "e4"
root_transform_ids: "e9_cogbk"
root_transform_ids: "e10"
root_transform_ids: "e11"
requirements: "beam:requirement:pardo:splittable_dofn:v1"
2022/04/19 08:59:53 Staged model pipeline: gs://temp-storage-for-perf-tests/loadtests/go-1-1650358792523074022/model
2022/04/19 08:59:53 {
"environment": {
"experiments": [
"use_unified_****",
"use_portable_job_submission",
"beam_fn_api"
],
"sdkPipelineOptions": {
"display_data": [
{
"key": "name",
"namespace": "options",
"type": "STRING",
"value": "load-tests-go-dataflow-batch-cogbk-1-0419065645"
},
{
"key": "experiments",
"namespace": "options",
"type": "STRING",
"value": "use_unified_****,use_portable_job_submission"
},
{
"key": "project",
"namespace": "options",
"type": "STRING",
"value": "apache-beam-testing"
},
{
"key": "region",
"namespace": "options",
"type": "STRING",
"value": "us-central1"
},
{
"key": "container_images",
"namespace": "options",
"type": "STRING",
"value": "apache/beam_go_sdk:2.39.0.dev"
},
{
"key": "temp_location",
"namespace": "options",
"type": "STRING",
"value": "gs://temp-storage-for-perf-tests/loadtests"
},
{
"key": "****_binary",
"namespace": "go_options",
"type": "STRING",
"value": "linux_amd64/cogbk"
},
{
"key": "influx_namespace",
"namespace": "go_options",
"type": "STRING",
"value": "dataflow"
},
{
"key": "influx_measurement",
"namespace": "go_options",
"type": "STRING",
"value": "go_batch_cogbk_1"
},
{
"key": "hooks",
"namespace": "go_options",
"type": "STRING",
"value": "{\"default_remote_logging\":null}"
},
{
"key": "influx_db_name",
"namespace": "go_options",
"type": "STRING",
"value": "beam_test_metrics"
},
{
"key": "iterations",
"namespace": "go_options",
"type": "STRING",
"value": "1"
},
{
"key": "co_input_options",
"namespace": "go_options",
"type": "STRING",
"value": "{\"num_records\": 2000000,\"key_size\": 10,\"value_size\": 90,\"num_hot_keys\": 1000,\"hot_key_fraction\": 1}"
},
{
"key": "input_options",
"namespace": "go_options",
"type": "STRING",
"value": "{\"num_records\": 20000000,\"key_size\": 10,\"value_size\": 90,\"num_hot_keys\": 1,\"hot_key_fraction\": 1}"
},
{
"key": "hookOrder",
"namespace": "go_options",
"type": "STRING",
"value": "[\"default_remote_logging\"]"
},
{
"key": "influx_hostname",
"namespace": "go_options",
"type": "STRING",
"value": "http://10.128.0.96:8086"
}
],
"options": {
"experiments": [
"use_unified_****",
"use_portable_job_submission",
"beam_fn_api"
],
"pipelineUrl": "gs://temp-storage-for-perf-tests/loadtests/go-1-1650358792523074022/model",
"region": "us-central1",
"tempLocation": "gs://temp-storage-for-perf-tests/loadtests"
},
"beam:option:go_options:v1": {
"options": {
"co_input_options": "{\"num_records\": 2000000,\"key_size\": 10,\"value_size\": 90,\"num_hot_keys\": 1000,\"hot_key_fraction\": 1}",
"hookOrder": "[\"default_remote_logging\"]",
"hooks": "{\"default_remote_logging\":null}",
"influx_db_name": "beam_test_metrics",
"influx_hostname": "http://10.128.0.96:8086",
"influx_measurement": "go_batch_cogbk_1",
"influx_namespace": "dataflow",
"input_options": "{\"num_records\": 20000000,\"key_size\": 10,\"value_size\": 90,\"num_hot_keys\": 1,\"hot_key_fraction\": 1}",
"iterations": "1",
"****_binary": "linux_amd64/cogbk"
}
}
},
"tempStoragePrefix": "gs://temp-storage-for-perf-tests/loadtests",
"userAgent": {
"name": "Apache Beam SDK for Go",
"version": "2.39.0.dev"
},
"version": {
"job_type": "FNAPI_BATCH",
"major": "6"
},
"****Pools": [
{
"autoscalingSettings": {
"algorithm": "AUTOSCALING_ALGORITHM_NONE"
},
"ipConfiguration": "WORKER_IP_UNSPECIFIED",
"kind": "harness",
"numWorkers": 5,
"packages": [
{
"location": "gs://temp-storage-for-perf-tests/loadtests/go-1-1650358792523074022/****",
"name": "****"
}
],
"sdkHarnessContainerImages": [
{
"containerImage": "apache/beam_go_sdk:2.39.0.dev"
}
],
"****HarnessContainerImage": "apache/beam_go_sdk:2.39.0.dev"
}
]
},
"name": "load-tests-go-dataflow-batch-cogbk-1-0419065645",
"projectId": "apache-beam-testing",
"type": "JOB_TYPE_BATCH"
}
2022/04/19 08:59:53 Submitted job: 2022-04-19_01_59_53-10419082490599346020
2022/04/19 08:59:53 Console: https://console.cloud.google.com/dataflow/jobs/us-central1/2022-04-19_01_59_53-10419082490599346020?project=apache-beam-testing
2022/04/19 08:59:53 Logs: https://console.cloud.google.com/logs/viewer?project=apache-beam-testing&resource=dataflow_step%2Fjob_id%2F2022-04-19_01_59_53-10419082490599346020
2022/04/19 08:59:53 Job state: JOB_STATE_PENDING ...
2022/04/19 09:00:23 Job still running ...
2022/04/19 09:00:54 Job still running ...
2022/04/19 09:01:24 Job still running ...
2022/04/19 09:01:54 Job still running ...
2022/04/19 09:02:24 Job still running ...
2022/04/19 09:02:54 Job still running ...
2022/04/19 09:03:24 Failed to execute job: job 2022-04-19_01_59_53-10419082490599346020 failed
panic: Failed to execute job: job 2022-04-19_01_59_53-10419082490599346020 failed
goroutine 1 [running]:
github.com/apache/beam/sdks/v2/go/pkg/beam/log.Fatalf(0x1203108, 0xc000120000, 0x10e1911, 0x19, 0xc0004f1df0, 0x1, 0x1)
<https://ci-beam.apache.org/job/beam_LoadTests_Go_CoGBK_Dataflow_batch/ws/src/sdks/go/pkg/beam/log/log.go>:153 +0xec
main.main()
<https://ci-beam.apache.org/job/beam_LoadTests_Go_CoGBK_Dataflow_batch/ws/src/sdks/go/test/load/cogbk/cogbk.go>:99 +0x52a
> Task :sdks:go:test:load:run FAILED
FAILURE: Build failed with an exception.
* Where:
Build file '<https://ci-beam.apache.org/job/beam_LoadTests_Go_CoGBK_Dataflow_batch/ws/src/sdks/go/test/load/build.gradle'> line: 31
* What went wrong:
Execution failed for task ':sdks:go:test:load:run'.
> Process 'command 'sh'' finished with non-zero exit value 2
* Try:
> Run with --stacktrace option to get the stack trace.
> Run with --info or --debug option to get more log output.
> Run with --scan to get full insights.
* Get more help at https://help.gradle.org
BUILD FAILED in 3m 53s
12 actionable tasks: 6 executed, 4 from cache, 2 up-to-date
Publishing build scan...
https://gradle.com/s/p3lsp5xr62zso
Build step 'Invoke Gradle script' changed build result to FAILURE
Build step 'Invoke Gradle script' marked build as failure
---------------------------------------------------------------------
To unsubscribe, e-mail: builds-unsubscribe@beam.apache.org
For additional commands, e-mail: builds-help@beam.apache.org
Build failed in Jenkins: beam_LoadTests_Go_CoGBK_Dataflow_batch #483
Posted by Apache Jenkins Server <je...@builds.apache.org>.
See <https://ci-beam.apache.org/job/beam_LoadTests_Go_CoGBK_Dataflow_batch/483/display/redirect>
Changes:
------------------------------------------
[...truncated 25.04 KB...]
key: "go"
value: <
urn: "beam:env:docker:v1"
payload: "\n\035apache/beam_go_sdk:2.39.0.dev"
capabilities: "beam:protocol:progress_reporting:v0"
capabilities: "beam:protocol:multi_core_bundle_processing:v1"
capabilities: "beam:version:sdk_base:go"
capabilities: "beam:coder:bytes:v1"
capabilities: "beam:coder:bool:v1"
capabilities: "beam:coder:varint:v1"
capabilities: "beam:coder:double:v1"
capabilities: "beam:coder:string_utf8:v1"
capabilities: "beam:coder:length_prefix:v1"
capabilities: "beam:coder:kv:v1"
capabilities: "beam:coder:iterable:v1"
capabilities: "beam:coder:state_backed_iterable:v1"
capabilities: "beam:coder:windowed_value:v1"
capabilities: "beam:coder:global_window:v1"
capabilities: "beam:coder:interval_window:v1"
capabilities: "beam:coder:row:v1"
capabilities: "beam:coder:nullable:v1"
dependencies: <
type_urn: "beam:artifact:type:url:v1"
type_payload: "\nJgs://temp-storage-for-perf-tests/loadtests/go-1-1650272383145910593/****\022@8c94fb9e96cd1d6d0661868c9be38f3125ce31b7ebba4b014ea647cd1176ddc5"
role_urn: "beam:artifact:role:go_****_binary:v1"
>
>
>
>
root_transform_ids: "s1"
root_transform_ids: "s2"
root_transform_ids: "e4"
root_transform_ids: "e8"
root_transform_ids: "e9_cogbk"
root_transform_ids: "e10"
root_transform_ids: "e11"
requirements: "beam:requirement:pardo:splittable_dofn:v1"
2022/04/18 08:59:43 Staged model pipeline: gs://temp-storage-for-perf-tests/loadtests/go-1-1650272383145910593/model
2022/04/18 08:59:43 {
"environment": {
"experiments": [
"use_unified_****",
"use_portable_job_submission",
"beam_fn_api"
],
"sdkPipelineOptions": {
"display_data": [
{
"key": "name",
"namespace": "options",
"type": "STRING",
"value": "load-tests-go-dataflow-batch-cogbk-1-0418065636"
},
{
"key": "experiments",
"namespace": "options",
"type": "STRING",
"value": "use_unified_****,use_portable_job_submission"
},
{
"key": "project",
"namespace": "options",
"type": "STRING",
"value": "apache-beam-testing"
},
{
"key": "region",
"namespace": "options",
"type": "STRING",
"value": "us-central1"
},
{
"key": "container_images",
"namespace": "options",
"type": "STRING",
"value": "apache/beam_go_sdk:2.39.0.dev"
},
{
"key": "temp_location",
"namespace": "options",
"type": "STRING",
"value": "gs://temp-storage-for-perf-tests/loadtests"
},
{
"key": "hookOrder",
"namespace": "go_options",
"type": "STRING",
"value": "[\"default_remote_logging\"]"
},
{
"key": "iterations",
"namespace": "go_options",
"type": "STRING",
"value": "1"
},
{
"key": "influx_measurement",
"namespace": "go_options",
"type": "STRING",
"value": "go_batch_cogbk_1"
},
{
"key": "influx_namespace",
"namespace": "go_options",
"type": "STRING",
"value": "dataflow"
},
{
"key": "hooks",
"namespace": "go_options",
"type": "STRING",
"value": "{\"default_remote_logging\":null}"
},
{
"key": "influx_db_name",
"namespace": "go_options",
"type": "STRING",
"value": "beam_test_metrics"
},
{
"key": "influx_hostname",
"namespace": "go_options",
"type": "STRING",
"value": "http://10.128.0.96:8086"
},
{
"key": "input_options",
"namespace": "go_options",
"type": "STRING",
"value": "{\"num_records\": 20000000,\"key_size\": 10,\"value_size\": 90,\"num_hot_keys\": 1,\"hot_key_fraction\": 1}"
},
{
"key": "****_binary",
"namespace": "go_options",
"type": "STRING",
"value": "linux_amd64/cogbk"
},
{
"key": "co_input_options",
"namespace": "go_options",
"type": "STRING",
"value": "{\"num_records\": 2000000,\"key_size\": 10,\"value_size\": 90,\"num_hot_keys\": 1000,\"hot_key_fraction\": 1}"
}
],
"options": {
"experiments": [
"use_unified_****",
"use_portable_job_submission",
"beam_fn_api"
],
"pipelineUrl": "gs://temp-storage-for-perf-tests/loadtests/go-1-1650272383145910593/model",
"region": "us-central1",
"tempLocation": "gs://temp-storage-for-perf-tests/loadtests"
},
"beam:option:go_options:v1": {
"options": {
"co_input_options": "{\"num_records\": 2000000,\"key_size\": 10,\"value_size\": 90,\"num_hot_keys\": 1000,\"hot_key_fraction\": 1}",
"hookOrder": "[\"default_remote_logging\"]",
"hooks": "{\"default_remote_logging\":null}",
"influx_db_name": "beam_test_metrics",
"influx_hostname": "http://10.128.0.96:8086",
"influx_measurement": "go_batch_cogbk_1",
"influx_namespace": "dataflow",
"input_options": "{\"num_records\": 20000000,\"key_size\": 10,\"value_size\": 90,\"num_hot_keys\": 1,\"hot_key_fraction\": 1}",
"iterations": "1",
"****_binary": "linux_amd64/cogbk"
}
}
},
"tempStoragePrefix": "gs://temp-storage-for-perf-tests/loadtests",
"userAgent": {
"name": "Apache Beam SDK for Go",
"version": "2.39.0.dev"
},
"version": {
"job_type": "FNAPI_BATCH",
"major": "6"
},
"****Pools": [
{
"autoscalingSettings": {
"algorithm": "AUTOSCALING_ALGORITHM_NONE"
},
"ipConfiguration": "WORKER_IP_UNSPECIFIED",
"kind": "harness",
"numWorkers": 5,
"packages": [
{
"location": "gs://temp-storage-for-perf-tests/loadtests/go-1-1650272383145910593/****",
"name": "****"
}
],
"sdkHarnessContainerImages": [
{
"containerImage": "apache/beam_go_sdk:2.39.0.dev"
}
],
"****HarnessContainerImage": "apache/beam_go_sdk:2.39.0.dev"
}
]
},
"name": "load-tests-go-dataflow-batch-cogbk-1-0418065636",
"projectId": "apache-beam-testing",
"type": "JOB_TYPE_BATCH"
}
2022/04/18 08:59:45 Submitted job: 2022-04-18_01_59_43-810683589754287405
2022/04/18 08:59:45 Console: https://console.cloud.google.com/dataflow/jobs/us-central1/2022-04-18_01_59_43-810683589754287405?project=apache-beam-testing
2022/04/18 08:59:45 Logs: https://console.cloud.google.com/logs/viewer?project=apache-beam-testing&resource=dataflow_step%2Fjob_id%2F2022-04-18_01_59_43-810683589754287405
2022/04/18 08:59:45 Job state: JOB_STATE_PENDING ...
2022/04/18 09:00:15 Job still running ...
2022/04/18 09:00:45 Job still running ...
2022/04/18 09:01:15 Job still running ...
2022/04/18 09:01:45 Job still running ...
2022/04/18 09:02:15 Job still running ...
2022/04/18 09:02:45 Failed to execute job: job 2022-04-18_01_59_43-810683589754287405 failed
panic: Failed to execute job: job 2022-04-18_01_59_43-810683589754287405 failed
goroutine 1 [running]:
github.com/apache/beam/sdks/v2/go/pkg/beam/log.Fatalf(0x1203108, 0xc00019a000, 0x10e1911, 0x19, 0xc00083fdf0, 0x1, 0x1)
<https://ci-beam.apache.org/job/beam_LoadTests_Go_CoGBK_Dataflow_batch/ws/src/sdks/go/pkg/beam/log/log.go>:153 +0xec
main.main()
<https://ci-beam.apache.org/job/beam_LoadTests_Go_CoGBK_Dataflow_batch/ws/src/sdks/go/test/load/cogbk/cogbk.go>:99 +0x52a
> Task :sdks:go:test:load:run FAILED
FAILURE: Build failed with an exception.
* Where:
Build file '<https://ci-beam.apache.org/job/beam_LoadTests_Go_CoGBK_Dataflow_batch/ws/src/sdks/go/test/load/build.gradle'> line: 31
* What went wrong:
Execution failed for task ':sdks:go:test:load:run'.
> Process 'command 'sh'' finished with non-zero exit value 2
* Try:
> Run with --stacktrace option to get the stack trace.
> Run with --info or --debug option to get more log output.
> Run with --scan to get full insights.
* Get more help at https://help.gradle.org
BUILD FAILED in 3m 17s
12 actionable tasks: 6 executed, 4 from cache, 2 up-to-date
Publishing build scan...
https://gradle.com/s/vhcevlaiikosa
Build step 'Invoke Gradle script' changed build result to FAILURE
Build step 'Invoke Gradle script' marked build as failure
---------------------------------------------------------------------
To unsubscribe, e-mail: builds-unsubscribe@beam.apache.org
For additional commands, e-mail: builds-help@beam.apache.org