You are viewing a plain text version of this content. The canonical link for it is here.
Posted to yarn-dev@hadoop.apache.org by Apache Jenkins Server <je...@builds.apache.org> on 2016/02/12 04:48:30 UTC
Build failed in Jenkins: Hadoop-Yarn-trunk #1757
See <https://builds.apache.org/job/Hadoop-Yarn-trunk/1757/changes>
Changes:
[cnauroth] HADOOP-12795. KMS does not log detailed stack trace for unexpected
[wang] HADOOP-12699. TestKMS#testKMSProvider intermittently fails during 'test
------------------------------------------
[...truncated 10368 lines...]
Generating <https://builds.apache.org/job/Hadoop-Yarn-trunk/ws/hadoop-yarn-project/hadoop-yarn/hadoop-yarn-server/hadoop-yarn-server-resourcemanager/target/org/apache/hadoop/yarn/server/resourcemanager/webapp/dao/class-use/ReservationSubmissionRequestInfo.html...>
Generating <https://builds.apache.org/job/Hadoop-Yarn-trunk/ws/hadoop-yarn-project/hadoop-yarn/hadoop-yarn-server/hadoop-yarn-server-resourcemanager/target/org/apache/hadoop/yarn/server/resourcemanager/webapp/dao/class-use/ReservationDefinitionInfo.html...>
Generating <https://builds.apache.org/job/Hadoop-Yarn-trunk/ws/hadoop-yarn-project/hadoop-yarn/hadoop-yarn-server/hadoop-yarn-server-resourcemanager/target/org/apache/hadoop/yarn/server/resourcemanager/webapp/dao/class-use/ReservationDeleteResponseInfo.html...>
Generating <https://builds.apache.org/job/Hadoop-Yarn-trunk/ws/hadoop-yarn-project/hadoop-yarn/hadoop-yarn-server/hadoop-yarn-server-resourcemanager/target/org/apache/hadoop/yarn/server/resourcemanager/webapp/dao/class-use/ReservationDeleteRequestInfo.html...>
Generating <https://builds.apache.org/job/Hadoop-Yarn-trunk/ws/hadoop-yarn-project/hadoop-yarn/hadoop-yarn-server/hadoop-yarn-server-resourcemanager/target/org/apache/hadoop/yarn/server/resourcemanager/webapp/dao/class-use/NodesInfo.html...>
Generating <https://builds.apache.org/job/Hadoop-Yarn-trunk/ws/hadoop-yarn-project/hadoop-yarn/hadoop-yarn-server/hadoop-yarn-server-resourcemanager/target/org/apache/hadoop/yarn/server/resourcemanager/webapp/dao/class-use/AMBlackListingRequestInfo.html...>
Generating <https://builds.apache.org/job/Hadoop-Yarn-trunk/ws/hadoop-yarn-project/hadoop-yarn/hadoop-yarn-server/hadoop-yarn-server-resourcemanager/target/org/apache/hadoop/yarn/server/resourcemanager/webapp/dao/class-use/CredentialsInfo.html...>
Generating <https://builds.apache.org/job/Hadoop-Yarn-trunk/ws/hadoop-yarn-project/hadoop-yarn/hadoop-yarn-server/hadoop-yarn-server-resourcemanager/target/org/apache/hadoop/yarn/server/resourcemanager/webapp/dao/class-use/LocalResourceInfo.html...>
Generating <https://builds.apache.org/job/Hadoop-Yarn-trunk/ws/hadoop-yarn-project/hadoop-yarn/hadoop-yarn-server/hadoop-yarn-server-resourcemanager/target/org/apache/hadoop/yarn/server/resourcemanager/webapp/dao/class-use/DelegationToken.html...>
Generating <https://builds.apache.org/job/Hadoop-Yarn-trunk/ws/hadoop-yarn-project/hadoop-yarn/hadoop-yarn-server/hadoop-yarn-server-resourcemanager/target/org/apache/hadoop/yarn/server/resourcemanager/webapp/dao/class-use/FairSchedulerLeafQueueInfo.html...>
Generating <https://builds.apache.org/job/Hadoop-Yarn-trunk/ws/hadoop-yarn-project/hadoop-yarn/hadoop-yarn-server/hadoop-yarn-server-resourcemanager/target/org/apache/hadoop/yarn/server/resourcemanager/webapp/dao/class-use/ResourceAllocationInfo.html...>
Generating <https://builds.apache.org/job/Hadoop-Yarn-trunk/ws/hadoop-yarn-project/hadoop-yarn/hadoop-yarn-server/hadoop-yarn-server-resourcemanager/target/org/apache/hadoop/yarn/server/resourcemanager/webapp/dao/class-use/FairSchedulerInfo.html...>
Generating <https://builds.apache.org/job/Hadoop-Yarn-trunk/ws/hadoop-yarn-project/hadoop-yarn/hadoop-yarn-server/hadoop-yarn-server-resourcemanager/target/org/apache/hadoop/yarn/server/resourcemanager/webapp/dao/class-use/ReservationUpdateResponseInfo.html...>
Generating <https://builds.apache.org/job/Hadoop-Yarn-trunk/ws/hadoop-yarn-project/hadoop-yarn/hadoop-yarn-server/hadoop-yarn-server-resourcemanager/target/org/apache/hadoop/yarn/server/resourcemanager/webapp/dao/class-use/NodeLabelsInfo.html...>
Generating <https://builds.apache.org/job/Hadoop-Yarn-trunk/ws/hadoop-yarn-project/hadoop-yarn/hadoop-yarn-server/hadoop-yarn-server-resourcemanager/target/org/apache/hadoop/yarn/server/resourcemanager/webapp/dao/class-use/AppAttemptsInfo.html...>
Generating <https://builds.apache.org/job/Hadoop-Yarn-trunk/ws/hadoop-yarn-project/hadoop-yarn/hadoop-yarn-server/hadoop-yarn-server-resourcemanager/target/org/apache/hadoop/yarn/server/resourcemanager/webapp/dao/class-use/NodeToLabelsEntryList.html...>
Generating <https://builds.apache.org/job/Hadoop-Yarn-trunk/ws/hadoop-yarn-project/hadoop-yarn/hadoop-yarn-server/hadoop-yarn-server-resourcemanager/target/org/apache/hadoop/yarn/server/resourcemanager/webapp/dao/class-use/PartitionResourcesInfo.html...>
Generating <https://builds.apache.org/job/Hadoop-Yarn-trunk/ws/hadoop-yarn-project/hadoop-yarn/hadoop-yarn-server/hadoop-yarn-server-resourcemanager/target/org/apache/hadoop/yarn/server/resourcemanager/webapp/dao/class-use/ReservationRequestInfo.html...>
Generating <https://builds.apache.org/job/Hadoop-Yarn-trunk/ws/hadoop-yarn-project/hadoop-yarn/hadoop-yarn-server/hadoop-yarn-server-resourcemanager/target/org/apache/hadoop/yarn/server/resourcemanager/webapp/dao/class-use/ReservationIdInfo.html...>
Generating <https://builds.apache.org/job/Hadoop-Yarn-trunk/ws/hadoop-yarn-project/hadoop-yarn/hadoop-yarn-server/hadoop-yarn-server-resourcemanager/target/org/apache/hadoop/yarn/server/resourcemanager/webapp/dao/class-use/NodeToLabelsInfo.html...>
Generating <https://builds.apache.org/job/Hadoop-Yarn-trunk/ws/hadoop-yarn-project/hadoop-yarn/hadoop-yarn-server/hadoop-yarn-server-resourcemanager/target/org/apache/hadoop/yarn/server/resourcemanager/webapp/dao/class-use/ResourceInfo.html...>
Generating <https://builds.apache.org/job/Hadoop-Yarn-trunk/ws/hadoop-yarn-project/hadoop-yarn/hadoop-yarn-server/hadoop-yarn-server-resourcemanager/target/org/apache/hadoop/yarn/server/resourcemanager/webapp/dao/class-use/AppQueue.html...>
Generating <https://builds.apache.org/job/Hadoop-Yarn-trunk/ws/hadoop-yarn-project/hadoop-yarn/hadoop-yarn-server/hadoop-yarn-server-resourcemanager/target/org/apache/hadoop/yarn/server/resourcemanager/webapp/dao/class-use/AppState.html...>
Generating <https://builds.apache.org/job/Hadoop-Yarn-trunk/ws/hadoop-yarn-project/hadoop-yarn/hadoop-yarn-server/hadoop-yarn-server-resourcemanager/target/org/apache/hadoop/yarn/server/resourcemanager/webapp/dao/class-use/LogAggregationContextInfo.html...>
Generating <https://builds.apache.org/job/Hadoop-Yarn-trunk/ws/hadoop-yarn-project/hadoop-yarn/hadoop-yarn-server/hadoop-yarn-server-resourcemanager/target/org/apache/hadoop/yarn/server/resourcemanager/webapp/dao/class-use/ApplicationStatisticsInfo.html...>
Generating <https://builds.apache.org/job/Hadoop-Yarn-trunk/ws/hadoop-yarn-project/hadoop-yarn/hadoop-yarn-server/hadoop-yarn-server-resourcemanager/target/org/apache/hadoop/yarn/server/resourcemanager/webapp/dao/class-use/CapacitySchedulerLeafQueueInfo.html...>
Generating <https://builds.apache.org/job/Hadoop-Yarn-trunk/ws/hadoop-yarn-project/hadoop-yarn/hadoop-yarn-server/hadoop-yarn-server-resourcemanager/target/org/apache/hadoop/yarn/server/resourcemanager/webapp/dao/class-use/UsersInfo.html...>
Generating <https://builds.apache.org/job/Hadoop-Yarn-trunk/ws/hadoop-yarn-project/hadoop-yarn/hadoop-yarn-server/hadoop-yarn-server-resourcemanager/target/org/apache/hadoop/yarn/server/resourcemanager/webapp/dao/class-use/FairSchedulerQueueInfo.html...>
Generating <https://builds.apache.org/job/Hadoop-Yarn-trunk/ws/hadoop-yarn-project/hadoop-yarn/hadoop-yarn-server/hadoop-yarn-server-resourcemanager/target/org/apache/hadoop/yarn/server/resourcemanager/webapp/dao/class-use/AppPriority.html...>
Generating <https://builds.apache.org/job/Hadoop-Yarn-trunk/ws/hadoop-yarn-project/hadoop-yarn/hadoop-yarn-server/hadoop-yarn-server-resourcemanager/target/org/apache/hadoop/yarn/server/resourcemanager/webapp/dao/class-use/UserMetricsInfo.html...>
Generating <https://builds.apache.org/job/Hadoop-Yarn-trunk/ws/hadoop-yarn-project/hadoop-yarn/hadoop-yarn-server/hadoop-yarn-server-resourcemanager/target/org/apache/hadoop/yarn/server/resourcemanager/webapp/dao/class-use/ApplicationSubmissionContextInfo.html...>
Generating <https://builds.apache.org/job/Hadoop-Yarn-trunk/ws/hadoop-yarn-project/hadoop-yarn/hadoop-yarn-server/hadoop-yarn-server-resourcemanager/target/org/apache/hadoop/yarn/server/resourcemanager/webapp/dao/class-use/PartitionQueueCapacitiesInfo.html...>
Generating <https://builds.apache.org/job/Hadoop-Yarn-trunk/ws/hadoop-yarn-project/hadoop-yarn/hadoop-yarn-server/hadoop-yarn-server-resourcemanager/target/org/apache/hadoop/yarn/server/resourcemanager/webapp/dao/class-use/ClusterInfo.html...>
Generating <https://builds.apache.org/job/Hadoop-Yarn-trunk/ws/hadoop-yarn-project/hadoop-yarn/hadoop-yarn-server/hadoop-yarn-server-resourcemanager/target/org/apache/hadoop/yarn/server/resourcemanager/webapp/dao/class-use/SchedulerTypeInfo.html...>
Generating <https://builds.apache.org/job/Hadoop-Yarn-trunk/ws/hadoop-yarn-project/hadoop-yarn/hadoop-yarn-server/hadoop-yarn-server-resourcemanager/target/org/apache/hadoop/yarn/server/resourcemanager/webapp/dao/class-use/ClusterMetricsInfo.html...>
Generating <https://builds.apache.org/job/Hadoop-Yarn-trunk/ws/hadoop-yarn-project/hadoop-yarn/hadoop-yarn-server/hadoop-yarn-server-resourcemanager/target/org/apache/hadoop/yarn/server/resourcemanager/webapp/dao/class-use/FifoSchedulerInfo.html...>
Generating <https://builds.apache.org/job/Hadoop-Yarn-trunk/ws/hadoop-yarn-project/hadoop-yarn/hadoop-yarn-server/hadoop-yarn-server-resourcemanager/target/org/apache/hadoop/yarn/server/resourcemanager/webapp/dao/class-use/CapacitySchedulerHealthInfo.html...>
Generating <https://builds.apache.org/job/Hadoop-Yarn-trunk/ws/hadoop-yarn-project/hadoop-yarn/hadoop-yarn-server/hadoop-yarn-server-resourcemanager/target/org/apache/hadoop/yarn/server/resourcemanager/webapp/dao/class-use/CapacitySchedulerHealthInfo.OperationInformation.html...>
Generating <https://builds.apache.org/job/Hadoop-Yarn-trunk/ws/hadoop-yarn-project/hadoop-yarn/hadoop-yarn-server/hadoop-yarn-server-resourcemanager/target/org/apache/hadoop/yarn/server/resourcemanager/webapp/dao/class-use/CapacitySchedulerHealthInfo.LastRunDetails.html...>
Generating <https://builds.apache.org/job/Hadoop-Yarn-trunk/ws/hadoop-yarn-project/hadoop-yarn/hadoop-yarn-server/hadoop-yarn-server-resourcemanager/target/org/apache/hadoop/yarn/server/resourcemanager/webapp/dao/class-use/AppsInfo.html...>
Generating <https://builds.apache.org/job/Hadoop-Yarn-trunk/ws/hadoop-yarn-project/hadoop-yarn/hadoop-yarn-server/hadoop-yarn-server-resourcemanager/target/org/apache/hadoop/yarn/server/resourcemanager/webapp/dao/class-use/ReservationListInfo.html...>
Generating <https://builds.apache.org/job/Hadoop-Yarn-trunk/ws/hadoop-yarn-project/hadoop-yarn/hadoop-yarn-server/hadoop-yarn-server-resourcemanager/target/org/apache/hadoop/yarn/server/resourcemanager/webapp/dao/class-use/CapacitySchedulerInfo.html...>
Generating <https://builds.apache.org/job/Hadoop-Yarn-trunk/ws/hadoop-yarn-project/hadoop-yarn/hadoop-yarn-server/hadoop-yarn-server-resourcemanager/target/org/apache/hadoop/yarn/server/resourcemanager/webapp/dao/class-use/FairSchedulerQueueInfoList.html...>
Generating <https://builds.apache.org/job/Hadoop-Yarn-trunk/ws/hadoop-yarn-project/hadoop-yarn/hadoop-yarn-server/hadoop-yarn-server-resourcemanager/target/org/apache/hadoop/yarn/server/resourcemanager/webapp/dao/class-use/NodeInfo.html...>
Generating <https://builds.apache.org/job/Hadoop-Yarn-trunk/ws/hadoop-yarn-project/hadoop-yarn/hadoop-yarn-server/hadoop-yarn-server-resourcemanager/target/org/apache/hadoop/yarn/server/resourcemanager/webapp/dao/class-use/ResourceUtilizationInfo.html...>
Generating <https://builds.apache.org/job/Hadoop-Yarn-trunk/ws/hadoop-yarn-project/hadoop-yarn/hadoop-yarn-server/hadoop-yarn-server-resourcemanager/target/org/apache/hadoop/yarn/server/resourcemanager/webapp/dao/class-use/SchedulerInfo.html...>
Generating <https://builds.apache.org/job/Hadoop-Yarn-trunk/ws/hadoop-yarn-project/hadoop-yarn/hadoop-yarn-server/hadoop-yarn-server-resourcemanager/target/org/apache/hadoop/yarn/proto/class-use/YarnSecurityTestClientAMTokenProtos.html...>
Generating <https://builds.apache.org/job/Hadoop-Yarn-trunk/ws/hadoop-yarn-project/hadoop-yarn/hadoop-yarn-server/hadoop-yarn-server-resourcemanager/target/org/apache/hadoop/yarn/proto/class-use/YarnSecurityTestClientAMTokenProtos.ClientToAMTokenIdentifierForTestProtoOrBuilder.html...>
Generating <https://builds.apache.org/job/Hadoop-Yarn-trunk/ws/hadoop-yarn-project/hadoop-yarn/hadoop-yarn-server/hadoop-yarn-server-resourcemanager/target/org/apache/hadoop/yarn/proto/class-use/YarnSecurityTestClientAMTokenProtos.ClientToAMTokenIdentifierForTestProto.html...>
Generating <https://builds.apache.org/job/Hadoop-Yarn-trunk/ws/hadoop-yarn-project/hadoop-yarn/hadoop-yarn-server/hadoop-yarn-server-resourcemanager/target/org/apache/hadoop/yarn/proto/class-use/YarnSecurityTestClientAMTokenProtos.ClientToAMTokenIdentifierForTestProto.Builder.html...>
Generating <https://builds.apache.org/job/Hadoop-Yarn-trunk/ws/hadoop-yarn-project/hadoop-yarn/hadoop-yarn-server/hadoop-yarn-server-resourcemanager/target/org/apache/hadoop/yarn/proto/class-use/YarnSecurityTestClientAMTokenProtos.RMDelegationTokenIdentifierForTestProtoOrBuilder.html...>
Generating <https://builds.apache.org/job/Hadoop-Yarn-trunk/ws/hadoop-yarn-project/hadoop-yarn/hadoop-yarn-server/hadoop-yarn-server-resourcemanager/target/org/apache/hadoop/yarn/proto/class-use/YarnSecurityTestClientAMTokenProtos.RMDelegationTokenIdentifierForTestProto.html...>
Generating <https://builds.apache.org/job/Hadoop-Yarn-trunk/ws/hadoop-yarn-project/hadoop-yarn/hadoop-yarn-server/hadoop-yarn-server-resourcemanager/target/org/apache/hadoop/yarn/proto/class-use/YarnSecurityTestClientAMTokenProtos.RMDelegationTokenIdentifierForTestProto.Builder.html...>
Generating <https://builds.apache.org/job/Hadoop-Yarn-trunk/ws/hadoop-yarn-project/hadoop-yarn/hadoop-yarn-server/hadoop-yarn-server-resourcemanager/target/org/apache/hadoop/yarn/proto/class-use/YarnServerResourceManagerRecoveryProtos.html...>
Generating <https://builds.apache.org/job/Hadoop-Yarn-trunk/ws/hadoop-yarn-project/hadoop-yarn/hadoop-yarn-server/hadoop-yarn-server-resourcemanager/target/org/apache/hadoop/yarn/proto/class-use/YarnServerResourceManagerRecoveryProtos.RMAppAttemptStateProto.html...>
Generating <https://builds.apache.org/job/Hadoop-Yarn-trunk/ws/hadoop-yarn-project/hadoop-yarn/hadoop-yarn-server/hadoop-yarn-server-resourcemanager/target/org/apache/hadoop/yarn/proto/class-use/YarnServerResourceManagerRecoveryProtos.RMAppStateProto.html...>
Generating <https://builds.apache.org/job/Hadoop-Yarn-trunk/ws/hadoop-yarn-project/hadoop-yarn/hadoop-yarn-server/hadoop-yarn-server-resourcemanager/target/org/apache/hadoop/yarn/proto/class-use/YarnServerResourceManagerRecoveryProtos.ApplicationStateDataProtoOrBuilder.html...>
Generating <https://builds.apache.org/job/Hadoop-Yarn-trunk/ws/hadoop-yarn-project/hadoop-yarn/hadoop-yarn-server/hadoop-yarn-server-resourcemanager/target/org/apache/hadoop/yarn/proto/class-use/YarnServerResourceManagerRecoveryProtos.ApplicationStateDataProto.html...>
Generating <https://builds.apache.org/job/Hadoop-Yarn-trunk/ws/hadoop-yarn-project/hadoop-yarn/hadoop-yarn-server/hadoop-yarn-server-resourcemanager/target/org/apache/hadoop/yarn/proto/class-use/YarnServerResourceManagerRecoveryProtos.ApplicationStateDataProto.Builder.html...>
Generating <https://builds.apache.org/job/Hadoop-Yarn-trunk/ws/hadoop-yarn-project/hadoop-yarn/hadoop-yarn-server/hadoop-yarn-server-resourcemanager/target/org/apache/hadoop/yarn/proto/class-use/YarnServerResourceManagerRecoveryProtos.ApplicationAttemptStateDataProtoOrBuilder.html...>
Generating <https://builds.apache.org/job/Hadoop-Yarn-trunk/ws/hadoop-yarn-project/hadoop-yarn/hadoop-yarn-server/hadoop-yarn-server-resourcemanager/target/org/apache/hadoop/yarn/proto/class-use/YarnServerResourceManagerRecoveryProtos.ApplicationAttemptStateDataProto.html...>
Generating <https://builds.apache.org/job/Hadoop-Yarn-trunk/ws/hadoop-yarn-project/hadoop-yarn/hadoop-yarn-server/hadoop-yarn-server-resourcemanager/target/org/apache/hadoop/yarn/proto/class-use/YarnServerResourceManagerRecoveryProtos.ApplicationAttemptStateDataProto.Builder.html...>
Generating <https://builds.apache.org/job/Hadoop-Yarn-trunk/ws/hadoop-yarn-project/hadoop-yarn/hadoop-yarn-server/hadoop-yarn-server-resourcemanager/target/org/apache/hadoop/yarn/proto/class-use/YarnServerResourceManagerRecoveryProtos.EpochProtoOrBuilder.html...>
Generating <https://builds.apache.org/job/Hadoop-Yarn-trunk/ws/hadoop-yarn-project/hadoop-yarn/hadoop-yarn-server/hadoop-yarn-server-resourcemanager/target/org/apache/hadoop/yarn/proto/class-use/YarnServerResourceManagerRecoveryProtos.EpochProto.html...>
Generating <https://builds.apache.org/job/Hadoop-Yarn-trunk/ws/hadoop-yarn-project/hadoop-yarn/hadoop-yarn-server/hadoop-yarn-server-resourcemanager/target/org/apache/hadoop/yarn/proto/class-use/YarnServerResourceManagerRecoveryProtos.EpochProto.Builder.html...>
Generating <https://builds.apache.org/job/Hadoop-Yarn-trunk/ws/hadoop-yarn-project/hadoop-yarn/hadoop-yarn-server/hadoop-yarn-server-resourcemanager/target/org/apache/hadoop/yarn/proto/class-use/YarnServerResourceManagerRecoveryProtos.AMRMTokenSecretManagerStateProtoOrBuilder.html...>
Generating <https://builds.apache.org/job/Hadoop-Yarn-trunk/ws/hadoop-yarn-project/hadoop-yarn/hadoop-yarn-server/hadoop-yarn-server-resourcemanager/target/org/apache/hadoop/yarn/proto/class-use/YarnServerResourceManagerRecoveryProtos.AMRMTokenSecretManagerStateProto.html...>
Generating <https://builds.apache.org/job/Hadoop-Yarn-trunk/ws/hadoop-yarn-project/hadoop-yarn/hadoop-yarn-server/hadoop-yarn-server-resourcemanager/target/org/apache/hadoop/yarn/proto/class-use/YarnServerResourceManagerRecoveryProtos.AMRMTokenSecretManagerStateProto.Builder.html...>
Generating <https://builds.apache.org/job/Hadoop-Yarn-trunk/ws/hadoop-yarn-project/hadoop-yarn/hadoop-yarn-server/hadoop-yarn-server-resourcemanager/target/org/apache/hadoop/yarn/proto/class-use/YarnServerResourceManagerRecoveryProtos.RMDelegationTokenIdentifierDataProtoOrBuilder.html...>
Generating <https://builds.apache.org/job/Hadoop-Yarn-trunk/ws/hadoop-yarn-project/hadoop-yarn/hadoop-yarn-server/hadoop-yarn-server-resourcemanager/target/org/apache/hadoop/yarn/proto/class-use/YarnServerResourceManagerRecoveryProtos.RMDelegationTokenIdentifierDataProto.html...>
Generating <https://builds.apache.org/job/Hadoop-Yarn-trunk/ws/hadoop-yarn-project/hadoop-yarn/hadoop-yarn-server/hadoop-yarn-server-resourcemanager/target/org/apache/hadoop/yarn/proto/class-use/YarnServerResourceManagerRecoveryProtos.RMDelegationTokenIdentifierDataProto.Builder.html...>
Generating <https://builds.apache.org/job/Hadoop-Yarn-trunk/ws/hadoop-yarn-project/hadoop-yarn/hadoop-yarn-server/hadoop-yarn-server-resourcemanager/target/org/apache/hadoop/yarn/proto/package-use.html...>
Generating <https://builds.apache.org/job/Hadoop-Yarn-trunk/ws/hadoop-yarn-project/hadoop-yarn/hadoop-yarn-server/hadoop-yarn-server-resourcemanager/target/org/apache/hadoop/yarn/server/resourcemanager/package-use.html...>
Generating <https://builds.apache.org/job/Hadoop-Yarn-trunk/ws/hadoop-yarn-project/hadoop-yarn/hadoop-yarn-server/hadoop-yarn-server-resourcemanager/target/org/apache/hadoop/yarn/server/resourcemanager/ahs/package-use.html...>
Generating <https://builds.apache.org/job/Hadoop-Yarn-trunk/ws/hadoop-yarn-project/hadoop-yarn/hadoop-yarn-server/hadoop-yarn-server-resourcemanager/target/org/apache/hadoop/yarn/server/resourcemanager/amlauncher/package-use.html...>
Generating <https://builds.apache.org/job/Hadoop-Yarn-trunk/ws/hadoop-yarn-project/hadoop-yarn/hadoop-yarn-server/hadoop-yarn-server-resourcemanager/target/org/apache/hadoop/yarn/server/resourcemanager/blacklist/package-use.html...>
Generating <https://builds.apache.org/job/Hadoop-Yarn-trunk/ws/hadoop-yarn-project/hadoop-yarn/hadoop-yarn-server/hadoop-yarn-server-resourcemanager/target/org/apache/hadoop/yarn/server/resourcemanager/metrics/package-use.html...>
Generating <https://builds.apache.org/job/Hadoop-Yarn-trunk/ws/hadoop-yarn-project/hadoop-yarn/hadoop-yarn-server/hadoop-yarn-server-resourcemanager/target/org/apache/hadoop/yarn/server/resourcemanager/monitor/package-use.html...>
Generating <https://builds.apache.org/job/Hadoop-Yarn-trunk/ws/hadoop-yarn-project/hadoop-yarn/hadoop-yarn-server/hadoop-yarn-server-resourcemanager/target/org/apache/hadoop/yarn/server/resourcemanager/monitor/capacity/package-use.html...>
Generating <https://builds.apache.org/job/Hadoop-Yarn-trunk/ws/hadoop-yarn-project/hadoop-yarn/hadoop-yarn-server/hadoop-yarn-server-resourcemanager/target/org/apache/hadoop/yarn/server/resourcemanager/nodelabels/package-use.html...>
Generating <https://builds.apache.org/job/Hadoop-Yarn-trunk/ws/hadoop-yarn-project/hadoop-yarn/hadoop-yarn-server/hadoop-yarn-server-resourcemanager/target/org/apache/hadoop/yarn/server/resourcemanager/placement/package-use.html...>
Generating <https://builds.apache.org/job/Hadoop-Yarn-trunk/ws/hadoop-yarn-project/hadoop-yarn/hadoop-yarn-server/hadoop-yarn-server-resourcemanager/target/org/apache/hadoop/yarn/server/resourcemanager/recovery/package-use.html...>
Generating <https://builds.apache.org/job/Hadoop-Yarn-trunk/ws/hadoop-yarn-project/hadoop-yarn/hadoop-yarn-server/hadoop-yarn-server-resourcemanager/target/org/apache/hadoop/yarn/server/resourcemanager/recovery/records/package-use.html...>
Generating <https://builds.apache.org/job/Hadoop-Yarn-trunk/ws/hadoop-yarn-project/hadoop-yarn/hadoop-yarn-server/hadoop-yarn-server-resourcemanager/target/org/apache/hadoop/yarn/server/resourcemanager/recovery/records/impl/pb/package-use.html...>
Generating <https://builds.apache.org/job/Hadoop-Yarn-trunk/ws/hadoop-yarn-project/hadoop-yarn/hadoop-yarn-server/hadoop-yarn-server-resourcemanager/target/org/apache/hadoop/yarn/server/resourcemanager/reservation/package-use.html...>
Generating <https://builds.apache.org/job/Hadoop-Yarn-trunk/ws/hadoop-yarn-project/hadoop-yarn/hadoop-yarn-server/hadoop-yarn-server-resourcemanager/target/org/apache/hadoop/yarn/server/resourcemanager/reservation/exceptions/package-use.html...>
Generating <https://builds.apache.org/job/Hadoop-Yarn-trunk/ws/hadoop-yarn-project/hadoop-yarn/hadoop-yarn-server/hadoop-yarn-server-resourcemanager/target/org/apache/hadoop/yarn/server/resourcemanager/reservation/planning/package-use.html...>
Generating <https://builds.apache.org/job/Hadoop-Yarn-trunk/ws/hadoop-yarn-project/hadoop-yarn/hadoop-yarn-server/hadoop-yarn-server-resourcemanager/target/org/apache/hadoop/yarn/server/resourcemanager/resource/package-use.html...>
Generating <https://builds.apache.org/job/Hadoop-Yarn-trunk/ws/hadoop-yarn-project/hadoop-yarn/hadoop-yarn-server/hadoop-yarn-server-resourcemanager/target/org/apache/hadoop/yarn/server/resourcemanager/rmapp/package-use.html...>
Generating <https://builds.apache.org/job/Hadoop-Yarn-trunk/ws/hadoop-yarn-project/hadoop-yarn/hadoop-yarn-server/hadoop-yarn-server-resourcemanager/target/org/apache/hadoop/yarn/server/resourcemanager/rmapp/attempt/package-use.html...>
Generating <https://builds.apache.org/job/Hadoop-Yarn-trunk/ws/hadoop-yarn-project/hadoop-yarn/hadoop-yarn-server/hadoop-yarn-server-resourcemanager/target/org/apache/hadoop/yarn/server/resourcemanager/rmapp/attempt/event/package-use.html...>
Generating <https://builds.apache.org/job/Hadoop-Yarn-trunk/ws/hadoop-yarn-project/hadoop-yarn/hadoop-yarn-server/hadoop-yarn-server-resourcemanager/target/org/apache/hadoop/yarn/server/resourcemanager/rmcontainer/package-use.html...>
Generating <https://builds.apache.org/job/Hadoop-Yarn-trunk/ws/hadoop-yarn-project/hadoop-yarn/hadoop-yarn-server/hadoop-yarn-server-resourcemanager/target/org/apache/hadoop/yarn/server/resourcemanager/rmnode/package-use.html...>
Generating <https://builds.apache.org/job/Hadoop-Yarn-trunk/ws/hadoop-yarn-project/hadoop-yarn/hadoop-yarn-server/hadoop-yarn-server-resourcemanager/target/org/apache/hadoop/yarn/server/resourcemanager/scheduler/package-use.html...>
Generating <https://builds.apache.org/job/Hadoop-Yarn-trunk/ws/hadoop-yarn-project/hadoop-yarn/hadoop-yarn-server/hadoop-yarn-server-resourcemanager/target/org/apache/hadoop/yarn/server/resourcemanager/scheduler/capacity/package-use.html...>
Generating <https://builds.apache.org/job/Hadoop-Yarn-trunk/ws/hadoop-yarn-project/hadoop-yarn/hadoop-yarn-server/hadoop-yarn-server-resourcemanager/target/org/apache/hadoop/yarn/server/resourcemanager/scheduler/capacity/allocator/package-use.html...>
Generating <https://builds.apache.org/job/Hadoop-Yarn-trunk/ws/hadoop-yarn-project/hadoop-yarn/hadoop-yarn-server/hadoop-yarn-server-resourcemanager/target/org/apache/hadoop/yarn/server/resourcemanager/scheduler/common/package-use.html...>
Generating <https://builds.apache.org/job/Hadoop-Yarn-trunk/ws/hadoop-yarn-project/hadoop-yarn/hadoop-yarn-server/hadoop-yarn-server-resourcemanager/target/org/apache/hadoop/yarn/server/resourcemanager/scheduler/common/fica/package-use.html...>
Generating <https://builds.apache.org/job/Hadoop-Yarn-trunk/ws/hadoop-yarn-project/hadoop-yarn/hadoop-yarn-server/hadoop-yarn-server-resourcemanager/target/org/apache/hadoop/yarn/server/resourcemanager/scheduler/event/package-use.html...>
Generating <https://builds.apache.org/job/Hadoop-Yarn-trunk/ws/hadoop-yarn-project/hadoop-yarn/hadoop-yarn-server/hadoop-yarn-server-resourcemanager/target/org/apache/hadoop/yarn/server/resourcemanager/scheduler/fair/package-use.html...>
Generating <https://builds.apache.org/job/Hadoop-Yarn-trunk/ws/hadoop-yarn-project/hadoop-yarn/hadoop-yarn-server/hadoop-yarn-server-resourcemanager/target/org/apache/hadoop/yarn/server/resourcemanager/scheduler/fair/policies/package-use.html...>
Generating <https://builds.apache.org/job/Hadoop-Yarn-trunk/ws/hadoop-yarn-project/hadoop-yarn/hadoop-yarn-server/hadoop-yarn-server-resourcemanager/target/org/apache/hadoop/yarn/server/resourcemanager/scheduler/fifo/package-use.html...>
Generating <https://builds.apache.org/job/Hadoop-Yarn-trunk/ws/hadoop-yarn-project/hadoop-yarn/hadoop-yarn-server/hadoop-yarn-server-resourcemanager/target/org/apache/hadoop/yarn/server/resourcemanager/scheduler/policy/package-use.html...>
Generating <https://builds.apache.org/job/Hadoop-Yarn-trunk/ws/hadoop-yarn-project/hadoop-yarn/hadoop-yarn-server/hadoop-yarn-server-resourcemanager/target/org/apache/hadoop/yarn/server/resourcemanager/security/package-use.html...>
Generating <https://builds.apache.org/job/Hadoop-Yarn-trunk/ws/hadoop-yarn-project/hadoop-yarn/hadoop-yarn-server/hadoop-yarn-server-resourcemanager/target/org/apache/hadoop/yarn/server/resourcemanager/security/authorize/package-use.html...>
Generating <https://builds.apache.org/job/Hadoop-Yarn-trunk/ws/hadoop-yarn-project/hadoop-yarn/hadoop-yarn-server/hadoop-yarn-server-resourcemanager/target/org/apache/hadoop/yarn/server/resourcemanager/webapp/package-use.html...>
Generating <https://builds.apache.org/job/Hadoop-Yarn-trunk/ws/hadoop-yarn-project/hadoop-yarn/hadoop-yarn-server/hadoop-yarn-server-resourcemanager/target/org/apache/hadoop/yarn/server/resourcemanager/webapp/dao/package-use.html...>
Building index for all the packages and classes...
Generating <https://builds.apache.org/job/Hadoop-Yarn-trunk/ws/hadoop-yarn-project/hadoop-yarn/hadoop-yarn-server/hadoop-yarn-server-resourcemanager/target/overview-tree.html...>
Generating <https://builds.apache.org/job/Hadoop-Yarn-trunk/ws/hadoop-yarn-project/hadoop-yarn/hadoop-yarn-server/hadoop-yarn-server-resourcemanager/target/index-all.html...>
Generating <https://builds.apache.org/job/Hadoop-Yarn-trunk/ws/hadoop-yarn-project/hadoop-yarn/hadoop-yarn-server/hadoop-yarn-server-resourcemanager/target/deprecated-list.html...>
Building index for all classes...
Generating <https://builds.apache.org/job/Hadoop-Yarn-trunk/ws/hadoop-yarn-project/hadoop-yarn/hadoop-yarn-server/hadoop-yarn-server-resourcemanager/target/allclasses-frame.html...>
Generating <https://builds.apache.org/job/Hadoop-Yarn-trunk/ws/hadoop-yarn-project/hadoop-yarn/hadoop-yarn-server/hadoop-yarn-server-resourcemanager/target/allclasses-noframe.html...>
Generating <https://builds.apache.org/job/Hadoop-Yarn-trunk/ws/hadoop-yarn-project/hadoop-yarn/hadoop-yarn-server/hadoop-yarn-server-resourcemanager/target/index.html...>
Generating <https://builds.apache.org/job/Hadoop-Yarn-trunk/ws/hadoop-yarn-project/hadoop-yarn/hadoop-yarn-server/hadoop-yarn-server-resourcemanager/target/overview-summary.html...>
Generating <https://builds.apache.org/job/Hadoop-Yarn-trunk/ws/hadoop-yarn-project/hadoop-yarn/hadoop-yarn-server/hadoop-yarn-server-resourcemanager/target/help-doc.html...>
2 warnings
[WARNING] Javadoc Warnings
[WARNING] <https://builds.apache.org/job/Hadoop-Yarn-trunk/ws/hadoop-yarn-project/hadoop-yarn/hadoop-yarn-server/hadoop-yarn-server-resourcemanager/src/main/java/org/apache/hadoop/yarn/server/resourcemanager/ClientRMService.java>:303: warning - @return tag has no arguments.
[WARNING] <https://builds.apache.org/job/Hadoop-Yarn-trunk/ws/hadoop-yarn-project/hadoop-yarn/hadoop-yarn-server/hadoop-yarn-server-resourcemanager/src/main/java/org/apache/hadoop/yarn/server/resourcemanager/webapp/RMWebServices.java>:1607: warning - @return tag has no arguments.
[INFO] Building jar: <https://builds.apache.org/job/Hadoop-Yarn-trunk/ws/hadoop-yarn-project/hadoop-yarn/hadoop-yarn-server/hadoop-yarn-server-resourcemanager/target/hadoop-yarn-server-resourcemanager-3.0.0-SNAPSHOT-javadoc.jar>
[INFO]
[INFO] --- maven-enforcer-plugin:1.3.1:enforce (depcheck) @ hadoop-yarn-server-resourcemanager ---
[INFO]
[INFO] --- maven-checkstyle-plugin:2.15:checkstyle (default-cli) @ hadoop-yarn-server-resourcemanager ---
[INFO] There are 5419 errors reported by Checkstyle 6.6 with checkstyle/checkstyle.xml ruleset.
[WARNING] Unable to locate Source XRef to link to - DISABLED
[INFO]
[INFO] --- findbugs-maven-plugin:3.0.0:findbugs (default-cli) @ hadoop-yarn-server-resourcemanager ---
[INFO] Fork Value is true
[INFO] Done FindBugs Analysis....
[INFO]
[INFO] ------------------------------------------------------------------------
[INFO] Building Apache Hadoop YARN Server Tests 3.0.0-SNAPSHOT
[INFO] ------------------------------------------------------------------------
[INFO]
[INFO] --- maven-clean-plugin:2.5:clean (default-clean) @ hadoop-yarn-server-tests ---
[INFO] Deleting <https://builds.apache.org/job/Hadoop-Yarn-trunk/ws/hadoop-yarn-project/hadoop-yarn/hadoop-yarn-server/hadoop-yarn-server-tests/target>
[INFO]
[INFO] --- maven-antrun-plugin:1.7:run (create-testdirs) @ hadoop-yarn-server-tests ---
[INFO] Executing tasks
main:
[mkdir] Created dir: <https://builds.apache.org/job/Hadoop-Yarn-trunk/ws/hadoop-yarn-project/hadoop-yarn/hadoop-yarn-server/hadoop-yarn-server-tests/target/test-dir>
[INFO] Executed tasks
[INFO]
[INFO] --- hadoop-maven-plugins:3.0.0-SNAPSHOT:protoc (compile-protoc) @ hadoop-yarn-server-tests ---
[INFO] Wrote protoc checksums to file <https://builds.apache.org/job/Hadoop-Yarn-trunk/ws/hadoop-yarn-project/hadoop-yarn/hadoop-yarn-server/hadoop-yarn-server-tests/target/hadoop-maven-plugins-protoc-checksums.json>
[INFO]
[INFO] --- maven-resources-plugin:2.6:resources (default-resources) @ hadoop-yarn-server-tests ---
[INFO] Using 'UTF-8' encoding to copy filtered resources.
[INFO] skip non existing resourceDirectory <https://builds.apache.org/job/Hadoop-Yarn-trunk/ws/hadoop-yarn-project/hadoop-yarn/hadoop-yarn-server/hadoop-yarn-server-tests/src/main/resources>
[INFO]
[INFO] --- maven-compiler-plugin:3.1:compile (default-compile) @ hadoop-yarn-server-tests ---
[INFO] Compiling 1 source file to <https://builds.apache.org/job/Hadoop-Yarn-trunk/ws/hadoop-yarn-project/hadoop-yarn/hadoop-yarn-server/hadoop-yarn-server-tests/target/classes>
[INFO]
[INFO] --- maven-resources-plugin:2.6:testResources (default-testResources) @ hadoop-yarn-server-tests ---
[INFO] Using 'UTF-8' encoding to copy filtered resources.
[INFO] Copying 4 resources
[INFO]
[INFO] --- maven-compiler-plugin:3.1:testCompile (default-testCompile) @ hadoop-yarn-server-tests ---
[INFO] Compiling 9 source files to <https://builds.apache.org/job/Hadoop-Yarn-trunk/ws/hadoop-yarn-project/hadoop-yarn/hadoop-yarn-server/hadoop-yarn-server-tests/target/test-classes>
[WARNING] <https://builds.apache.org/job/Hadoop-Yarn-trunk/ws/hadoop-yarn-project/hadoop-yarn/hadoop-yarn-server/hadoop-yarn-server-tests/src/test/java/org/apache/hadoop/yarn/server/TestMiniYarnCluster.java>: <https://builds.apache.org/job/Hadoop-Yarn-trunk/ws/hadoop-yarn-project/hadoop-yarn/hadoop-yarn-server/hadoop-yarn-server-tests/src/test/java/org/apache/hadoop/yarn/server/TestMiniYarnCluster.java> uses or overrides a deprecated API.
[WARNING] <https://builds.apache.org/job/Hadoop-Yarn-trunk/ws/hadoop-yarn-project/hadoop-yarn/hadoop-yarn-server/hadoop-yarn-server-tests/src/test/java/org/apache/hadoop/yarn/server/TestMiniYarnCluster.java>: Recompile with -Xlint:deprecation for details.
[INFO]
[INFO] --- maven-jar-plugin:2.5:test-jar (default) @ hadoop-yarn-server-tests ---
[INFO] Building jar: <https://builds.apache.org/job/Hadoop-Yarn-trunk/ws/hadoop-yarn-project/hadoop-yarn/hadoop-yarn-server/hadoop-yarn-server-tests/target/hadoop-yarn-server-tests-3.0.0-SNAPSHOT-tests.jar>
[INFO]
[INFO] --- maven-surefire-plugin:2.17:test (default-test) @ hadoop-yarn-server-tests ---
[INFO] Surefire report directory: <https://builds.apache.org/job/Hadoop-Yarn-trunk/ws/hadoop-yarn-project/hadoop-yarn/hadoop-yarn-server/hadoop-yarn-server-tests/target/surefire-reports>
-------------------------------------------------------
T E S T S
-------------------------------------------------------
-------------------------------------------------------
T E S T S
-------------------------------------------------------
Running org.apache.hadoop.yarn.server.TestRMNMSecretKeys
Tests run: 1, Failures: 0, Errors: 0, Skipped: 0, Time elapsed: 2.508 sec - in org.apache.hadoop.yarn.server.TestRMNMSecretKeys
Running org.apache.hadoop.yarn.server.TestMiniYarnClusterNodeUtilization
Tests run: 2, Failures: 0, Errors: 1, Skipped: 0, Time elapsed: 27.691 sec <<< FAILURE! - in org.apache.hadoop.yarn.server.TestMiniYarnClusterNodeUtilization
testMockNodeStatusHeartbeat(org.apache.hadoop.yarn.server.TestMiniYarnClusterNodeUtilization) Time elapsed: 4.667 sec <<< ERROR!
java.lang.NullPointerException: null
at org.apache.hadoop.yarn.server.TestMiniYarnClusterNodeUtilization.verifySimulatedUtilization(TestMiniYarnClusterNodeUtilization.java:217)
at org.apache.hadoop.yarn.server.TestMiniYarnClusterNodeUtilization.testMockNodeStatusHeartbeat(TestMiniYarnClusterNodeUtilization.java:145)
Running org.apache.hadoop.yarn.server.TestMiniYARNClusterForHA
Tests run: 1, Failures: 0, Errors: 0, Skipped: 0, Time elapsed: 6.5 sec - in org.apache.hadoop.yarn.server.TestMiniYARNClusterForHA
Running org.apache.hadoop.yarn.server.TestMiniYarnCluster
Tests run: 2, Failures: 0, Errors: 0, Skipped: 0, Time elapsed: 14.361 sec - in org.apache.hadoop.yarn.server.TestMiniYarnCluster
Running org.apache.hadoop.yarn.server.TestContainerManagerSecurity
Tests run: 2, Failures: 0, Errors: 0, Skipped: 0, Time elapsed: 98.026 sec - in org.apache.hadoop.yarn.server.TestContainerManagerSecurity
Running org.apache.hadoop.yarn.server.TestDiskFailures
Tests run: 3, Failures: 0, Errors: 0, Skipped: 0, Time elapsed: 20.429 sec - in org.apache.hadoop.yarn.server.TestDiskFailures
Results :
Tests in error:
TestMiniYarnClusterNodeUtilization.testMockNodeStatusHeartbeat:145->verifySimulatedUtilization:217 NullPointer
Tests run: 11, Failures: 0, Errors: 1, Skipped: 0
[INFO] ------------------------------------------------------------------------
[INFO] Reactor Summary:
[INFO]
[INFO] Apache Hadoop YARN ................................ SUCCESS [ 4.559 s]
[INFO] Apache Hadoop YARN API ............................ SUCCESS [04:37 min]
[INFO] Apache Hadoop YARN Common ......................... SUCCESS [03:20 min]
[INFO] Apache Hadoop YARN Server ......................... SUCCESS [ 0.095 s]
[INFO] Apache Hadoop YARN Server Common .................. SUCCESS [ 50.008 s]
[INFO] Apache Hadoop YARN NodeManager .................... SUCCESS [10:16 min]
[INFO] Apache Hadoop YARN Web Proxy ...................... SUCCESS [ 27.943 s]
[INFO] Apache Hadoop YARN ApplicationHistoryService ...... SUCCESS [04:32 min]
[INFO] Apache Hadoop YARN ResourceManager ................ SUCCESS [ 01:19 h]
[INFO] Apache Hadoop YARN Server Tests ................... FAILURE [02:52 min]
[INFO] Apache Hadoop YARN Client ......................... SKIPPED
[INFO] Apache Hadoop YARN SharedCacheManager ............. SKIPPED
[INFO] Apache Hadoop YARN Timeline Plugin Storage ........ SKIPPED
[INFO] Apache Hadoop YARN Applications ................... SKIPPED
[INFO] Apache Hadoop YARN DistributedShell ............... SKIPPED
[INFO] Apache Hadoop YARN Unmanaged Am Launcher .......... SKIPPED
[INFO] Apache Hadoop YARN Site ........................... SKIPPED
[INFO] Apache Hadoop YARN Registry ....................... SKIPPED
[INFO] Apache Hadoop YARN Project ........................ SKIPPED
[INFO] ------------------------------------------------------------------------
[INFO] BUILD FAILURE
[INFO] ------------------------------------------------------------------------
[INFO] Total time: 01:46 h
[INFO] Finished at: 2016-02-12T03:48:25+00:00
[INFO] Final Memory: 69M/697M
[INFO] ------------------------------------------------------------------------
[ERROR] Failed to execute goal org.apache.maven.plugins:maven-surefire-plugin:2.17:test (default-test) on project hadoop-yarn-server-tests: There are test failures.
[ERROR]
[ERROR] Please refer to <https://builds.apache.org/job/Hadoop-Yarn-trunk/ws/hadoop-yarn-project/hadoop-yarn/hadoop-yarn-server/hadoop-yarn-server-tests/target/surefire-reports> for the individual test results.
[ERROR] -> [Help 1]
[ERROR]
[ERROR] To see the full stack trace of the errors, re-run Maven with the -e switch.
[ERROR] Re-run Maven using the -X switch to enable full debug logging.
[ERROR]
[ERROR] For more information about the errors and possible solutions, please read the following articles:
[ERROR] [Help 1] http://cwiki.apache.org/confluence/display/MAVEN/MojoFailureException
[ERROR]
[ERROR] After correcting the problems, you can resume the build with the command
[ERROR] mvn <goals> -rf :hadoop-yarn-server-tests
Build step 'Execute shell' marked build as failure
Archiving artifacts
Recording test results
Jenkins build is back to normal : Hadoop-Yarn-trunk #1759
Posted by Apache Jenkins Server <je...@builds.apache.org>.
See <https://builds.apache.org/job/Hadoop-Yarn-trunk/1759/changes>
Build failed in Jenkins: Hadoop-Yarn-trunk #1758
Posted by Apache Jenkins Server <je...@builds.apache.org>.
See <https://builds.apache.org/job/Hadoop-Yarn-trunk/1758/changes>
Changes:
[lei] HDFS-9795. OIV Delimited should show which files are ACL-enabled (lei)
[kasha] HDFS-9780. RollingFileSystemSink doesn't work on secure clusters.
[arp] HDFS-9790. HDFS Balancer should exit with a proper message if upgrade is
------------------------------------------
[...truncated 11383 lines...]
[INFO] Building jar: <https://builds.apache.org/job/Hadoop-Yarn-trunk/ws/hadoop-yarn-project/hadoop-yarn/hadoop-yarn-applications/hadoop-yarn-applications-unmanaged-am-launcher/target/hadoop-yarn-applications-unmanaged-am-launcher-3.0.0-SNAPSHOT-javadoc.jar>
[INFO]
[INFO] --- maven-enforcer-plugin:1.3.1:enforce (depcheck) @ hadoop-yarn-applications-unmanaged-am-launcher ---
[INFO]
[INFO] --- maven-checkstyle-plugin:2.15:checkstyle (default-cli) @ hadoop-yarn-applications-unmanaged-am-launcher ---
[INFO] There are 7 errors reported by Checkstyle 6.6 with checkstyle/checkstyle.xml ruleset.
[WARNING] Unable to locate Source XRef to link to - DISABLED
[INFO]
[INFO] --- findbugs-maven-plugin:3.0.0:findbugs (default-cli) @ hadoop-yarn-applications-unmanaged-am-launcher ---
[INFO] Fork Value is true
[INFO] Done FindBugs Analysis....
[INFO]
[INFO] ------------------------------------------------------------------------
[INFO] Building Apache Hadoop YARN Site 3.0.0-SNAPSHOT
[INFO] ------------------------------------------------------------------------
[INFO]
[INFO] --- maven-clean-plugin:2.5:clean (default-clean) @ hadoop-yarn-site ---
[INFO] Deleting <https://builds.apache.org/job/Hadoop-Yarn-trunk/ws/hadoop-yarn-project/hadoop-yarn/hadoop-yarn-site/target>
[INFO]
[INFO] --- maven-antrun-plugin:1.7:run (create-testdirs) @ hadoop-yarn-site ---
[INFO] Executing tasks
main:
[mkdir] Created dir: <https://builds.apache.org/job/Hadoop-Yarn-trunk/ws/hadoop-yarn-project/hadoop-yarn/hadoop-yarn-site/target/test-dir>
[INFO] Executed tasks
[INFO]
[INFO] --- maven-source-plugin:2.3:jar-no-fork (hadoop-java-sources) @ hadoop-yarn-site ---
[INFO]
[INFO] --- maven-source-plugin:2.3:test-jar-no-fork (hadoop-java-sources) @ hadoop-yarn-site ---
[INFO]
[INFO] --- maven-enforcer-plugin:1.3.1:enforce (dist-enforce) @ hadoop-yarn-site ---
[INFO]
[INFO] --- maven-site-plugin:3.4:attach-descriptor (attach-descriptor) @ hadoop-yarn-site ---
[INFO]
[INFO] --- maven-javadoc-plugin:2.8.1:jar (module-javadocs) @ hadoop-yarn-site ---
[INFO] Not executing Javadoc as the project is not a Java classpath-capable package
[INFO]
[INFO] --- maven-enforcer-plugin:1.3.1:enforce (depcheck) @ hadoop-yarn-site ---
[INFO]
[INFO] --- maven-checkstyle-plugin:2.15:checkstyle (default-cli) @ hadoop-yarn-site ---
[INFO]
[INFO] --- findbugs-maven-plugin:3.0.0:findbugs (default-cli) @ hadoop-yarn-site ---
[INFO]
[INFO] ------------------------------------------------------------------------
[INFO] Building Apache Hadoop YARN Registry 3.0.0-SNAPSHOT
[INFO] ------------------------------------------------------------------------
[INFO]
[INFO] --- maven-clean-plugin:2.5:clean (default-clean) @ hadoop-yarn-registry ---
[INFO] Deleting <https://builds.apache.org/job/Hadoop-Yarn-trunk/ws/hadoop-yarn-project/hadoop-yarn/hadoop-yarn-registry/target>
[INFO]
[INFO] --- maven-antrun-plugin:1.7:run (create-testdirs) @ hadoop-yarn-registry ---
[INFO] Executing tasks
main:
[mkdir] Created dir: <https://builds.apache.org/job/Hadoop-Yarn-trunk/ws/hadoop-yarn-project/hadoop-yarn/hadoop-yarn-registry/target/test-dir>
[INFO] Executed tasks
[INFO]
[INFO] --- hadoop-maven-plugins:3.0.0-SNAPSHOT:version-info (version-info) @ hadoop-yarn-registry ---
[WARNING] [svn, info] failed with error code 1
[INFO] SCM: GIT
[INFO] Computed MD5: 28f6fc852c49e6eeaca47a3f71afad9a
[INFO]
[INFO] --- maven-resources-plugin:2.6:resources (default-resources) @ hadoop-yarn-registry ---
[INFO] Using 'UTF-8' encoding to copy filtered resources.
[INFO] Copying 1 resource
[INFO] Copying 0 resource
[INFO]
[INFO] --- maven-compiler-plugin:3.1:compile (default-compile) @ hadoop-yarn-registry ---
[INFO] Compiling 48 source files to <https://builds.apache.org/job/Hadoop-Yarn-trunk/ws/hadoop-yarn-project/hadoop-yarn/hadoop-yarn-registry/target/classes>
[WARNING] <https://builds.apache.org/job/Hadoop-Yarn-trunk/ws/hadoop-yarn-project/hadoop-yarn/hadoop-yarn-registry/src/main/java/org/apache/hadoop/registry/client/types/Endpoint.java>: <https://builds.apache.org/job/Hadoop-Yarn-trunk/ws/hadoop-yarn-project/hadoop-yarn/hadoop-yarn-registry/src/main/java/org/apache/hadoop/registry/client/types/Endpoint.java> uses unchecked or unsafe operations.
[WARNING] <https://builds.apache.org/job/Hadoop-Yarn-trunk/ws/hadoop-yarn-project/hadoop-yarn/hadoop-yarn-registry/src/main/java/org/apache/hadoop/registry/client/types/Endpoint.java>: Recompile with -Xlint:unchecked for details.
[INFO]
[INFO] --- maven-resources-plugin:2.6:testResources (default-testResources) @ hadoop-yarn-registry ---
[INFO] Using 'UTF-8' encoding to copy filtered resources.
[INFO] Copying 1 resource
[INFO]
[INFO] --- maven-compiler-plugin:3.1:testCompile (default-testCompile) @ hadoop-yarn-registry ---
[INFO] Compiling 19 source files to <https://builds.apache.org/job/Hadoop-Yarn-trunk/ws/hadoop-yarn-project/hadoop-yarn/hadoop-yarn-registry/target/test-classes>
[INFO]
[INFO] --- maven-jar-plugin:2.5:test-jar (default) @ hadoop-yarn-registry ---
[INFO] Building jar: <https://builds.apache.org/job/Hadoop-Yarn-trunk/ws/hadoop-yarn-project/hadoop-yarn/hadoop-yarn-registry/target/hadoop-yarn-registry-3.0.0-SNAPSHOT-tests.jar>
[INFO]
[INFO] --- maven-surefire-plugin:2.17:test (default-test) @ hadoop-yarn-registry ---
[INFO] Surefire report directory: <https://builds.apache.org/job/Hadoop-Yarn-trunk/ws/hadoop-yarn-project/hadoop-yarn/hadoop-yarn-registry/target/surefire-reports>
-------------------------------------------------------
T E S T S
-------------------------------------------------------
-------------------------------------------------------
T E S T S
-------------------------------------------------------
Running org.apache.hadoop.registry.integration.TestRegistryRMOperations
Tests run: 5, Failures: 0, Errors: 0, Skipped: 0, Time elapsed: 4.648 sec - in org.apache.hadoop.registry.integration.TestRegistryRMOperations
Running org.apache.hadoop.registry.integration.TestYarnPolicySelector
Tests run: 3, Failures: 0, Errors: 0, Skipped: 0, Time elapsed: 0.405 sec - in org.apache.hadoop.registry.integration.TestYarnPolicySelector
Running org.apache.hadoop.registry.cli.TestRegistryCli
Tests run: 6, Failures: 0, Errors: 0, Skipped: 0, Time elapsed: 3.995 sec - in org.apache.hadoop.registry.cli.TestRegistryCli
Running org.apache.hadoop.registry.secure.TestSecureRMRegistryOperations
Tests run: 12, Failures: 0, Errors: 0, Skipped: 0, Time elapsed: 26.916 sec - in org.apache.hadoop.registry.secure.TestSecureRMRegistryOperations
Running org.apache.hadoop.registry.secure.TestRegistrySecurityHelper
Tests run: 12, Failures: 0, Errors: 0, Skipped: 0, Time elapsed: 0.816 sec - in org.apache.hadoop.registry.secure.TestRegistrySecurityHelper
Running org.apache.hadoop.registry.secure.TestSecureRegistry
Tests run: 4, Failures: 0, Errors: 0, Skipped: 0, Time elapsed: 28.88 sec - in org.apache.hadoop.registry.secure.TestSecureRegistry
Running org.apache.hadoop.registry.secure.TestSecureLogins
Tests run: 1, Failures: 0, Errors: 1, Skipped: 0, Time elapsed: 13.598 sec <<< FAILURE! - in org.apache.hadoop.registry.secure.TestSecureLogins
org.apache.hadoop.registry.secure.TestSecureLogins Time elapsed: 13.598 sec <<< ERROR!
java.io.IOException: Can not read resource file 'minikdc.ldiff'
at org.apache.hadoop.minikdc.MiniKdc.getResourceAsStream(MiniKdc.java:407)
at org.apache.hadoop.minikdc.MiniKdc.initKDCServer(MiniKdc.java:424)
at org.apache.hadoop.minikdc.MiniKdc.start(MiniKdc.java:315)
at org.apache.hadoop.registry.secure.AbstractSecureRegistryTest.setupKDCAndPrincipals(AbstractSecureRegistryTest.java:204)
at org.apache.hadoop.registry.secure.AbstractSecureRegistryTest.beforeSecureRegistryTestClass(AbstractSecureRegistryTest.java:133)
at sun.reflect.NativeMethodAccessorImpl.invoke0(Native Method)
at sun.reflect.NativeMethodAccessorImpl.invoke(NativeMethodAccessorImpl.java:57)
at sun.reflect.DelegatingMethodAccessorImpl.invoke(DelegatingMethodAccessorImpl.java:43)
at java.lang.reflect.Method.invoke(Method.java:606)
at org.junit.runners.model.FrameworkMethod$1.runReflectiveCall(FrameworkMethod.java:47)
at org.junit.internal.runners.model.ReflectiveCallable.run(ReflectiveCallable.java:12)
at org.junit.runners.model.FrameworkMethod.invokeExplosively(FrameworkMethod.java:44)
at org.junit.internal.runners.statements.RunBefores.evaluate(RunBefores.java:24)
at org.junit.internal.runners.statements.RunAfters.evaluate(RunAfters.java:27)
at org.junit.runners.ParentRunner.run(ParentRunner.java:309)
at org.apache.maven.surefire.junit4.JUnit4Provider.execute(JUnit4Provider.java:264)
at org.apache.maven.surefire.junit4.JUnit4Provider.executeTestSet(JUnit4Provider.java:153)
at org.apache.maven.surefire.junit4.JUnit4Provider.invoke(JUnit4Provider.java:124)
at org.apache.maven.surefire.booter.ForkedBooter.invokeProviderInSameClassLoader(ForkedBooter.java:200)
at org.apache.maven.surefire.booter.ForkedBooter.runSuitesInProcess(ForkedBooter.java:153)
at org.apache.maven.surefire.booter.ForkedBooter.main(ForkedBooter.java:103)
Running org.apache.hadoop.registry.operations.TestRegistryOperations
Tests run: 24, Failures: 0, Errors: 0, Skipped: 0, Time elapsed: 9.703 sec - in org.apache.hadoop.registry.operations.TestRegistryOperations
Running org.apache.hadoop.registry.client.binding.TestRegistryOperationUtils
Tests run: 3, Failures: 0, Errors: 0, Skipped: 0, Time elapsed: 0.669 sec - in org.apache.hadoop.registry.client.binding.TestRegistryOperationUtils
Running org.apache.hadoop.registry.client.binding.TestMarshalling
Tests run: 10, Failures: 0, Errors: 0, Skipped: 0, Time elapsed: 0.632 sec - in org.apache.hadoop.registry.client.binding.TestMarshalling
Running org.apache.hadoop.registry.client.binding.TestRegistryPathUtils
Tests run: 13, Failures: 0, Errors: 0, Skipped: 0, Time elapsed: 0.387 sec - in org.apache.hadoop.registry.client.binding.TestRegistryPathUtils
Running org.apache.hadoop.registry.client.impl.TestMicroZookeeperService
Tests run: 1, Failures: 0, Errors: 0, Skipped: 0, Time elapsed: 0.72 sec - in org.apache.hadoop.registry.client.impl.TestMicroZookeeperService
Running org.apache.hadoop.registry.client.impl.TestCuratorService
Tests run: 1, Failures: 0, Errors: 1, Skipped: 0, Time elapsed: 0.761 sec <<< FAILURE! - in org.apache.hadoop.registry.client.impl.TestCuratorService
org.apache.hadoop.registry.client.impl.TestCuratorService Time elapsed: 0.761 sec <<< ERROR!
java.lang.RuntimeException: org.xml.sax.SAXParseException; systemId: jar:file:/home/jenkins/.m2/repository/org/apache/hadoop/hadoop-common/3.0.0-SNAPSHOT/hadoop-common-3.0.0-SNAPSHOT.jar!/core-default.xml; lineNumber: 904; columnNumber: 3; The element type "description" must be terminated by the matching end-tag "</description>".
at org.apache.hadoop.conf.Configuration.loadResource(Configuration.java:2735)
at org.apache.hadoop.conf.Configuration.loadResources(Configuration.java:2567)
at org.apache.hadoop.conf.Configuration.getProps(Configuration.java:2471)
at org.apache.hadoop.conf.Configuration.set(Configuration.java:1207)
at org.apache.hadoop.conf.Configuration.set(Configuration.java:1179)
at org.apache.hadoop.registry.AbstractZKRegistryTest.createZKServer(AbstractZKRegistryTest.java:80)
at sun.reflect.NativeMethodAccessorImpl.invoke0(Native Method)
at sun.reflect.NativeMethodAccessorImpl.invoke(NativeMethodAccessorImpl.java:57)
at sun.reflect.DelegatingMethodAccessorImpl.invoke(DelegatingMethodAccessorImpl.java:43)
at java.lang.reflect.Method.invoke(Method.java:606)
at org.junit.runners.model.FrameworkMethod$1.runReflectiveCall(FrameworkMethod.java:47)
at org.junit.internal.runners.model.ReflectiveCallable.run(ReflectiveCallable.java:12)
at org.junit.runners.model.FrameworkMethod.invokeExplosively(FrameworkMethod.java:44)
at org.junit.internal.runners.statements.RunBefores.evaluate(RunBefores.java:24)
at org.junit.internal.runners.statements.RunAfters.evaluate(RunAfters.java:27)
at org.junit.runners.ParentRunner.run(ParentRunner.java:309)
at org.apache.maven.surefire.junit4.JUnit4Provider.execute(JUnit4Provider.java:264)
at org.apache.maven.surefire.junit4.JUnit4Provider.executeTestSet(JUnit4Provider.java:153)
at org.apache.maven.surefire.junit4.JUnit4Provider.invoke(JUnit4Provider.java:124)
at org.apache.maven.surefire.booter.ForkedBooter.invokeProviderInSameClassLoader(ForkedBooter.java:200)
at org.apache.maven.surefire.booter.ForkedBooter.runSuitesInProcess(ForkedBooter.java:153)
at org.apache.maven.surefire.booter.ForkedBooter.main(ForkedBooter.java:103)
Caused by: org.xml.sax.SAXParseException: The element type "description" must be terminated by the matching end-tag "</description>".
at com.sun.org.apache.xerces.internal.parsers.DOMParser.parse(DOMParser.java:257)
at com.sun.org.apache.xerces.internal.jaxp.DocumentBuilderImpl.parse(DocumentBuilderImpl.java:347)
at javax.xml.parsers.DocumentBuilder.parse(DocumentBuilder.java:150)
at org.apache.hadoop.conf.Configuration.parse(Configuration.java:2555)
at org.apache.hadoop.conf.Configuration.parse(Configuration.java:2543)
at org.apache.hadoop.conf.Configuration.loadResource(Configuration.java:2614)
at org.apache.hadoop.conf.Configuration.loadResources(Configuration.java:2567)
at org.apache.hadoop.conf.Configuration.getProps(Configuration.java:2471)
at org.apache.hadoop.conf.Configuration.set(Configuration.java:1207)
at org.apache.hadoop.conf.Configuration.set(Configuration.java:1179)
at org.apache.hadoop.registry.AbstractZKRegistryTest.createZKServer(AbstractZKRegistryTest.java:80)
at sun.reflect.NativeMethodAccessorImpl.invoke0(Native Method)
at sun.reflect.NativeMethodAccessorImpl.invoke(NativeMethodAccessorImpl.java:57)
at sun.reflect.DelegatingMethodAccessorImpl.invoke(DelegatingMethodAccessorImpl.java:43)
at java.lang.reflect.Method.invoke(Method.java:606)
at org.junit.runners.model.FrameworkMethod$1.runReflectiveCall(FrameworkMethod.java:47)
at org.junit.internal.runners.model.ReflectiveCallable.run(ReflectiveCallable.java:12)
at org.junit.runners.model.FrameworkMethod.invokeExplosively(FrameworkMethod.java:44)
at org.junit.internal.runners.statements.RunBefores.evaluate(RunBefores.java:24)
at org.junit.internal.runners.statements.RunAfters.evaluate(RunAfters.java:27)
at org.junit.runners.ParentRunner.run(ParentRunner.java:309)
at org.apache.maven.surefire.junit4.JUnit4Provider.execute(JUnit4Provider.java:264)
at org.apache.maven.surefire.junit4.JUnit4Provider.executeTestSet(JUnit4Provider.java:153)
at org.apache.maven.surefire.junit4.JUnit4Provider.invoke(JUnit4Provider.java:124)
at org.apache.maven.surefire.booter.ForkedBooter.invokeProviderInSameClassLoader(ForkedBooter.java:200)
at org.apache.maven.surefire.booter.ForkedBooter.runSuitesInProcess(ForkedBooter.java:153)
at org.apache.maven.surefire.booter.ForkedBooter.main(ForkedBooter.java:103)
Results :
Tests in error:
TestSecureLogins>AbstractSecureRegistryTest.beforeSecureRegistryTestClass:133->AbstractSecureRegistryTest.setupKDCAndPrincipals:204 » IO
TestCuratorService>AbstractZKRegistryTest.createZKServer:80 » Runtime org.xml....
Tests run: 95, Failures: 0, Errors: 2, Skipped: 0
[INFO] ------------------------------------------------------------------------
[INFO] Reactor Summary:
[INFO]
[INFO] Apache Hadoop YARN ................................ SUCCESS [ 3.306 s]
[INFO] Apache Hadoop YARN API ............................ SUCCESS [04:19 min]
[INFO] Apache Hadoop YARN Common ......................... SUCCESS [03:00 min]
[INFO] Apache Hadoop YARN Server ......................... SUCCESS [ 0.092 s]
[INFO] Apache Hadoop YARN Server Common .................. SUCCESS [ 46.495 s]
[INFO] Apache Hadoop YARN NodeManager .................... SUCCESS [09:37 min]
[INFO] Apache Hadoop YARN Web Proxy ...................... SUCCESS [ 25.317 s]
[INFO] Apache Hadoop YARN ApplicationHistoryService ...... SUCCESS [04:07 min]
[INFO] Apache Hadoop YARN ResourceManager ................ SUCCESS [ 01:13 h]
[INFO] Apache Hadoop YARN Server Tests ................... SUCCESS [03:03 min]
[INFO] Apache Hadoop YARN Client ......................... SUCCESS [08:05 min]
[INFO] Apache Hadoop YARN SharedCacheManager ............. SUCCESS [ 26.942 s]
[INFO] Apache Hadoop YARN Timeline Plugin Storage ........ SUCCESS [ 56.613 s]
[INFO] Apache Hadoop YARN Applications ................... SUCCESS [ 0.054 s]
[INFO] Apache Hadoop YARN DistributedShell ............... SUCCESS [07:02 min]
[INFO] Apache Hadoop YARN Unmanaged Am Launcher .......... SUCCESS [ 36.582 s]
[INFO] Apache Hadoop YARN Site ........................... SUCCESS [ 0.056 s]
[INFO] Apache Hadoop YARN Registry ....................... FAILURE [01:36 min]
[INFO] Apache Hadoop YARN Project ........................ SKIPPED
[INFO] ------------------------------------------------------------------------
[INFO] BUILD FAILURE
[INFO] ------------------------------------------------------------------------
[INFO] Total time: 01:57 h
[INFO] Finished at: 2016-02-12T06:56:34+00:00
[INFO] Final Memory: 83M/611M
[INFO] ------------------------------------------------------------------------
[ERROR] Failed to execute goal org.apache.maven.plugins:maven-surefire-plugin:2.17:test (default-test) on project hadoop-yarn-registry: There are test failures.
[ERROR]
[ERROR] Please refer to <https://builds.apache.org/job/Hadoop-Yarn-trunk/ws/hadoop-yarn-project/hadoop-yarn/hadoop-yarn-registry/target/surefire-reports> for the individual test results.
[ERROR] -> [Help 1]
[ERROR]
[ERROR] To see the full stack trace of the errors, re-run Maven with the -e switch.
[ERROR] Re-run Maven using the -X switch to enable full debug logging.
[ERROR]
[ERROR] For more information about the errors and possible solutions, please read the following articles:
[ERROR] [Help 1] http://cwiki.apache.org/confluence/display/MAVEN/MojoFailureException
[ERROR]
[ERROR] After correcting the problems, you can resume the build with the command
[ERROR] mvn <goals> -rf :hadoop-yarn-registry
Build step 'Execute shell' marked build as failure
Archiving artifacts
Recording test results
Hadoop-Yarn-trunk - Build # 1758 - Still Failing
Posted by Apache Jenkins Server <je...@builds.apache.org>.
See https://builds.apache.org/job/Hadoop-Yarn-trunk/1758/
###################################################################################
########################## LAST 60 LINES OF THE CONSOLE ###########################
[...truncated 11576 lines...]
at org.apache.maven.surefire.booter.ForkedBooter.main(ForkedBooter.java:103)
Results :
Tests in error:
TestSecureLogins>AbstractSecureRegistryTest.beforeSecureRegistryTestClass:133->AbstractSecureRegistryTest.setupKDCAndPrincipals:204 » IO
TestCuratorService>AbstractZKRegistryTest.createZKServer:80 » Runtime org.xml....
Tests run: 95, Failures: 0, Errors: 2, Skipped: 0
[INFO] ------------------------------------------------------------------------
[INFO] Reactor Summary:
[INFO]
[INFO] Apache Hadoop YARN ................................ SUCCESS [ 3.306 s]
[INFO] Apache Hadoop YARN API ............................ SUCCESS [04:19 min]
[INFO] Apache Hadoop YARN Common ......................... SUCCESS [03:00 min]
[INFO] Apache Hadoop YARN Server ......................... SUCCESS [ 0.092 s]
[INFO] Apache Hadoop YARN Server Common .................. SUCCESS [ 46.495 s]
[INFO] Apache Hadoop YARN NodeManager .................... SUCCESS [09:37 min]
[INFO] Apache Hadoop YARN Web Proxy ...................... SUCCESS [ 25.317 s]
[INFO] Apache Hadoop YARN ApplicationHistoryService ...... SUCCESS [04:07 min]
[INFO] Apache Hadoop YARN ResourceManager ................ SUCCESS [ 01:13 h]
[INFO] Apache Hadoop YARN Server Tests ................... SUCCESS [03:03 min]
[INFO] Apache Hadoop YARN Client ......................... SUCCESS [08:05 min]
[INFO] Apache Hadoop YARN SharedCacheManager ............. SUCCESS [ 26.942 s]
[INFO] Apache Hadoop YARN Timeline Plugin Storage ........ SUCCESS [ 56.613 s]
[INFO] Apache Hadoop YARN Applications ................... SUCCESS [ 0.054 s]
[INFO] Apache Hadoop YARN DistributedShell ............... SUCCESS [07:02 min]
[INFO] Apache Hadoop YARN Unmanaged Am Launcher .......... SUCCESS [ 36.582 s]
[INFO] Apache Hadoop YARN Site ........................... SUCCESS [ 0.056 s]
[INFO] Apache Hadoop YARN Registry ....................... FAILURE [01:36 min]
[INFO] Apache Hadoop YARN Project ........................ SKIPPED
[INFO] ------------------------------------------------------------------------
[INFO] BUILD FAILURE
[INFO] ------------------------------------------------------------------------
[INFO] Total time: 01:57 h
[INFO] Finished at: 2016-02-12T06:56:34+00:00
[INFO] Final Memory: 83M/611M
[INFO] ------------------------------------------------------------------------
[ERROR] Failed to execute goal org.apache.maven.plugins:maven-surefire-plugin:2.17:test (default-test) on project hadoop-yarn-registry: There are test failures.
[ERROR]
[ERROR] Please refer to /home/jenkins/jenkins-slave/workspace/Hadoop-Yarn-trunk/hadoop-yarn-project/hadoop-yarn/hadoop-yarn-registry/target/surefire-reports for the individual test results.
[ERROR] -> [Help 1]
[ERROR]
[ERROR] To see the full stack trace of the errors, re-run Maven with the -e switch.
[ERROR] Re-run Maven using the -X switch to enable full debug logging.
[ERROR]
[ERROR] For more information about the errors and possible solutions, please read the following articles:
[ERROR] [Help 1] http://cwiki.apache.org/confluence/display/MAVEN/MojoFailureException
[ERROR]
[ERROR] After correcting the problems, you can resume the build with the command
[ERROR] mvn <goals> -rf :hadoop-yarn-registry
Build step 'Execute shell' marked build as failure
Archiving artifacts
Recording test results
Sending e-mails to: yarn-dev@hadoop.apache.org
Email was triggered for: Failure - Any
Sending email for trigger: Failure - Any
###################################################################################
############################## FAILED TESTS (if any) ##############################
2 tests failed.
FAILED: org.apache.hadoop.registry.client.impl.TestCuratorService.org.apache.hadoop.registry.client.impl.TestCuratorService
Error Message:
org.xml.sax.SAXParseException; systemId: jar:file:/home/jenkins/.m2/repository/org/apache/hadoop/hadoop-common/3.0.0-SNAPSHOT/hadoop-common-3.0.0-SNAPSHOT.jar!/core-default.xml; lineNumber: 904; columnNumber: 3; The element type "description" must be terminated by the matching end-tag "</description>".
Stack Trace:
java.lang.RuntimeException: org.xml.sax.SAXParseException; systemId: jar:file:/home/jenkins/.m2/repository/org/apache/hadoop/hadoop-common/3.0.0-SNAPSHOT/hadoop-common-3.0.0-SNAPSHOT.jar!/core-default.xml; lineNumber: 904; columnNumber: 3; The element type "description" must be terminated by the matching end-tag "</description>".
at org.apache.hadoop.conf.Configuration.loadResource(Configuration.java:2735)
at org.apache.hadoop.conf.Configuration.loadResources(Configuration.java:2567)
at org.apache.hadoop.conf.Configuration.getProps(Configuration.java:2471)
at org.apache.hadoop.conf.Configuration.set(Configuration.java:1207)
at org.apache.hadoop.conf.Configuration.set(Configuration.java:1179)
at org.apache.hadoop.registry.AbstractZKRegistryTest.createZKServer(AbstractZKRegistryTest.java:80)
at sun.reflect.NativeMethodAccessorImpl.invoke0(Native Method)
at sun.reflect.NativeMethodAccessorImpl.invoke(NativeMethodAccessorImpl.java:57)
at sun.reflect.DelegatingMethodAccessorImpl.invoke(DelegatingMethodAccessorImpl.java:43)
at java.lang.reflect.Method.invoke(Method.java:606)
at org.junit.runners.model.FrameworkMethod$1.runReflectiveCall(FrameworkMethod.java:47)
at org.junit.internal.runners.model.ReflectiveCallable.run(ReflectiveCallable.java:12)
at org.junit.runners.model.FrameworkMethod.invokeExplosively(FrameworkMethod.java:44)
at org.junit.internal.runners.statements.RunBefores.evaluate(RunBefores.java:24)
at org.junit.internal.runners.statements.RunAfters.evaluate(RunAfters.java:27)
at org.junit.runners.ParentRunner.run(ParentRunner.java:309)
at org.apache.maven.surefire.junit4.JUnit4Provider.execute(JUnit4Provider.java:264)
at org.apache.maven.surefire.junit4.JUnit4Provider.executeTestSet(JUnit4Provider.java:153)
at org.apache.maven.surefire.junit4.JUnit4Provider.invoke(JUnit4Provider.java:124)
at org.apache.maven.surefire.booter.ForkedBooter.invokeProviderInSameClassLoader(ForkedBooter.java:200)
at org.apache.maven.surefire.booter.ForkedBooter.runSuitesInProcess(ForkedBooter.java:153)
at org.apache.maven.surefire.booter.ForkedBooter.main(ForkedBooter.java:103)
Caused by: org.xml.sax.SAXParseException: The element type "description" must be terminated by the matching end-tag "</description>".
at com.sun.org.apache.xerces.internal.parsers.DOMParser.parse(DOMParser.java:257)
at com.sun.org.apache.xerces.internal.jaxp.DocumentBuilderImpl.parse(DocumentBuilderImpl.java:347)
at javax.xml.parsers.DocumentBuilder.parse(DocumentBuilder.java:150)
at org.apache.hadoop.conf.Configuration.parse(Configuration.java:2555)
at org.apache.hadoop.conf.Configuration.parse(Configuration.java:2543)
at org.apache.hadoop.conf.Configuration.loadResource(Configuration.java:2614)
at org.apache.hadoop.conf.Configuration.loadResources(Configuration.java:2567)
at org.apache.hadoop.conf.Configuration.getProps(Configuration.java:2471)
at org.apache.hadoop.conf.Configuration.set(Configuration.java:1207)
at org.apache.hadoop.conf.Configuration.set(Configuration.java:1179)
at org.apache.hadoop.registry.AbstractZKRegistryTest.createZKServer(AbstractZKRegistryTest.java:80)
at sun.reflect.NativeMethodAccessorImpl.invoke0(Native Method)
at sun.reflect.NativeMethodAccessorImpl.invoke(NativeMethodAccessorImpl.java:57)
at sun.reflect.DelegatingMethodAccessorImpl.invoke(DelegatingMethodAccessorImpl.java:43)
at java.lang.reflect.Method.invoke(Method.java:606)
at org.junit.runners.model.FrameworkMethod$1.runReflectiveCall(FrameworkMethod.java:47)
at org.junit.internal.runners.model.ReflectiveCallable.run(ReflectiveCallable.java:12)
at org.junit.runners.model.FrameworkMethod.invokeExplosively(FrameworkMethod.java:44)
at org.junit.internal.runners.statements.RunBefores.evaluate(RunBefores.java:24)
at org.junit.internal.runners.statements.RunAfters.evaluate(RunAfters.java:27)
at org.junit.runners.ParentRunner.run(ParentRunner.java:309)
at org.apache.maven.surefire.junit4.JUnit4Provider.execute(JUnit4Provider.java:264)
at org.apache.maven.surefire.junit4.JUnit4Provider.executeTestSet(JUnit4Provider.java:153)
at org.apache.maven.surefire.junit4.JUnit4Provider.invoke(JUnit4Provider.java:124)
at org.apache.maven.surefire.booter.ForkedBooter.invokeProviderInSameClassLoader(ForkedBooter.java:200)
at org.apache.maven.surefire.booter.ForkedBooter.runSuitesInProcess(ForkedBooter.java:153)
at org.apache.maven.surefire.booter.ForkedBooter.main(ForkedBooter.java:103)
FAILED: org.apache.hadoop.registry.secure.TestSecureLogins.org.apache.hadoop.registry.secure.TestSecureLogins
Error Message:
Can not read resource file 'minikdc.ldiff'
Stack Trace:
java.io.IOException: Can not read resource file 'minikdc.ldiff'
at org.apache.hadoop.minikdc.MiniKdc.getResourceAsStream(MiniKdc.java:407)
at org.apache.hadoop.minikdc.MiniKdc.initKDCServer(MiniKdc.java:424)
at org.apache.hadoop.minikdc.MiniKdc.start(MiniKdc.java:315)
at org.apache.hadoop.registry.secure.AbstractSecureRegistryTest.setupKDCAndPrincipals(AbstractSecureRegistryTest.java:204)
at org.apache.hadoop.registry.secure.AbstractSecureRegistryTest.beforeSecureRegistryTestClass(AbstractSecureRegistryTest.java:133)
at sun.reflect.NativeMethodAccessorImpl.invoke0(Native Method)
at sun.reflect.NativeMethodAccessorImpl.invoke(NativeMethodAccessorImpl.java:57)
at sun.reflect.DelegatingMethodAccessorImpl.invoke(DelegatingMethodAccessorImpl.java:43)
at java.lang.reflect.Method.invoke(Method.java:606)
at org.junit.runners.model.FrameworkMethod$1.runReflectiveCall(FrameworkMethod.java:47)
at org.junit.internal.runners.model.ReflectiveCallable.run(ReflectiveCallable.java:12)
at org.junit.runners.model.FrameworkMethod.invokeExplosively(FrameworkMethod.java:44)
at org.junit.internal.runners.statements.RunBefores.evaluate(RunBefores.java:24)
at org.junit.internal.runners.statements.RunAfters.evaluate(RunAfters.java:27)
at org.junit.runners.ParentRunner.run(ParentRunner.java:309)
at org.apache.maven.surefire.junit4.JUnit4Provider.execute(JUnit4Provider.java:264)
at org.apache.maven.surefire.junit4.JUnit4Provider.executeTestSet(JUnit4Provider.java:153)
at org.apache.maven.surefire.junit4.JUnit4Provider.invoke(JUnit4Provider.java:124)
at org.apache.maven.surefire.booter.ForkedBooter.invokeProviderInSameClassLoader(ForkedBooter.java:200)
at org.apache.maven.surefire.booter.ForkedBooter.runSuitesInProcess(ForkedBooter.java:153)
at org.apache.maven.surefire.booter.ForkedBooter.main(ForkedBooter.java:103)