You are viewing a plain text version of this content. The canonical link for it is here.
Posted to dev@pdfbox.apache.org by Apache Jenkins Server <je...@builds.apache.org> on 2026/06/19 04:24:38 UTC

Build failed in Jenkins: PDFBox » PDFBox-trunk #3275

See <https://ci-builds.apache.org/job/PDFBox/job/PDFBox-trunk/3275/display/redirect>

Changes:


------------------------------------------
[...truncated 2.49 KiB...]
[HUDSON] Collecting dependencies info
[HUDSON] Collecting dependencies info
[INFO] Apache PDFBox parent                                               [pom]
[INFO] Apache PDFBox io                                                [bundle]
[INFO] Apache FontBox                                                  [bundle]
[INFO] Apache XmpBox                                                   [bundle]
[INFO] Apache PDFBox                                                   [bundle]
[INFO] Apache PDFBox Debugger                                             [jar]
[INFO] Apache PDFBox tools                                                [jar]
[INFO] Apache PDFBox application                                          [jar]
[INFO] Apache PDFBox Debugger application                                 [jar]
[INFO] Apache PDFBox examples                                             [jar]
[INFO] pdfbox-reactor                                                     [pom]
[INFO] Downloading from central: https://repo.maven.apache.org/maven2/org/sonatype/ossindex/maven/ossindex-maven-plugin/maven-metadata.xml
[INFO] Downloaded from central: https://repo.maven.apache.org/maven2/org/sonatype/ossindex/maven/ossindex-maven-plugin/maven-metadata.xml (572 B at 1.5 kB/s)
[INFO] 
[INFO] ------------------< org.apache.pdfbox:pdfbox-parent >-------------------
[INFO] Building Apache PDFBox parent 4.0.0-SNAPSHOT                      [1/11]
[INFO]   from parent/pom.xml
[INFO] --------------------------------[ pom ]---------------------------------
[INFO] 
[INFO] --- clean:3.5.0:clean (default-clean) @ pdfbox-parent ---
[INFO] 
[INFO] --- enforcer:3.6.3:enforce (default) @ pdfbox-parent ---
[INFO] Rule 0: org.apache.maven.enforcer.rules.version.RequireMavenVersion passed
[INFO] 
[INFO] --- enforcer:3.6.3:enforce (enforce-maven-version) @ pdfbox-parent ---
[INFO] Rule 0: org.apache.maven.enforcer.rules.version.RequireMavenVersion passed
[INFO] 
[INFO] --- enforcer:3.6.3:enforce (enforce-java-version) @ pdfbox-parent ---
[INFO] Rule 0: org.apache.maven.enforcer.rules.version.RequireJavaVersion passed
[INFO] 
[INFO] --- checkstyle:3.6.0:check (check) @ pdfbox-parent ---
[INFO] Starting audit...
Audit done.
[INFO] You have 0 Checkstyle violations.
[INFO] 
[INFO] --- jacoco:0.8.15:prepare-agent (default) @ pdfbox-parent ---
[INFO] surefireArgLine set to -javaagent:/home/jenkins/.m2/repository/org/jacoco/org.jacoco.agent/0.8.15/org.jacoco.agent-0.8.15-runtime.jar=destfile=<https://ci-builds.apache.org/job/PDFBox/job/PDFBox-trunk/ws/parent/target/jacoco.exec>
[INFO] 
[INFO] --- remote-resources:3.3.0:process (process-resource-bundles) @ pdfbox-parent ---
[INFO] Preparing remote bundle org.apache.apache.resources:apache-jar-resource-bundle:1.8
[INFO] Copying 3 resources from 1 bundle.
[INFO] 
[INFO] --- jacoco:0.8.15:report (report) @ pdfbox-parent ---
[INFO] Skipping JaCoCo execution due to missing execution data file.
[INFO] 
[INFO] --- source:3.4.0:jar-no-fork (attach-sources) @ pdfbox-parent ---
[INFO] Skipping source per configuration.
[INFO] 
[INFO] --- apache-rat:0.17:check (default) @ pdfbox-parent ---
[WARNING] Basedir is : <https://ci-builds.apache.org/job/PDFBox/job/PDFBox-trunk/ws/parent>
[INFO] Excluding patterns: release.properties, .github/workflows/codeql-analysis.yml
[INFO] Excluding MAVEN collection.
[INFO] Excluding ECLIPSE collection.
[INFO] Excluding IDEA collection.
[INFO] Processing exclude file from STANDARD_SCMS.
[INFO] Excluding STANDARD_SCMS collection.
[INFO] Excluding MISC collection.
[INFO] Excluding HIDDEN_DIR collection.
[INFO] RAT summary:
[INFO]   Approved:  2
[INFO]   Archives:  0
[INFO]   Binaries:  0
[INFO]   Document types:  2
[INFO]   Ignored:  1
[INFO]   License categories:  1
[INFO]   License names:  1
[INFO]   Notices:  0
[INFO]   Standards:  2
[INFO]   Unapproved:  0
[INFO]   Unknown:  0
[INFO] 
[INFO] --- dependency-check:12.2.2:check (default) @ pdfbox-parent ---
[WARNING] The parameter 'ossindexAnalyzerEnabled' is deprecated and should not be used anymore. Please use 'ossIndexAnalyzerEnabled' instead.
[INFO] Checking for updates
[WARNING] An NVD API Key was not provided - it is highly recommended to use an NVD API key as the update can take a VERY long time without an API Key
[WARNING] NVD API request failures are occurring; retrying request for the 15th time
[WARNING] NVD API request failures are occurring; retrying request for the 16th time
[WARNING] NVD API request failures are occurring; retrying request for the 17th time
[WARNING] NVD API request failures are occurring; retrying request for the 18th time
[WARNING] NVD API request failures are occurring; retrying request for the 19th time
[WARNING] NVD API request failures are occurring; retrying request for the 20th time
[WARNING] NVD API request failures are occurring; retrying request for the 21st time
[WARNING] NVD API request failures are occurring; retrying request for the 22nd time
[WARNING] NVD API request failures are occurring; retrying request for the 23rd time
[WARNING] NVD API request failures are occurring; retrying request for the 24th time
[WARNING] NVD API request failures are occurring; retrying request for the 25th time
[WARNING] NVD API request failures are occurring; retrying request for the 26th time
[WARNING] NVD API request failures are occurring; retrying request for the 27th time
[WARNING] NVD API request failures are occurring; retrying request for the 28th time
[WARNING] NVD API request failures are occurring; retrying request for the 29th time
[WARNING] NVD API request failures are occurring; retrying request for the 30th time
[WARNING] NVD API request failures are occurring; retrying request for the 31st time
[ERROR] Error updating the NVD Data
org.owasp.dependencycheck.data.update.exception.UpdateException: Error updating the NVD Data
    at org.owasp.dependencycheck.data.update.NvdApiDataSource.processApi (NvdApiDataSource.java:387)
    at org.owasp.dependencycheck.data.update.NvdApiDataSource.update (NvdApiDataSource.java:128)
    at org.owasp.dependencycheck.Engine.doUpdates (Engine.java:887)
    at org.owasp.dependencycheck.Engine.initializeAndUpdateDatabase (Engine.java:692)
    at org.owasp.dependencycheck.Engine.analyzeDependencies (Engine.java:619)
    at org.owasp.dependencycheck.maven.BaseDependencyCheckMojo.runCheck (BaseDependencyCheckMojo.java:2093)
    at org.owasp.dependencycheck.maven.BaseDependencyCheckMojo.execute (BaseDependencyCheckMojo.java:1291)
    at org.apache.maven.plugin.DefaultBuildPluginManager.executeMojo (DefaultBuildPluginManager.java:126)
    at org.apache.maven.lifecycle.internal.MojoExecutor.doExecute2 (MojoExecutor.java:328)
    at org.apache.maven.lifecycle.internal.MojoExecutor.doExecute (MojoExecutor.java:316)
    at org.apache.maven.lifecycle.internal.MojoExecutor.execute (MojoExecutor.java:212)
    at org.apache.maven.lifecycle.internal.MojoExecutor.execute (MojoExecutor.java:174)
    at org.apache.maven.lifecycle.internal.MojoExecutor.access$000 (MojoExecutor.java:75)
    at org.apache.maven.lifecycle.internal.MojoExecutor$1.run (MojoExecutor.java:162)
    at org.apache.maven.plugin.DefaultMojosExecutionStrategy.execute (DefaultMojosExecutionStrategy.java:39)
    at org.apache.maven.lifecycle.internal.MojoExecutor.execute (MojoExecutor.java:159)
    at org.apache.maven.lifecycle.internal.LifecycleModuleBuilder.buildProject (LifecycleModuleBuilder.java:105)
    at org.apache.maven.lifecycle.internal.LifecycleModuleBuilder.buildProject (LifecycleModuleBuilder.java:73)
    at org.apache.maven.lifecycle.internal.builder.singlethreaded.SingleThreadedBuilder.build (SingleThreadedBuilder.java:53)
    at org.apache.maven.lifecycle.internal.LifecycleStarter.execute (LifecycleStarter.java:118)
    at org.apache.maven.DefaultMaven.doExecute (DefaultMaven.java:261)
    at org.apache.maven.DefaultMaven.doExecute (DefaultMaven.java:173)
    at org.apache.maven.DefaultMaven.execute (DefaultMaven.java:101)
    at org.jvnet.hudson.maven3.launcher.Maven35Launcher.main (Maven35Launcher.java:138)
    at jdk.internal.reflect.NativeMethodAccessorImpl.invoke0 (Native Method)
    at jdk.internal.reflect.NativeMethodAccessorImpl.invoke (NativeMethodAccessorImpl.java:77)
    at jdk.internal.reflect.DelegatingMethodAccessorImpl.invoke (DelegatingMethodAccessorImpl.java:43)
    at java.lang.reflect.Method.invoke (Method.java:569)
    at org.codehaus.plexus.classworlds.launcher.Launcher.launchEnhanced (Launcher.java:255)
    at org.codehaus.plexus.classworlds.launcher.Launcher.launch (Launcher.java:201)
    at jenkins.maven3.agent.Maven35Main.launch (Maven35Main.java:179)
    at jdk.internal.reflect.NativeMethodAccessorImpl.invoke0 (Native Method)
    at jdk.internal.reflect.NativeMethodAccessorImpl.invoke (NativeMethodAccessorImpl.java:77)
    at jdk.internal.reflect.DelegatingMethodAccessorImpl.invoke (DelegatingMethodAccessorImpl.java:43)
    at java.lang.reflect.Method.invoke (Method.java:569)
    at hudson.maven.Maven3Builder.call (Maven3Builder.java:140)
    at hudson.maven.Maven3Builder.call (Maven3Builder.java:71)
    at hudson.remoting.UserRequest.perform (UserRequest.java:225)
    at hudson.remoting.UserRequest.perform (UserRequest.java:50)
    at hudson.remoting.Request$2.run (Request.java:391)
    at hudson.remoting.InterceptingExecutorService.lambda$wrap$0 (InterceptingExecutorService.java:81)
    at java.util.concurrent.FutureTask.run (FutureTask.java:264)
    at java.util.concurrent.ThreadPoolExecutor.runWorker (ThreadPoolExecutor.java:1136)
    at java.util.concurrent.ThreadPoolExecutor$Worker.run (ThreadPoolExecutor.java:635)
    at java.lang.Thread.run (Thread.java:840)
Caused by: io.github.jeremylong.openvulnerability.client.nvd.NvdApiException: NVD Returned Status Code: 429
    at io.github.jeremylong.openvulnerability.client.nvd.NvdCveClient._next (NvdCveClient.java:445)
    at io.github.jeremylong.openvulnerability.client.nvd.NvdCveClient.next (NvdCveClient.java:356)
    at org.owasp.dependencycheck.data.update.NvdApiDataSource.processApi (NvdApiDataSource.java:343)
    at org.owasp.dependencycheck.data.update.NvdApiDataSource.update (NvdApiDataSource.java:128)
    at org.owasp.dependencycheck.Engine.doUpdates (Engine.java:887)
    at org.owasp.dependencycheck.Engine.initializeAndUpdateDatabase (Engine.java:692)
    at org.owasp.dependencycheck.Engine.analyzeDependencies (Engine.java:619)
    at org.owasp.dependencycheck.maven.BaseDependencyCheckMojo.runCheck (BaseDependencyCheckMojo.java:2093)
    at org.owasp.dependencycheck.maven.BaseDependencyCheckMojo.execute (BaseDependencyCheckMojo.java:1291)
    at org.apache.maven.plugin.DefaultBuildPluginManager.executeMojo (DefaultBuildPluginManager.java:126)
    at org.apache.maven.lifecycle.internal.MojoExecutor.doExecute2 (MojoExecutor.java:328)
    at org.apache.maven.lifecycle.internal.MojoExecutor.doExecute (MojoExecutor.java:316)
    at org.apache.maven.lifecycle.internal.MojoExecutor.execute (MojoExecutor.java:212)
    at org.apache.maven.lifecycle.internal.MojoExecutor.execute (MojoExecutor.java:174)
    at org.apache.maven.lifecycle.internal.MojoExecutor.access$000 (MojoExecutor.java:75)
    at org.apache.maven.lifecycle.internal.MojoExecutor$1.run (MojoExecutor.java:162)
    at org.apache.maven.plugin.DefaultMojosExecutionStrategy.execute (DefaultMojosExecutionStrategy.java:39)
    at org.apache.maven.lifecycle.internal.MojoExecutor.execute (MojoExecutor.java:159)
    at org.apache.maven.lifecycle.internal.LifecycleModuleBuilder.buildProject (LifecycleModuleBuilder.java:105)
    at org.apache.maven.lifecycle.internal.LifecycleModuleBuilder.buildProject (LifecycleModuleBuilder.java:73)
    at org.apache.maven.lifecycle.internal.builder.singlethreaded.SingleThreadedBuilder.build (SingleThreadedBuilder.java:53)
    at org.apache.maven.lifecycle.internal.LifecycleStarter.execute (LifecycleStarter.java:118)
    at org.apache.maven.DefaultMaven.doExecute (DefaultMaven.java:261)
    at org.apache.maven.DefaultMaven.doExecute (DefaultMaven.java:173)
    at org.apache.maven.DefaultMaven.execute (DefaultMaven.java:101)
    at org.jvnet.hudson.maven3.launcher.Maven35Launcher.main (Maven35Launcher.java:138)
    at jdk.internal.reflect.NativeMethodAccessorImpl.invoke0 (Native Method)
    at jdk.internal.reflect.NativeMethodAccessorImpl.invoke (NativeMethodAccessorImpl.java:77)
    at jdk.internal.reflect.DelegatingMethodAccessorImpl.invoke (DelegatingMethodAccessorImpl.java:43)
    at java.lang.reflect.Method.invoke (Method.java:569)
    at org.codehaus.plexus.classworlds.launcher.Launcher.launchEnhanced (Launcher.java:255)
    at org.codehaus.plexus.classworlds.launcher.Launcher.launch (Launcher.java:201)
    at jenkins.maven3.agent.Maven35Main.launch (Maven35Main.java:179)
    at jdk.internal.reflect.NativeMethodAccessorImpl.invoke0 (Native Method)
    at jdk.internal.reflect.NativeMethodAccessorImpl.invoke (NativeMethodAccessorImpl.java:77)
    at jdk.internal.reflect.DelegatingMethodAccessorImpl.invoke (DelegatingMethodAccessorImpl.java:43)
    at java.lang.reflect.Method.invoke (Method.java:569)
    at hudson.maven.Maven3Builder.call (Maven3Builder.java:140)
    at hudson.maven.Maven3Builder.call (Maven3Builder.java:71)
    at hudson.remoting.UserRequest.perform (UserRequest.java:225)
    at hudson.remoting.UserRequest.perform (UserRequest.java:50)
    at hudson.remoting.Request$2.run (Request.java:391)
    at hudson.remoting.InterceptingExecutorService.lambda$wrap$0 (InterceptingExecutorService.java:81)
    at java.util.concurrent.FutureTask.run (FutureTask.java:264)
    at java.util.concurrent.ThreadPoolExecutor.runWorker (ThreadPoolExecutor.java:1136)
    at java.util.concurrent.ThreadPoolExecutor$Worker.run (ThreadPoolExecutor.java:635)
    at java.lang.Thread.run (Thread.java:840)
[INFO] Skipping Known Exploited Vulnerabilities update check since last check was within 24 hours.
[WARNING] Unable to update 1 or more Cached Web DataSource, using local data instead. Results may not include recent vulnerabilities.
[ERROR] Unable to continue dependency-check analysis.
[WARNING] Attempt to (de-)serialize anonymous class org.jfrog.hudson.maven2.MavenDependenciesRecorder$1; see: https://jenkins.io/redirect/serialization-of-anonymous-classes/
[INFO] ------------------------------------------------------------------------
[INFO] Reactor Summary for pdfbox-reactor 4.0.0-SNAPSHOT:
[INFO] 
[INFO] Apache PDFBox parent ............................... FAILURE [01:21 min]
[INFO] Apache PDFBox io ................................... SKIPPED
[INFO] Apache FontBox ..................................... SKIPPED
[INFO] Apache XmpBox ...................................... SKIPPED
[INFO] Apache PDFBox ...................................... SKIPPED
[INFO] Apache PDFBox Debugger ............................. SKIPPED
[INFO] Apache PDFBox tools ................................ SKIPPED
[INFO] Apache PDFBox application .......................... SKIPPED
[INFO] Apache PDFBox Debugger application ................. SKIPPED
[INFO] Apache PDFBox examples ............................. SKIPPED
[INFO] pdfbox-reactor ..................................... SKIPPED
[INFO] ------------------------------------------------------------------------
[INFO] BUILD FAILURE
[INFO] ------------------------------------------------------------------------
[INFO] Total time:  01:40 min
[INFO] Finished at: 2026-06-19T04:24:15Z
[INFO] ------------------------------------------------------------------------
Waiting for Jenkins to finish collecting data
[ERROR] Failed to execute goal org.owasp:dependency-check-maven:12.2.2:check (default) on project pdfbox-parent: Fatal exception(s) analyzing Apache PDFBox parent: One or more exceptions occurred during analysis:
[ERROR] UpdateException: Error updating the NVD Data
[ERROR] caused by NvdApiException: NVD Returned Status Code: 429
[ERROR] NoDataException: No documents exist
[ERROR] -> [Help 1]
[ERROR] 
[ERROR] To see the full stack trace of the errors, re-run Maven with the -e switch.
[ERROR] Re-run Maven using the -X switch to enable full debug logging.
[ERROR] 
[ERROR] For more information about the errors and possible solutions, please read the following articles:
[ERROR] [Help 1] http://cwiki.apache.org/confluence/display/MAVEN/MojoExecutionException
[JENKINS] Archiving <https://ci-builds.apache.org/job/PDFBox/job/PDFBox-trunk/ws/xmpbox/pom.xml> to org.apache.pdfbox/xmpbox/4.0.0-SNAPSHOT/xmpbox-4.0.0-SNAPSHOT.pom
[JENKINS] Archiving <https://ci-builds.apache.org/job/PDFBox/job/PDFBox-trunk/ws/tools/pom.xml> to org.apache.pdfbox/pdfbox-tools/4.0.0-SNAPSHOT/pdfbox-tools-4.0.0-SNAPSHOT.pom
[JENKINS] Archiving <https://ci-builds.apache.org/job/PDFBox/job/PDFBox-trunk/ws/debugger/pom.xml> to org.apache.pdfbox/pdfbox-debugger/4.0.0-SNAPSHOT/pdfbox-debugger-4.0.0-SNAPSHOT.pom
[JENKINS] Archiving <https://ci-builds.apache.org/job/PDFBox/job/PDFBox-trunk/ws/app/pom.xml> to org.apache.pdfbox/pdfbox-app/4.0.0-SNAPSHOT/pdfbox-app-4.0.0-SNAPSHOT.pom
[JENKINS] Archiving <https://ci-builds.apache.org/job/PDFBox/job/PDFBox-trunk/ws/examples/pom.xml> to org.apache.pdfbox/pdfbox-examples/4.0.0-SNAPSHOT/pdfbox-examples-4.0.0-SNAPSHOT.pom
[JENKINS] Archiving <https://ci-builds.apache.org/job/PDFBox/job/PDFBox-trunk/ws/pom.xml> to org.apache.pdfbox/pdfbox-reactor/4.0.0-SNAPSHOT/pdfbox-reactor-4.0.0-SNAPSHOT.pom
[JENKINS] Archiving <https://ci-builds.apache.org/job/PDFBox/job/PDFBox-trunk/ws/parent/pom.xml> to org.apache.pdfbox/pdfbox-parent/4.0.0-SNAPSHOT/pdfbox-parent-4.0.0-SNAPSHOT.pom
[JENKINS] Archiving <https://ci-builds.apache.org/job/PDFBox/job/PDFBox-trunk/ws/pdfbox/pom.xml> to org.apache.pdfbox/pdfbox/4.0.0-SNAPSHOT/pdfbox-4.0.0-SNAPSHOT.pom
[JENKINS] Archiving <https://ci-builds.apache.org/job/PDFBox/job/PDFBox-trunk/ws/debugger-app/pom.xml> to org.apache.pdfbox/debugger-app/4.0.0-SNAPSHOT/debugger-app-4.0.0-SNAPSHOT.pom
[JENKINS] Archiving <https://ci-builds.apache.org/job/PDFBox/job/PDFBox-trunk/ws/io/pom.xml> to org.apache.pdfbox/pdfbox-io/4.0.0-SNAPSHOT/pdfbox-io-4.0.0-SNAPSHOT.pom
[JENKINS] Archiving <https://ci-builds.apache.org/job/PDFBox/job/PDFBox-trunk/ws/fontbox/pom.xml> to org.apache.pdfbox/fontbox/4.0.0-SNAPSHOT/fontbox-4.0.0-SNAPSHOT.pom
No mail will be sent out, as 'PDFBox » PDFBox-trunk » Apache XmpBox #3275' does not have a result yet. Please make sure you set a proper result in case of pipeline/build scripts.
No mail will be sent out, as 'PDFBox » PDFBox-trunk » Apache PDFBox tools #3275' does not have a result yet. Please make sure you set a proper result in case of pipeline/build scripts.
No mail will be sent out, as 'PDFBox » PDFBox-trunk » Apache PDFBox Debugger #3275' does not have a result yet. Please make sure you set a proper result in case of pipeline/build scripts.
No mail will be sent out, as 'PDFBox » PDFBox-trunk » Apache PDFBox application #3275' does not have a result yet. Please make sure you set a proper result in case of pipeline/build scripts.
No mail will be sent out, as 'PDFBox » PDFBox-trunk » Apache PDFBox examples #3275' does not have a result yet. Please make sure you set a proper result in case of pipeline/build scripts.
No mail will be sent out, as 'PDFBox » PDFBox-trunk » pdfbox-reactor #3275' does not have a result yet. Please make sure you set a proper result in case of pipeline/build scripts.
Sending e-mails to: dev@pdfbox.apache.org
No mail will be sent out, as 'PDFBox » PDFBox-trunk » Apache PDFBox #3275' does not have a result yet. Please make sure you set a proper result in case of pipeline/build scripts.
No mail will be sent out, as 'PDFBox » PDFBox-trunk » Apache PDFBox Debugger application #3275' does not have a result yet. Please make sure you set a proper result in case of pipeline/build scripts.
No mail will be sent out, as 'PDFBox » PDFBox-trunk » Apache PDFBox io #3275' does not have a result yet. Please make sure you set a proper result in case of pipeline/build scripts.
No mail will be sent out, as 'PDFBox » PDFBox-trunk » Apache FontBox #3275' does not have a result yet. Please make sure you set a proper result in case of pipeline/build scripts.
channel stopped
Archiving artifacts

---------------------------------------------------------------------
To unsubscribe, e-mail: dev-unsubscribe@pdfbox.apache.org
For additional commands, e-mail: dev-help@pdfbox.apache.org


Build failed in Jenkins: PDFBox » PDFBox-trunk #3280

Posted by Apache Jenkins Server <je...@builds.apache.org>.
See <https://ci-builds.apache.org/job/PDFBox/job/PDFBox-trunk/3280/display/redirect>

Changes:


------------------------------------------
[...truncated 2.49 KiB...]
[HUDSON] Collecting dependencies info
[HUDSON] Collecting dependencies info
[INFO] Apache PDFBox parent                                               [pom]
[INFO] Apache PDFBox io                                                [bundle]
[INFO] Apache FontBox                                                  [bundle]
[INFO] Apache XmpBox                                                   [bundle]
[INFO] Apache PDFBox                                                   [bundle]
[INFO] Apache PDFBox Debugger                                             [jar]
[INFO] Apache PDFBox tools                                                [jar]
[INFO] Apache PDFBox application                                          [jar]
[INFO] Apache PDFBox Debugger application                                 [jar]
[INFO] Apache PDFBox examples                                             [jar]
[INFO] pdfbox-reactor                                                     [pom]
[INFO] Downloading from central: https://repo.maven.apache.org/maven2/org/sonatype/ossindex/maven/ossindex-maven-plugin/maven-metadata.xml
[INFO] Downloaded from central: https://repo.maven.apache.org/maven2/org/sonatype/ossindex/maven/ossindex-maven-plugin/maven-metadata.xml (572 B at 1.4 kB/s)
[INFO] 
[INFO] ------------------< org.apache.pdfbox:pdfbox-parent >-------------------
[INFO] Building Apache PDFBox parent 4.0.0-SNAPSHOT                      [1/11]
[INFO]   from parent/pom.xml
[INFO] --------------------------------[ pom ]---------------------------------
[INFO] 
[INFO] --- clean:3.5.0:clean (default-clean) @ pdfbox-parent ---
[INFO] 
[INFO] --- enforcer:3.6.3:enforce (default) @ pdfbox-parent ---
[INFO] Rule 0: org.apache.maven.enforcer.rules.version.RequireMavenVersion passed
[INFO] 
[INFO] --- enforcer:3.6.3:enforce (enforce-maven-version) @ pdfbox-parent ---
[INFO] Rule 0: org.apache.maven.enforcer.rules.version.RequireMavenVersion passed
[INFO] 
[INFO] --- enforcer:3.6.3:enforce (enforce-java-version) @ pdfbox-parent ---
[INFO] Rule 0: org.apache.maven.enforcer.rules.version.RequireJavaVersion passed
[INFO] 
[INFO] --- checkstyle:3.6.0:check (check) @ pdfbox-parent ---
[INFO] Starting audit...
Audit done.
[INFO] You have 0 Checkstyle violations.
[INFO] 
[INFO] --- jacoco:0.8.15:prepare-agent (default) @ pdfbox-parent ---
[INFO] surefireArgLine set to -javaagent:/home/jenkins/.m2/repository/org/jacoco/org.jacoco.agent/0.8.15/org.jacoco.agent-0.8.15-runtime.jar=destfile=<https://ci-builds.apache.org/job/PDFBox/job/PDFBox-trunk/ws/parent/target/jacoco.exec>
[INFO] 
[INFO] --- remote-resources:3.3.0:process (process-resource-bundles) @ pdfbox-parent ---
[INFO] Preparing remote bundle org.apache.apache.resources:apache-jar-resource-bundle:1.8
[INFO] Copying 3 resources from 1 bundle.
[INFO] 
[INFO] --- jacoco:0.8.15:report (report) @ pdfbox-parent ---
[INFO] Skipping JaCoCo execution due to missing execution data file.
[INFO] 
[INFO] --- source:3.4.0:jar-no-fork (attach-sources) @ pdfbox-parent ---
[INFO] Skipping source per configuration.
[INFO] 
[INFO] --- apache-rat:0.17:check (default) @ pdfbox-parent ---
[WARNING] Basedir is : <https://ci-builds.apache.org/job/PDFBox/job/PDFBox-trunk/ws/parent>
[INFO] Excluding patterns: release.properties, .github/workflows/codeql-analysis.yml
[INFO] Excluding MAVEN collection.
[INFO] Excluding ECLIPSE collection.
[INFO] Excluding IDEA collection.
[INFO] Processing exclude file from STANDARD_SCMS.
[INFO] Excluding STANDARD_SCMS collection.
[INFO] Excluding MISC collection.
[INFO] Excluding HIDDEN_DIR collection.
[INFO] RAT summary:
[INFO]   Approved:  2
[INFO]   Archives:  0
[INFO]   Binaries:  0
[INFO]   Document types:  2
[INFO]   Ignored:  1
[INFO]   License categories:  1
[INFO]   License names:  1
[INFO]   Notices:  0
[INFO]   Standards:  2
[INFO]   Unapproved:  0
[INFO]   Unknown:  0
[INFO] 
[INFO] --- dependency-check:12.2.2:check (default) @ pdfbox-parent ---
[WARNING] The parameter 'ossindexAnalyzerEnabled' is deprecated and should not be used anymore. Please use 'ossIndexAnalyzerEnabled' instead.
[INFO] Checking for updates
[WARNING] An NVD API Key was not provided - it is highly recommended to use an NVD API key as the update can take a VERY long time without an API Key
[WARNING] NVD API request failures are occurring; retrying request for the 15th time
[WARNING] NVD API request failures are occurring; retrying request for the 16th time
[WARNING] NVD API request failures are occurring; retrying request for the 17th time
[WARNING] NVD API request failures are occurring; retrying request for the 18th time
[WARNING] NVD API request failures are occurring; retrying request for the 19th time
[WARNING] NVD API request failures are occurring; retrying request for the 20th time
[WARNING] NVD API request failures are occurring; retrying request for the 21st time
[WARNING] NVD API request failures are occurring; retrying request for the 22nd time
[WARNING] NVD API request failures are occurring; retrying request for the 23rd time
[WARNING] NVD API request failures are occurring; retrying request for the 24th time
[WARNING] NVD API request failures are occurring; retrying request for the 25th time
[WARNING] NVD API request failures are occurring; retrying request for the 26th time
[WARNING] NVD API request failures are occurring; retrying request for the 27th time
[WARNING] NVD API request failures are occurring; retrying request for the 28th time
[WARNING] NVD API request failures are occurring; retrying request for the 29th time
[WARNING] NVD API request failures are occurring; retrying request for the 30th time
[WARNING] NVD API request failures are occurring; retrying request for the 31st time
[ERROR] Error updating the NVD Data
org.owasp.dependencycheck.data.update.exception.UpdateException: Error updating the NVD Data
    at org.owasp.dependencycheck.data.update.NvdApiDataSource.processApi (NvdApiDataSource.java:387)
    at org.owasp.dependencycheck.data.update.NvdApiDataSource.update (NvdApiDataSource.java:128)
    at org.owasp.dependencycheck.Engine.doUpdates (Engine.java:887)
    at org.owasp.dependencycheck.Engine.initializeAndUpdateDatabase (Engine.java:692)
    at org.owasp.dependencycheck.Engine.analyzeDependencies (Engine.java:619)
    at org.owasp.dependencycheck.maven.BaseDependencyCheckMojo.runCheck (BaseDependencyCheckMojo.java:2093)
    at org.owasp.dependencycheck.maven.BaseDependencyCheckMojo.execute (BaseDependencyCheckMojo.java:1291)
    at org.apache.maven.plugin.DefaultBuildPluginManager.executeMojo (DefaultBuildPluginManager.java:126)
    at org.apache.maven.lifecycle.internal.MojoExecutor.doExecute2 (MojoExecutor.java:328)
    at org.apache.maven.lifecycle.internal.MojoExecutor.doExecute (MojoExecutor.java:316)
    at org.apache.maven.lifecycle.internal.MojoExecutor.execute (MojoExecutor.java:212)
    at org.apache.maven.lifecycle.internal.MojoExecutor.execute (MojoExecutor.java:174)
    at org.apache.maven.lifecycle.internal.MojoExecutor.access$000 (MojoExecutor.java:75)
    at org.apache.maven.lifecycle.internal.MojoExecutor$1.run (MojoExecutor.java:162)
    at org.apache.maven.plugin.DefaultMojosExecutionStrategy.execute (DefaultMojosExecutionStrategy.java:39)
    at org.apache.maven.lifecycle.internal.MojoExecutor.execute (MojoExecutor.java:159)
    at org.apache.maven.lifecycle.internal.LifecycleModuleBuilder.buildProject (LifecycleModuleBuilder.java:105)
    at org.apache.maven.lifecycle.internal.LifecycleModuleBuilder.buildProject (LifecycleModuleBuilder.java:73)
    at org.apache.maven.lifecycle.internal.builder.singlethreaded.SingleThreadedBuilder.build (SingleThreadedBuilder.java:53)
    at org.apache.maven.lifecycle.internal.LifecycleStarter.execute (LifecycleStarter.java:118)
    at org.apache.maven.DefaultMaven.doExecute (DefaultMaven.java:261)
    at org.apache.maven.DefaultMaven.doExecute (DefaultMaven.java:173)
    at org.apache.maven.DefaultMaven.execute (DefaultMaven.java:101)
    at org.jvnet.hudson.maven3.launcher.Maven35Launcher.main (Maven35Launcher.java:138)
    at jdk.internal.reflect.NativeMethodAccessorImpl.invoke0 (Native Method)
    at jdk.internal.reflect.NativeMethodAccessorImpl.invoke (NativeMethodAccessorImpl.java:77)
    at jdk.internal.reflect.DelegatingMethodAccessorImpl.invoke (DelegatingMethodAccessorImpl.java:43)
    at java.lang.reflect.Method.invoke (Method.java:569)
    at org.codehaus.plexus.classworlds.launcher.Launcher.launchEnhanced (Launcher.java:255)
    at org.codehaus.plexus.classworlds.launcher.Launcher.launch (Launcher.java:201)
    at jenkins.maven3.agent.Maven35Main.launch (Maven35Main.java:179)
    at jdk.internal.reflect.NativeMethodAccessorImpl.invoke0 (Native Method)
    at jdk.internal.reflect.NativeMethodAccessorImpl.invoke (NativeMethodAccessorImpl.java:77)
    at jdk.internal.reflect.DelegatingMethodAccessorImpl.invoke (DelegatingMethodAccessorImpl.java:43)
    at java.lang.reflect.Method.invoke (Method.java:569)
    at hudson.maven.Maven3Builder.call (Maven3Builder.java:140)
    at hudson.maven.Maven3Builder.call (Maven3Builder.java:71)
    at hudson.remoting.UserRequest.perform (UserRequest.java:225)
    at hudson.remoting.UserRequest.perform (UserRequest.java:50)
    at hudson.remoting.Request$2.run (Request.java:391)
    at hudson.remoting.InterceptingExecutorService.lambda$wrap$0 (InterceptingExecutorService.java:81)
    at java.util.concurrent.FutureTask.run (FutureTask.java:264)
    at java.util.concurrent.ThreadPoolExecutor.runWorker (ThreadPoolExecutor.java:1136)
    at java.util.concurrent.ThreadPoolExecutor$Worker.run (ThreadPoolExecutor.java:635)
    at java.lang.Thread.run (Thread.java:840)
Caused by: io.github.jeremylong.openvulnerability.client.nvd.NvdApiException: NVD Returned Status Code: 429
    at io.github.jeremylong.openvulnerability.client.nvd.NvdCveClient._next (NvdCveClient.java:445)
    at io.github.jeremylong.openvulnerability.client.nvd.NvdCveClient.next (NvdCveClient.java:356)
    at org.owasp.dependencycheck.data.update.NvdApiDataSource.processApi (NvdApiDataSource.java:343)
    at org.owasp.dependencycheck.data.update.NvdApiDataSource.update (NvdApiDataSource.java:128)
    at org.owasp.dependencycheck.Engine.doUpdates (Engine.java:887)
    at org.owasp.dependencycheck.Engine.initializeAndUpdateDatabase (Engine.java:692)
    at org.owasp.dependencycheck.Engine.analyzeDependencies (Engine.java:619)
    at org.owasp.dependencycheck.maven.BaseDependencyCheckMojo.runCheck (BaseDependencyCheckMojo.java:2093)
    at org.owasp.dependencycheck.maven.BaseDependencyCheckMojo.execute (BaseDependencyCheckMojo.java:1291)
    at org.apache.maven.plugin.DefaultBuildPluginManager.executeMojo (DefaultBuildPluginManager.java:126)
    at org.apache.maven.lifecycle.internal.MojoExecutor.doExecute2 (MojoExecutor.java:328)
    at org.apache.maven.lifecycle.internal.MojoExecutor.doExecute (MojoExecutor.java:316)
    at org.apache.maven.lifecycle.internal.MojoExecutor.execute (MojoExecutor.java:212)
    at org.apache.maven.lifecycle.internal.MojoExecutor.execute (MojoExecutor.java:174)
    at org.apache.maven.lifecycle.internal.MojoExecutor.access$000 (MojoExecutor.java:75)
    at org.apache.maven.lifecycle.internal.MojoExecutor$1.run (MojoExecutor.java:162)
    at org.apache.maven.plugin.DefaultMojosExecutionStrategy.execute (DefaultMojosExecutionStrategy.java:39)
    at org.apache.maven.lifecycle.internal.MojoExecutor.execute (MojoExecutor.java:159)
    at org.apache.maven.lifecycle.internal.LifecycleModuleBuilder.buildProject (LifecycleModuleBuilder.java:105)
    at org.apache.maven.lifecycle.internal.LifecycleModuleBuilder.buildProject (LifecycleModuleBuilder.java:73)
    at org.apache.maven.lifecycle.internal.builder.singlethreaded.SingleThreadedBuilder.build (SingleThreadedBuilder.java:53)
    at org.apache.maven.lifecycle.internal.LifecycleStarter.execute (LifecycleStarter.java:118)
    at org.apache.maven.DefaultMaven.doExecute (DefaultMaven.java:261)
    at org.apache.maven.DefaultMaven.doExecute (DefaultMaven.java:173)
    at org.apache.maven.DefaultMaven.execute (DefaultMaven.java:101)
    at org.jvnet.hudson.maven3.launcher.Maven35Launcher.main (Maven35Launcher.java:138)
    at jdk.internal.reflect.NativeMethodAccessorImpl.invoke0 (Native Method)
    at jdk.internal.reflect.NativeMethodAccessorImpl.invoke (NativeMethodAccessorImpl.java:77)
    at jdk.internal.reflect.DelegatingMethodAccessorImpl.invoke (DelegatingMethodAccessorImpl.java:43)
    at java.lang.reflect.Method.invoke (Method.java:569)
    at org.codehaus.plexus.classworlds.launcher.Launcher.launchEnhanced (Launcher.java:255)
    at org.codehaus.plexus.classworlds.launcher.Launcher.launch (Launcher.java:201)
    at jenkins.maven3.agent.Maven35Main.launch (Maven35Main.java:179)
    at jdk.internal.reflect.NativeMethodAccessorImpl.invoke0 (Native Method)
    at jdk.internal.reflect.NativeMethodAccessorImpl.invoke (NativeMethodAccessorImpl.java:77)
    at jdk.internal.reflect.DelegatingMethodAccessorImpl.invoke (DelegatingMethodAccessorImpl.java:43)
    at java.lang.reflect.Method.invoke (Method.java:569)
    at hudson.maven.Maven3Builder.call (Maven3Builder.java:140)
    at hudson.maven.Maven3Builder.call (Maven3Builder.java:71)
    at hudson.remoting.UserRequest.perform (UserRequest.java:225)
    at hudson.remoting.UserRequest.perform (UserRequest.java:50)
    at hudson.remoting.Request$2.run (Request.java:391)
    at hudson.remoting.InterceptingExecutorService.lambda$wrap$0 (InterceptingExecutorService.java:81)
    at java.util.concurrent.FutureTask.run (FutureTask.java:264)
    at java.util.concurrent.ThreadPoolExecutor.runWorker (ThreadPoolExecutor.java:1136)
    at java.util.concurrent.ThreadPoolExecutor$Worker.run (ThreadPoolExecutor.java:635)
    at java.lang.Thread.run (Thread.java:840)
[INFO] Skipping Known Exploited Vulnerabilities update check since last check was within 24 hours.
[WARNING] Unable to update 1 or more Cached Web DataSource, using local data instead. Results may not include recent vulnerabilities.
[ERROR] Unable to continue dependency-check analysis.
[WARNING] Attempt to (de-)serialize anonymous class org.jfrog.hudson.maven2.MavenDependenciesRecorder$1; see: https://jenkins.io/redirect/serialization-of-anonymous-classes/
[INFO] ------------------------------------------------------------------------
[INFO] Reactor Summary for pdfbox-reactor 4.0.0-SNAPSHOT:
[INFO] 
[INFO] Apache PDFBox parent ............................... FAILURE [ 20.471 s]
[INFO] Apache PDFBox io ................................... SKIPPED
[INFO] Apache FontBox ..................................... SKIPPED
[INFO] Apache XmpBox ...................................... SKIPPED
[INFO] Apache PDFBox ...................................... SKIPPED
[INFO] Apache PDFBox Debugger ............................. SKIPPED
[INFO] Apache PDFBox tools ................................ SKIPPED
[INFO] Apache PDFBox application .......................... SKIPPED
[INFO] Apache PDFBox Debugger application ................. SKIPPED
[INFO] Apache PDFBox examples ............................. SKIPPED
[INFO] pdfbox-reactor ..................................... SKIPPED
[INFO] ------------------------------------------------------------------------
[INFO] BUILD FAILURE
[INFO] ------------------------------------------------------------------------
[INFO] Total time:  41.602 s
[INFO] Finished at: 2026-06-23T11:00:26Z
[INFO] ------------------------------------------------------------------------
Waiting for Jenkins to finish collecting data
[ERROR] Failed to execute goal org.owasp:dependency-check-maven:12.2.2:check (default) on project pdfbox-parent: Fatal exception(s) analyzing Apache PDFBox parent: One or more exceptions occurred during analysis:
[ERROR] UpdateException: Error updating the NVD Data
[ERROR] caused by NvdApiException: NVD Returned Status Code: 429
[ERROR] NoDataException: No documents exist
[ERROR] -> [Help 1]
[ERROR] 
[ERROR] To see the full stack trace of the errors, re-run Maven with the -e switch.
[ERROR] Re-run Maven using the -X switch to enable full debug logging.
[ERROR] 
[ERROR] For more information about the errors and possible solutions, please read the following articles:
[ERROR] [Help 1] http://cwiki.apache.org/confluence/display/MAVEN/MojoExecutionException
[JENKINS] Archiving <https://ci-builds.apache.org/job/PDFBox/job/PDFBox-trunk/ws/xmpbox/pom.xml> to org.apache.pdfbox/xmpbox/4.0.0-SNAPSHOT/xmpbox-4.0.0-SNAPSHOT.pom
[JENKINS] Archiving <https://ci-builds.apache.org/job/PDFBox/job/PDFBox-trunk/ws/tools/pom.xml> to org.apache.pdfbox/pdfbox-tools/4.0.0-SNAPSHOT/pdfbox-tools-4.0.0-SNAPSHOT.pom
[JENKINS] Archiving <https://ci-builds.apache.org/job/PDFBox/job/PDFBox-trunk/ws/debugger/pom.xml> to org.apache.pdfbox/pdfbox-debugger/4.0.0-SNAPSHOT/pdfbox-debugger-4.0.0-SNAPSHOT.pom
[JENKINS] Archiving <https://ci-builds.apache.org/job/PDFBox/job/PDFBox-trunk/ws/app/pom.xml> to org.apache.pdfbox/pdfbox-app/4.0.0-SNAPSHOT/pdfbox-app-4.0.0-SNAPSHOT.pom
[JENKINS] Archiving <https://ci-builds.apache.org/job/PDFBox/job/PDFBox-trunk/ws/examples/pom.xml> to org.apache.pdfbox/pdfbox-examples/4.0.0-SNAPSHOT/pdfbox-examples-4.0.0-SNAPSHOT.pom
[JENKINS] Archiving <https://ci-builds.apache.org/job/PDFBox/job/PDFBox-trunk/ws/pom.xml> to org.apache.pdfbox/pdfbox-reactor/4.0.0-SNAPSHOT/pdfbox-reactor-4.0.0-SNAPSHOT.pom
[JENKINS] Archiving <https://ci-builds.apache.org/job/PDFBox/job/PDFBox-trunk/ws/parent/pom.xml> to org.apache.pdfbox/pdfbox-parent/4.0.0-SNAPSHOT/pdfbox-parent-4.0.0-SNAPSHOT.pom
[JENKINS] Archiving <https://ci-builds.apache.org/job/PDFBox/job/PDFBox-trunk/ws/pdfbox/pom.xml> to org.apache.pdfbox/pdfbox/4.0.0-SNAPSHOT/pdfbox-4.0.0-SNAPSHOT.pom
[JENKINS] Archiving <https://ci-builds.apache.org/job/PDFBox/job/PDFBox-trunk/ws/debugger-app/pom.xml> to org.apache.pdfbox/debugger-app/4.0.0-SNAPSHOT/debugger-app-4.0.0-SNAPSHOT.pom
[JENKINS] Archiving <https://ci-builds.apache.org/job/PDFBox/job/PDFBox-trunk/ws/io/pom.xml> to org.apache.pdfbox/pdfbox-io/4.0.0-SNAPSHOT/pdfbox-io-4.0.0-SNAPSHOT.pom
[JENKINS] Archiving <https://ci-builds.apache.org/job/PDFBox/job/PDFBox-trunk/ws/fontbox/pom.xml> to org.apache.pdfbox/fontbox/4.0.0-SNAPSHOT/fontbox-4.0.0-SNAPSHOT.pom
No mail will be sent out, as 'PDFBox » PDFBox-trunk » Apache XmpBox #3280' does not have a result yet. Please make sure you set a proper result in case of pipeline/build scripts.
No mail will be sent out, as 'PDFBox » PDFBox-trunk » Apache PDFBox tools #3280' does not have a result yet. Please make sure you set a proper result in case of pipeline/build scripts.
No mail will be sent out, as 'PDFBox » PDFBox-trunk » Apache PDFBox Debugger #3280' does not have a result yet. Please make sure you set a proper result in case of pipeline/build scripts.
No mail will be sent out, as 'PDFBox » PDFBox-trunk » Apache PDFBox application #3280' does not have a result yet. Please make sure you set a proper result in case of pipeline/build scripts.
No mail will be sent out, as 'PDFBox » PDFBox-trunk » Apache PDFBox examples #3280' does not have a result yet. Please make sure you set a proper result in case of pipeline/build scripts.
No mail will be sent out, as 'PDFBox » PDFBox-trunk » pdfbox-reactor #3280' does not have a result yet. Please make sure you set a proper result in case of pipeline/build scripts.
Sending e-mails to: dev@pdfbox.apache.org
No mail will be sent out, as 'PDFBox » PDFBox-trunk » Apache PDFBox #3280' does not have a result yet. Please make sure you set a proper result in case of pipeline/build scripts.
No mail will be sent out, as 'PDFBox » PDFBox-trunk » Apache PDFBox Debugger application #3280' does not have a result yet. Please make sure you set a proper result in case of pipeline/build scripts.
No mail will be sent out, as 'PDFBox » PDFBox-trunk » Apache PDFBox io #3280' does not have a result yet. Please make sure you set a proper result in case of pipeline/build scripts.
No mail will be sent out, as 'PDFBox » PDFBox-trunk » Apache FontBox #3280' does not have a result yet. Please make sure you set a proper result in case of pipeline/build scripts.
channel stopped
Archiving artifacts

---------------------------------------------------------------------
To unsubscribe, e-mail: dev-unsubscribe@pdfbox.apache.org
For additional commands, e-mail: dev-help@pdfbox.apache.org


Build failed in Jenkins: PDFBox » PDFBox-trunk #3279

Posted by Apache Jenkins Server <je...@builds.apache.org>.
See <https://ci-builds.apache.org/job/PDFBox/job/PDFBox-trunk/3279/display/redirect>

Changes:


------------------------------------------
[...truncated 3.96 MiB...]
    at org.h2.mvstore.SingleFileStore.writeFully (SingleFileStore.java:28)
    at org.h2.mvstore.RandomAccessStore.writeChunk (RandomAccessStore.java:366)
    at org.h2.mvstore.RandomAccessStore.writeChunk (RandomAccessStore.java:28)
    at org.h2.mvstore.FileStore.storeBuffer (FileStore.java:1529)
    at org.h2.mvstore.FileStore.lambda$serializeAndStore$3 (FileStore.java:1437)
    at java.util.concurrent.Executors$RunnableAdapter.call (Executors.java:539)
    at java.util.concurrent.FutureTask.run (FutureTask.java:264)
    at java.util.concurrent.ThreadPoolExecutor.runWorker (ThreadPoolExecutor.java:1136)
    at java.util.concurrent.ThreadPoolExecutor$Worker.run (ThreadPoolExecutor.java:635)
    at java.lang.Thread.run (Thread.java:840)
Caused by: java.nio.channels.ClosedChannelException
    at sun.nio.ch.FileChannelImpl.ensureOpen (FileChannelImpl.java:159)
    at sun.nio.ch.FileChannelImpl.write (FileChannelImpl.java:854)
    at org.h2.mvstore.DataUtils.writeFully (DataUtils.java:474)
    at org.h2.mvstore.SingleFileStore.writeFully (SingleFileStore.java:67)
    at org.h2.mvstore.SingleFileStore.writeFully (SingleFileStore.java:28)
    at org.h2.mvstore.RandomAccessStore.writeChunk (RandomAccessStore.java:366)
    at org.h2.mvstore.RandomAccessStore.writeChunk (RandomAccessStore.java:28)
    at org.h2.mvstore.FileStore.storeBuffer (FileStore.java:1529)
    at org.h2.mvstore.FileStore.lambda$serializeAndStore$3 (FileStore.java:1437)
    at java.util.concurrent.Executors$RunnableAdapter.call (Executors.java:539)
    at java.util.concurrent.FutureTask.run (FutureTask.java:264)
    at java.util.concurrent.ThreadPoolExecutor.runWorker (ThreadPoolExecutor.java:1136)
    at java.util.concurrent.ThreadPoolExecutor$Worker.run (ThreadPoolExecutor.java:635)
    at java.lang.Thread.run (Thread.java:840)
[ERROR] Failed to process CVE-2001-0935
org.owasp.dependencycheck.data.nvdcve.DatabaseException: Unable to retrieve id for new vulnerability for 'CVE-2001-0935'
    at org.owasp.dependencycheck.data.nvdcve.CveDB.updateOrInsertVulnerability (CveDB.java:1394)
    at org.owasp.dependencycheck.data.nvdcve.CveDB.updateVulnerability (CveDB.java:1093)
    at org.owasp.dependencycheck.data.update.nvd.api.NvdApiProcessor.updateCveDb (NvdApiProcessor.java:119)
    at org.owasp.dependencycheck.data.update.nvd.api.NvdApiProcessor.call (NvdApiProcessor.java:96)
    at org.owasp.dependencycheck.data.update.nvd.api.NvdApiProcessor.call (NvdApiProcessor.java:40)
    at java.util.concurrent.FutureTask.run (FutureTask.java:264)
    at java.util.concurrent.ThreadPoolExecutor.runWorker (ThreadPoolExecutor.java:1136)
    at java.util.concurrent.ThreadPoolExecutor$Worker.run (ThreadPoolExecutor.java:635)
    at java.lang.Thread.run (Thread.java:840)
Caused by: org.h2.jdbc.JdbcSQLNonTransientConnectionException: The database has been closed [90098-240]
    at org.h2.message.DbException.getJdbcSQLException (DbException.java:690)
    at org.h2.message.DbException.getJdbcSQLException (DbException.java:489)
    at org.h2.message.DbException.get (DbException.java:212)
    at org.h2.engine.SessionLocal.getTransaction (SessionLocal.java:1637)
    at org.h2.engine.SessionLocal.startStatementWithinTransaction (SessionLocal.java:1658)
    at org.h2.command.Command.executeQuery (Command.java:192)
    at org.h2.jdbc.JdbcPreparedStatement.executeQuery (JdbcPreparedStatement.java:130)
    at org.apache.commons.dbcp2.DelegatingPreparedStatement.executeQuery (DelegatingPreparedStatement.java:123)
    at org.apache.commons.dbcp2.DelegatingPreparedStatement.executeQuery (DelegatingPreparedStatement.java:123)
    at org.owasp.dependencycheck.data.nvdcve.CveDB.updateOrInsertVulnerability (CveDB.java:1389)
    at org.owasp.dependencycheck.data.nvdcve.CveDB.updateVulnerability (CveDB.java:1093)
    at org.owasp.dependencycheck.data.update.nvd.api.NvdApiProcessor.updateCveDb (NvdApiProcessor.java:119)
    at org.owasp.dependencycheck.data.update.nvd.api.NvdApiProcessor.call (NvdApiProcessor.java:96)
    at org.owasp.dependencycheck.data.update.nvd.api.NvdApiProcessor.call (NvdApiProcessor.java:40)
    at java.util.concurrent.FutureTask.run (FutureTask.java:264)
    at java.util.concurrent.ThreadPoolExecutor.runWorker (ThreadPoolExecutor.java:1136)
    at java.util.concurrent.ThreadPoolExecutor$Worker.run (ThreadPoolExecutor.java:635)
    at java.lang.Thread.run (Thread.java:840)
Caused by: org.h2.mvstore.MVStoreException: Writing to sun.nio.ch.FileChannelImpl@172ac804 failed; length 438272 at 251437056 [2.4.240/2]
    at org.h2.mvstore.DataUtils.newMVStoreException (DataUtils.java:996)
    at org.h2.mvstore.DataUtils.writeFully (DataUtils.java:478)
    at org.h2.mvstore.SingleFileStore.writeFully (SingleFileStore.java:67)
    at org.h2.mvstore.SingleFileStore.writeFully (SingleFileStore.java:28)
    at org.h2.mvstore.RandomAccessStore.writeChunk (RandomAccessStore.java:366)
    at org.h2.mvstore.RandomAccessStore.writeChunk (RandomAccessStore.java:28)
    at org.h2.mvstore.FileStore.storeBuffer (FileStore.java:1529)
    at org.h2.mvstore.FileStore.lambda$serializeAndStore$3 (FileStore.java:1437)
    at java.util.concurrent.Executors$RunnableAdapter.call (Executors.java:539)
    at java.util.concurrent.FutureTask.run (FutureTask.java:264)
    at java.util.concurrent.ThreadPoolExecutor.runWorker (ThreadPoolExecutor.java:1136)
    at java.util.concurrent.ThreadPoolExecutor$Worker.run (ThreadPoolExecutor.java:635)
    at java.lang.Thread.run (Thread.java:840)
Caused by: java.nio.channels.ClosedChannelException
    at sun.nio.ch.FileChannelImpl.ensureOpen (FileChannelImpl.java:159)
    at sun.nio.ch.FileChannelImpl.write (FileChannelImpl.java:854)
    at org.h2.mvstore.DataUtils.writeFully (DataUtils.java:474)
    at org.h2.mvstore.SingleFileStore.writeFully (SingleFileStore.java:67)
    at org.h2.mvstore.SingleFileStore.writeFully (SingleFileStore.java:28)
    at org.h2.mvstore.RandomAccessStore.writeChunk (RandomAccessStore.java:366)
    at org.h2.mvstore.RandomAccessStore.writeChunk (RandomAccessStore.java:28)
    at org.h2.mvstore.FileStore.storeBuffer (FileStore.java:1529)
    at org.h2.mvstore.FileStore.lambda$serializeAndStore$3 (FileStore.java:1437)
    at java.util.concurrent.Executors$RunnableAdapter.call (Executors.java:539)
    at java.util.concurrent.FutureTask.run (FutureTask.java:264)
    at java.util.concurrent.ThreadPoolExecutor.runWorker (ThreadPoolExecutor.java:1136)
    at java.util.concurrent.ThreadPoolExecutor$Worker.run (ThreadPoolExecutor.java:635)
    at java.lang.Thread.run (Thread.java:840)
[INFO] End database defrag (11315 ms)
[WARNING] An internal object pool swallowed an Exception.
org.h2.jdbc.JdbcSQLNonTransientException: General error: "General error: ""org.h2.mvstore.MVStoreException: Writing to sun.nio.ch.FileChannelImpl@172ac804 failed; length 438272 at 251437056 [2.4.240/2]"" [50000-240]" [50000-240]
    at org.h2.message.DbException.getJdbcSQLException (DbException.java:566)
    at org.h2.message.DbException.getJdbcSQLException (DbException.java:489)
    at org.h2.message.DbException.get (DbException.java:212)
    at org.h2.engine.Database.throwLastBackgroundException (Database.java:1841)
    at org.h2.engine.SessionLocal.close (SessionLocal.java:909)
    at org.h2.jdbc.JdbcConnection.close (JdbcConnection.java:390)
    at org.apache.commons.dbcp2.DelegatingConnection.closeInternal (DelegatingConnection.java:191)
    at org.apache.commons.dbcp2.PoolableConnection.reallyClose (PoolableConnection.java:379)
    at org.apache.commons.dbcp2.PoolableConnectionFactory.destroyObject (PoolableConnectionFactory.java:150)
    at org.apache.commons.pool2.impl.GenericObjectPool.destroy (GenericObjectPool.java:598)
    at org.apache.commons.pool2.impl.GenericObjectPool.clear (GenericObjectPool.java:443)
    at org.apache.commons.pool2.impl.GenericObjectPool.close (GenericObjectPool.java:477)
    at org.apache.commons.dbcp2.BasicDataSource.close (BasicDataSource.java:442)
    at org.owasp.dependencycheck.data.nvdcve.DatabaseManager.close (DatabaseManager.java:550)
    at org.owasp.dependencycheck.data.nvdcve.CveDB.close (CveDB.java:316)
    at org.owasp.dependencycheck.Engine.doUpdates (Engine.java:896)
    at org.owasp.dependencycheck.Engine.initializeAndUpdateDatabase (Engine.java:692)
    at org.owasp.dependencycheck.Engine.analyzeDependencies (Engine.java:619)
    at org.owasp.dependencycheck.maven.BaseDependencyCheckMojo.runCheck (BaseDependencyCheckMojo.java:2093)
    at org.owasp.dependencycheck.maven.BaseDependencyCheckMojo.execute (BaseDependencyCheckMojo.java:1291)
    at org.apache.maven.plugin.DefaultBuildPluginManager.executeMojo (DefaultBuildPluginManager.java:126)
    at org.apache.maven.lifecycle.internal.MojoExecutor.doExecute2 (MojoExecutor.java:328)
    at org.apache.maven.lifecycle.internal.MojoExecutor.doExecute (MojoExecutor.java:316)
    at org.apache.maven.lifecycle.internal.MojoExecutor.execute (MojoExecutor.java:212)
    at org.apache.maven.lifecycle.internal.MojoExecutor.execute (MojoExecutor.java:174)
    at org.apache.maven.lifecycle.internal.MojoExecutor.access$000 (MojoExecutor.java:75)
    at org.apache.maven.lifecycle.internal.MojoExecutor$1.run (MojoExecutor.java:162)
    at org.apache.maven.plugin.DefaultMojosExecutionStrategy.execute (DefaultMojosExecutionStrategy.java:39)
    at org.apache.maven.lifecycle.internal.MojoExecutor.execute (MojoExecutor.java:159)
    at org.apache.maven.lifecycle.internal.LifecycleModuleBuilder.buildProject (LifecycleModuleBuilder.java:105)
    at org.apache.maven.lifecycle.internal.LifecycleModuleBuilder.buildProject (LifecycleModuleBuilder.java:73)
    at org.apache.maven.lifecycle.internal.builder.singlethreaded.SingleThreadedBuilder.build (SingleThreadedBuilder.java:53)
    at org.apache.maven.lifecycle.internal.LifecycleStarter.execute (LifecycleStarter.java:118)
    at org.apache.maven.DefaultMaven.doExecute (DefaultMaven.java:261)
    at org.apache.maven.DefaultMaven.doExecute (DefaultMaven.java:173)
    at org.apache.maven.DefaultMaven.execute (DefaultMaven.java:101)
    at org.jvnet.hudson.maven3.launcher.Maven35Launcher.main (Maven35Launcher.java:138)
    at jdk.internal.reflect.NativeMethodAccessorImpl.invoke0 (Native Method)
    at jdk.internal.reflect.NativeMethodAccessorImpl.invoke (NativeMethodAccessorImpl.java:77)
    at jdk.internal.reflect.DelegatingMethodAccessorImpl.invoke (DelegatingMethodAccessorImpl.java:43)
    at java.lang.reflect.Method.invoke (Method.java:569)
    at org.codehaus.plexus.classworlds.launcher.Launcher.launchEnhanced (Launcher.java:255)
    at org.codehaus.plexus.classworlds.launcher.Launcher.launch (Launcher.java:201)
    at jenkins.maven3.agent.Maven35Main.launch (Maven35Main.java:179)
    at jdk.internal.reflect.NativeMethodAccessorImpl.invoke0 (Native Method)
    at jdk.internal.reflect.NativeMethodAccessorImpl.invoke (NativeMethodAccessorImpl.java:77)
    at jdk.internal.reflect.DelegatingMethodAccessorImpl.invoke (DelegatingMethodAccessorImpl.java:43)
    at java.lang.reflect.Method.invoke (Method.java:569)
    at hudson.maven.Maven3Builder.call (Maven3Builder.java:140)
    at hudson.maven.Maven3Builder.call (Maven3Builder.java:71)
    at hudson.remoting.UserRequest.perform (UserRequest.java:225)
    at hudson.remoting.UserRequest.perform (UserRequest.java:50)
    at hudson.remoting.Request$2.run (Request.java:391)
    at hudson.remoting.InterceptingExecutorService.lambda$wrap$0 (InterceptingExecutorService.java:81)
    at java.util.concurrent.FutureTask.run (FutureTask.java:264)
    at java.util.concurrent.ThreadPoolExecutor.runWorker (ThreadPoolExecutor.java:1136)
    at java.util.concurrent.ThreadPoolExecutor$Worker.run (ThreadPoolExecutor.java:635)
    at java.lang.Thread.run (Thread.java:840)
Caused by: org.h2.message.DbException: General error: "org.h2.mvstore.MVStoreException: Writing to sun.nio.ch.FileChannelImpl@172ac804 failed; length 438272 at 251437056 [2.4.240/2]" [50000-240]
    at org.h2.message.DbException.get (DbException.java:212)
    at org.h2.message.DbException.convert (DbException.java:407)
    at org.h2.mvstore.db.Store.lambda$new$0 (Store.java:122)
    at org.h2.mvstore.MVStore.handleException (MVStore.java:1675)
    at org.h2.mvstore.FileStore.writeInBackground (FileStore.java:1848)
    at org.h2.mvstore.FileStore$BackgroundWriterThread.run (FileStore.java:2257)
Caused by: org.h2.jdbc.JdbcSQLNonTransientException: General error: "org.h2.mvstore.MVStoreException: Writing to sun.nio.ch.FileChannelImpl@172ac804 failed; length 438272 at 251437056 [2.4.240/2]" [50000-240]
    at org.h2.message.DbException.getJdbcSQLException (DbException.java:566)
    at org.h2.message.DbException.getJdbcSQLException (DbException.java:489)
    at org.h2.message.DbException.get (DbException.java:212)
    at org.h2.message.DbException.convert (DbException.java:407)
    at org.h2.mvstore.db.Store.lambda$new$0 (Store.java:122)
    at org.h2.mvstore.MVStore.handleException (MVStore.java:1675)
    at org.h2.mvstore.FileStore.writeInBackground (FileStore.java:1848)
    at org.h2.mvstore.FileStore$BackgroundWriterThread.run (FileStore.java:2257)
Caused by: org.h2.mvstore.MVStoreException: Writing to sun.nio.ch.FileChannelImpl@172ac804 failed; length 438272 at 251437056 [2.4.240/2]
    at org.h2.mvstore.DataUtils.newMVStoreException (DataUtils.java:996)
    at org.h2.mvstore.DataUtils.writeFully (DataUtils.java:478)
    at org.h2.mvstore.SingleFileStore.writeFully (SingleFileStore.java:67)
    at org.h2.mvstore.SingleFileStore.writeFully (SingleFileStore.java:28)
    at org.h2.mvstore.RandomAccessStore.writeChunk (RandomAccessStore.java:366)
    at org.h2.mvstore.RandomAccessStore.writeChunk (RandomAccessStore.java:28)
    at org.h2.mvstore.FileStore.storeBuffer (FileStore.java:1529)
    at org.h2.mvstore.FileStore.lambda$serializeAndStore$3 (FileStore.java:1437)
    at java.util.concurrent.Executors$RunnableAdapter.call (Executors.java:539)
    at java.util.concurrent.FutureTask.run (FutureTask.java:264)
    at java.util.concurrent.ThreadPoolExecutor.runWorker (ThreadPoolExecutor.java:1136)
    at java.util.concurrent.ThreadPoolExecutor$Worker.run (ThreadPoolExecutor.java:635)
    at java.lang.Thread.run (Thread.java:840)
Caused by: java.nio.channels.ClosedChannelException
    at sun.nio.ch.FileChannelImpl.ensureOpen (FileChannelImpl.java:159)
    at sun.nio.ch.FileChannelImpl.write (FileChannelImpl.java:854)
    at org.h2.mvstore.DataUtils.writeFully (DataUtils.java:474)
    at org.h2.mvstore.SingleFileStore.writeFully (SingleFileStore.java:67)
    at org.h2.mvstore.SingleFileStore.writeFully (SingleFileStore.java:28)
    at org.h2.mvstore.RandomAccessStore.writeChunk (RandomAccessStore.java:366)
    at org.h2.mvstore.RandomAccessStore.writeChunk (RandomAccessStore.java:28)
    at org.h2.mvstore.FileStore.storeBuffer (FileStore.java:1529)
    at org.h2.mvstore.FileStore.lambda$serializeAndStore$3 (FileStore.java:1437)
    at java.util.concurrent.Executors$RunnableAdapter.call (Executors.java:539)
    at java.util.concurrent.FutureTask.run (FutureTask.java:264)
    at java.util.concurrent.ThreadPoolExecutor.runWorker (ThreadPoolExecutor.java:1136)
    at java.util.concurrent.ThreadPoolExecutor$Worker.run (ThreadPoolExecutor.java:635)
    at java.lang.Thread.run (Thread.java:840)
[WARNING] Unable to update 1 or more Cached Web DataSource, using local data instead. Results may not include recent vulnerabilities.
[ERROR] Unable to continue dependency-check analysis.
[WARNING] Attempt to (de-)serialize anonymous class org.jfrog.hudson.maven2.MavenDependenciesRecorder$1; see: https://jenkins.io/redirect/serialization-of-anonymous-classes/
[INFO] ------------------------------------------------------------------------
[INFO] Reactor Summary for pdfbox-reactor 4.0.0-SNAPSHOT:
[INFO] 
[INFO] Apache PDFBox parent ............................... FAILURE [01:59 min]
[INFO] Apache PDFBox io ................................... SKIPPED
[INFO] Apache FontBox ..................................... SKIPPED
[INFO] Apache XmpBox ...................................... SKIPPED
[INFO] Apache PDFBox ...................................... SKIPPED
[INFO] Apache PDFBox Debugger ............................. SKIPPED
[INFO] Apache PDFBox tools ................................ SKIPPED
[INFO] Apache PDFBox application .......................... SKIPPED
[INFO] Apache PDFBox Debugger application ................. SKIPPED
[INFO] Apache PDFBox examples ............................. SKIPPED
[INFO] pdfbox-reactor ..................................... SKIPPED
[INFO] ------------------------------------------------------------------------
[INFO] BUILD FAILURE
[INFO] ------------------------------------------------------------------------
[INFO] Total time:  02:17 min
[INFO] Finished at: 2026-06-22T15:40:56Z
[INFO] ------------------------------------------------------------------------
Waiting for Jenkins to finish collecting data
[ERROR] Failed to execute goal org.owasp:dependency-check-maven:12.2.2:check (default) on project pdfbox-parent: Fatal exception(s) analyzing Apache PDFBox parent: One or more exceptions occurred during analysis:
[ERROR] UpdateException: Error updating the NVD Data
[ERROR] caused by NvdApiException: NVD Returned Status Code: 429
[ERROR] NoDataException: No documents exist
[ERROR] -> [Help 1]
[ERROR] 
[ERROR] To see the full stack trace of the errors, re-run Maven with the -e switch.
[ERROR] Re-run Maven using the -X switch to enable full debug logging.
[ERROR] 
[ERROR] For more information about the errors and possible solutions, please read the following articles:
[ERROR] [Help 1] http://cwiki.apache.org/confluence/display/MAVEN/MojoExecutionException
[JENKINS] Archiving <https://ci-builds.apache.org/job/PDFBox/job/PDFBox-trunk/ws/xmpbox/pom.xml> to org.apache.pdfbox/xmpbox/4.0.0-SNAPSHOT/xmpbox-4.0.0-SNAPSHOT.pom
[JENKINS] Archiving <https://ci-builds.apache.org/job/PDFBox/job/PDFBox-trunk/ws/tools/pom.xml> to org.apache.pdfbox/pdfbox-tools/4.0.0-SNAPSHOT/pdfbox-tools-4.0.0-SNAPSHOT.pom
[JENKINS] Archiving <https://ci-builds.apache.org/job/PDFBox/job/PDFBox-trunk/ws/debugger/pom.xml> to org.apache.pdfbox/pdfbox-debugger/4.0.0-SNAPSHOT/pdfbox-debugger-4.0.0-SNAPSHOT.pom
[JENKINS] Archiving <https://ci-builds.apache.org/job/PDFBox/job/PDFBox-trunk/ws/app/pom.xml> to org.apache.pdfbox/pdfbox-app/4.0.0-SNAPSHOT/pdfbox-app-4.0.0-SNAPSHOT.pom
[JENKINS] Archiving <https://ci-builds.apache.org/job/PDFBox/job/PDFBox-trunk/ws/examples/pom.xml> to org.apache.pdfbox/pdfbox-examples/4.0.0-SNAPSHOT/pdfbox-examples-4.0.0-SNAPSHOT.pom
[JENKINS] Archiving <https://ci-builds.apache.org/job/PDFBox/job/PDFBox-trunk/ws/pom.xml> to org.apache.pdfbox/pdfbox-reactor/4.0.0-SNAPSHOT/pdfbox-reactor-4.0.0-SNAPSHOT.pom
[JENKINS] Archiving <https://ci-builds.apache.org/job/PDFBox/job/PDFBox-trunk/ws/parent/pom.xml> to org.apache.pdfbox/pdfbox-parent/4.0.0-SNAPSHOT/pdfbox-parent-4.0.0-SNAPSHOT.pom
[JENKINS] Archiving <https://ci-builds.apache.org/job/PDFBox/job/PDFBox-trunk/ws/pdfbox/pom.xml> to org.apache.pdfbox/pdfbox/4.0.0-SNAPSHOT/pdfbox-4.0.0-SNAPSHOT.pom
[JENKINS] Archiving <https://ci-builds.apache.org/job/PDFBox/job/PDFBox-trunk/ws/debugger-app/pom.xml> to org.apache.pdfbox/debugger-app/4.0.0-SNAPSHOT/debugger-app-4.0.0-SNAPSHOT.pom
[JENKINS] Archiving <https://ci-builds.apache.org/job/PDFBox/job/PDFBox-trunk/ws/io/pom.xml> to org.apache.pdfbox/pdfbox-io/4.0.0-SNAPSHOT/pdfbox-io-4.0.0-SNAPSHOT.pom
[JENKINS] Archiving <https://ci-builds.apache.org/job/PDFBox/job/PDFBox-trunk/ws/fontbox/pom.xml> to org.apache.pdfbox/fontbox/4.0.0-SNAPSHOT/fontbox-4.0.0-SNAPSHOT.pom
No mail will be sent out, as 'PDFBox » PDFBox-trunk » Apache XmpBox #3279' does not have a result yet. Please make sure you set a proper result in case of pipeline/build scripts.
No mail will be sent out, as 'PDFBox » PDFBox-trunk » Apache PDFBox tools #3279' does not have a result yet. Please make sure you set a proper result in case of pipeline/build scripts.
No mail will be sent out, as 'PDFBox » PDFBox-trunk » Apache PDFBox Debugger #3279' does not have a result yet. Please make sure you set a proper result in case of pipeline/build scripts.
No mail will be sent out, as 'PDFBox » PDFBox-trunk » Apache PDFBox application #3279' does not have a result yet. Please make sure you set a proper result in case of pipeline/build scripts.
No mail will be sent out, as 'PDFBox » PDFBox-trunk » Apache PDFBox examples #3279' does not have a result yet. Please make sure you set a proper result in case of pipeline/build scripts.
No mail will be sent out, as 'PDFBox » PDFBox-trunk » pdfbox-reactor #3279' does not have a result yet. Please make sure you set a proper result in case of pipeline/build scripts.
Sending e-mails to: dev@pdfbox.apache.org
No mail will be sent out, as 'PDFBox » PDFBox-trunk » Apache PDFBox #3279' does not have a result yet. Please make sure you set a proper result in case of pipeline/build scripts.
No mail will be sent out, as 'PDFBox » PDFBox-trunk » Apache PDFBox Debugger application #3279' does not have a result yet. Please make sure you set a proper result in case of pipeline/build scripts.
No mail will be sent out, as 'PDFBox » PDFBox-trunk » Apache PDFBox io #3279' does not have a result yet. Please make sure you set a proper result in case of pipeline/build scripts.
No mail will be sent out, as 'PDFBox » PDFBox-trunk » Apache FontBox #3279' does not have a result yet. Please make sure you set a proper result in case of pipeline/build scripts.
channel stopped
Archiving artifacts

---------------------------------------------------------------------
To unsubscribe, e-mail: dev-unsubscribe@pdfbox.apache.org
For additional commands, e-mail: dev-help@pdfbox.apache.org


Build failed in Jenkins: PDFBox » PDFBox-trunk #3278

Posted by Apache Jenkins Server <je...@builds.apache.org>.
See <https://ci-builds.apache.org/job/PDFBox/job/PDFBox-trunk/3278/display/redirect>

Changes:


------------------------------------------
[...truncated 4.71 MiB...]
    at org.owasp.dependencycheck.data.nvdcve.DatabaseManager.getConnection (DatabaseManager.java:576)
    at org.owasp.dependencycheck.data.nvdcve.CveDB.updateOrInsertVulnerability (CveDB.java:1168)
    at org.owasp.dependencycheck.data.nvdcve.CveDB.updateVulnerability (CveDB.java:1093)
    at org.owasp.dependencycheck.data.update.nvd.api.NvdApiProcessor.updateCveDb (NvdApiProcessor.java:119)
    at org.owasp.dependencycheck.data.update.nvd.api.NvdApiProcessor.call (NvdApiProcessor.java:96)
    at org.owasp.dependencycheck.data.update.nvd.api.NvdApiProcessor.call (NvdApiProcessor.java:40)
    at java.util.concurrent.FutureTask.run (FutureTask.java:264)
    at java.util.concurrent.ThreadPoolExecutor.runWorker (ThreadPoolExecutor.java:1136)
    at java.util.concurrent.ThreadPoolExecutor$Worker.run (ThreadPoolExecutor.java:635)
    at java.lang.Thread.run (Thread.java:840)
[ERROR] Failed to process CVE-2000-0492
java.lang.NullPointerException: Cannot invoke "org.apache.commons.dbcp2.BasicDataSource.getConnection()" because "this.connectionPool" is null
    at org.owasp.dependencycheck.data.nvdcve.DatabaseManager.getConnection (DatabaseManager.java:576)
    at org.owasp.dependencycheck.data.nvdcve.CveDB.updateOrInsertVulnerability (CveDB.java:1168)
    at org.owasp.dependencycheck.data.nvdcve.CveDB.updateVulnerability (CveDB.java:1093)
    at org.owasp.dependencycheck.data.update.nvd.api.NvdApiProcessor.updateCveDb (NvdApiProcessor.java:119)
    at org.owasp.dependencycheck.data.update.nvd.api.NvdApiProcessor.call (NvdApiProcessor.java:96)
    at org.owasp.dependencycheck.data.update.nvd.api.NvdApiProcessor.call (NvdApiProcessor.java:40)
    at java.util.concurrent.FutureTask.run (FutureTask.java:264)
    at java.util.concurrent.ThreadPoolExecutor.runWorker (ThreadPoolExecutor.java:1136)
    at java.util.concurrent.ThreadPoolExecutor$Worker.run (ThreadPoolExecutor.java:635)
    at java.lang.Thread.run (Thread.java:840)
[ERROR] Failed to process CVE-2000-0536
java.lang.NullPointerException: Cannot invoke "org.apache.commons.dbcp2.BasicDataSource.getConnection()" because "this.connectionPool" is null
    at org.owasp.dependencycheck.data.nvdcve.DatabaseManager.getConnection (DatabaseManager.java:576)
    at org.owasp.dependencycheck.data.nvdcve.CveDB.updateOrInsertVulnerability (CveDB.java:1168)
    at org.owasp.dependencycheck.data.nvdcve.CveDB.updateVulnerability (CveDB.java:1093)
    at org.owasp.dependencycheck.data.update.nvd.api.NvdApiProcessor.updateCveDb (NvdApiProcessor.java:119)
    at org.owasp.dependencycheck.data.update.nvd.api.NvdApiProcessor.call (NvdApiProcessor.java:96)
    at org.owasp.dependencycheck.data.update.nvd.api.NvdApiProcessor.call (NvdApiProcessor.java:40)
    at java.util.concurrent.FutureTask.run (FutureTask.java:264)
    at java.util.concurrent.ThreadPoolExecutor.runWorker (ThreadPoolExecutor.java:1136)
    at java.util.concurrent.ThreadPoolExecutor$Worker.run (ThreadPoolExecutor.java:635)
    at java.lang.Thread.run (Thread.java:840)
[ERROR] Failed to process CVE-2000-0518
java.lang.NullPointerException: Cannot invoke "org.apache.commons.dbcp2.BasicDataSource.getConnection()" because "this.connectionPool" is null
    at org.owasp.dependencycheck.data.nvdcve.DatabaseManager.getConnection (DatabaseManager.java:576)
    at org.owasp.dependencycheck.data.nvdcve.CveDB.updateOrInsertVulnerability (CveDB.java:1168)
    at org.owasp.dependencycheck.data.nvdcve.CveDB.updateVulnerability (CveDB.java:1093)
    at org.owasp.dependencycheck.data.update.nvd.api.NvdApiProcessor.updateCveDb (NvdApiProcessor.java:119)
    at org.owasp.dependencycheck.data.update.nvd.api.NvdApiProcessor.call (NvdApiProcessor.java:96)
    at org.owasp.dependencycheck.data.update.nvd.api.NvdApiProcessor.call (NvdApiProcessor.java:40)
    at java.util.concurrent.FutureTask.run (FutureTask.java:264)
    at java.util.concurrent.ThreadPoolExecutor.runWorker (ThreadPoolExecutor.java:1136)
    at java.util.concurrent.ThreadPoolExecutor$Worker.run (ThreadPoolExecutor.java:635)
    at java.lang.Thread.run (Thread.java:840)
[ERROR] Failed to process CVE-2000-0519
java.lang.NullPointerException: Cannot invoke "org.apache.commons.dbcp2.BasicDataSource.getConnection()" because "this.connectionPool" is null
    at org.owasp.dependencycheck.data.nvdcve.DatabaseManager.getConnection (DatabaseManager.java:576)
    at org.owasp.dependencycheck.data.nvdcve.CveDB.updateOrInsertVulnerability (CveDB.java:1168)
    at org.owasp.dependencycheck.data.nvdcve.CveDB.updateVulnerability (CveDB.java:1093)
    at org.owasp.dependencycheck.data.update.nvd.api.NvdApiProcessor.updateCveDb (NvdApiProcessor.java:119)
    at org.owasp.dependencycheck.data.update.nvd.api.NvdApiProcessor.call (NvdApiProcessor.java:96)
    at org.owasp.dependencycheck.data.update.nvd.api.NvdApiProcessor.call (NvdApiProcessor.java:40)
    at java.util.concurrent.FutureTask.run (FutureTask.java:264)
    at java.util.concurrent.ThreadPoolExecutor.runWorker (ThreadPoolExecutor.java:1136)
    at java.util.concurrent.ThreadPoolExecutor$Worker.run (ThreadPoolExecutor.java:635)
    at java.lang.Thread.run (Thread.java:840)
[ERROR] Failed to process CVE-2000-0521
java.lang.NullPointerException: Cannot invoke "org.apache.commons.dbcp2.BasicDataSource.getConnection()" because "this.connectionPool" is null
    at org.owasp.dependencycheck.data.nvdcve.DatabaseManager.getConnection (DatabaseManager.java:576)
    at org.owasp.dependencycheck.data.nvdcve.CveDB.updateOrInsertVulnerability (CveDB.java:1168)
    at org.owasp.dependencycheck.data.nvdcve.CveDB.updateVulnerability (CveDB.java:1093)
    at org.owasp.dependencycheck.data.update.nvd.api.NvdApiProcessor.updateCveDb (NvdApiProcessor.java:119)
    at org.owasp.dependencycheck.data.update.nvd.api.NvdApiProcessor.call (NvdApiProcessor.java:96)
    at org.owasp.dependencycheck.data.update.nvd.api.NvdApiProcessor.call (NvdApiProcessor.java:40)
    at java.util.concurrent.FutureTask.run (FutureTask.java:264)
    at java.util.concurrent.ThreadPoolExecutor.runWorker (ThreadPoolExecutor.java:1136)
    at java.util.concurrent.ThreadPoolExecutor$Worker.run (ThreadPoolExecutor.java:635)
    at java.lang.Thread.run (Thread.java:840)
[ERROR] Failed to process CVE-2000-0524
java.lang.NullPointerException: Cannot invoke "org.apache.commons.dbcp2.BasicDataSource.getConnection()" because "this.connectionPool" is null
    at org.owasp.dependencycheck.data.nvdcve.DatabaseManager.getConnection (DatabaseManager.java:576)
    at org.owasp.dependencycheck.data.nvdcve.CveDB.updateOrInsertVulnerability (CveDB.java:1168)
    at org.owasp.dependencycheck.data.nvdcve.CveDB.updateVulnerability (CveDB.java:1093)
    at org.owasp.dependencycheck.data.update.nvd.api.NvdApiProcessor.updateCveDb (NvdApiProcessor.java:119)
    at org.owasp.dependencycheck.data.update.nvd.api.NvdApiProcessor.call (NvdApiProcessor.java:96)
    at org.owasp.dependencycheck.data.update.nvd.api.NvdApiProcessor.call (NvdApiProcessor.java:40)
    at java.util.concurrent.FutureTask.run (FutureTask.java:264)
    at java.util.concurrent.ThreadPoolExecutor.runWorker (ThreadPoolExecutor.java:1136)
    at java.util.concurrent.ThreadPoolExecutor$Worker.run (ThreadPoolExecutor.java:635)
    at java.lang.Thread.run (Thread.java:840)
[ERROR] Failed to process CVE-2000-0537
java.lang.NullPointerException: Cannot invoke "org.apache.commons.dbcp2.BasicDataSource.getConnection()" because "this.connectionPool" is null
    at org.owasp.dependencycheck.data.nvdcve.DatabaseManager.getConnection (DatabaseManager.java:576)
    at org.owasp.dependencycheck.data.nvdcve.CveDB.updateOrInsertVulnerability (CveDB.java:1168)
    at org.owasp.dependencycheck.data.nvdcve.CveDB.updateVulnerability (CveDB.java:1093)
    at org.owasp.dependencycheck.data.update.nvd.api.NvdApiProcessor.updateCveDb (NvdApiProcessor.java:119)
    at org.owasp.dependencycheck.data.update.nvd.api.NvdApiProcessor.call (NvdApiProcessor.java:96)
    at org.owasp.dependencycheck.data.update.nvd.api.NvdApiProcessor.call (NvdApiProcessor.java:40)
    at java.util.concurrent.FutureTask.run (FutureTask.java:264)
    at java.util.concurrent.ThreadPoolExecutor.runWorker (ThreadPoolExecutor.java:1136)
    at java.util.concurrent.ThreadPoolExecutor$Worker.run (ThreadPoolExecutor.java:635)
    at java.lang.Thread.run (Thread.java:840)
[ERROR] Failed to process CVE-2000-0556
java.lang.NullPointerException: Cannot invoke "org.apache.commons.dbcp2.BasicDataSource.getConnection()" because "this.connectionPool" is null
    at org.owasp.dependencycheck.data.nvdcve.DatabaseManager.getConnection (DatabaseManager.java:576)
    at org.owasp.dependencycheck.data.nvdcve.CveDB.updateOrInsertVulnerability (CveDB.java:1168)
    at org.owasp.dependencycheck.data.nvdcve.CveDB.updateVulnerability (CveDB.java:1093)
    at org.owasp.dependencycheck.data.update.nvd.api.NvdApiProcessor.updateCveDb (NvdApiProcessor.java:119)
    at org.owasp.dependencycheck.data.update.nvd.api.NvdApiProcessor.call (NvdApiProcessor.java:96)
    at org.owasp.dependencycheck.data.update.nvd.api.NvdApiProcessor.call (NvdApiProcessor.java:40)
    at java.util.concurrent.FutureTask.run (FutureTask.java:264)
    at java.util.concurrent.ThreadPoolExecutor.runWorker (ThreadPoolExecutor.java:1136)
    at java.util.concurrent.ThreadPoolExecutor$Worker.run (ThreadPoolExecutor.java:635)
    at java.lang.Thread.run (Thread.java:840)
[ERROR] Failed to process CVE-2000-0557
java.lang.NullPointerException: Cannot invoke "org.apache.commons.dbcp2.BasicDataSource.getConnection()" because "this.connectionPool" is null
    at org.owasp.dependencycheck.data.nvdcve.DatabaseManager.getConnection (DatabaseManager.java:576)
    at org.owasp.dependencycheck.data.nvdcve.CveDB.updateOrInsertVulnerability (CveDB.java:1168)
    at org.owasp.dependencycheck.data.nvdcve.CveDB.updateVulnerability (CveDB.java:1093)
    at org.owasp.dependencycheck.data.update.nvd.api.NvdApiProcessor.updateCveDb (NvdApiProcessor.java:119)
    at org.owasp.dependencycheck.data.update.nvd.api.NvdApiProcessor.call (NvdApiProcessor.java:96)
    at org.owasp.dependencycheck.data.update.nvd.api.NvdApiProcessor.call (NvdApiProcessor.java:40)
    at java.util.concurrent.FutureTask.run (FutureTask.java:264)
    at java.util.concurrent.ThreadPoolExecutor.runWorker (ThreadPoolExecutor.java:1136)
    at java.util.concurrent.ThreadPoolExecutor$Worker.run (ThreadPoolExecutor.java:635)
    at java.lang.Thread.run (Thread.java:840)
[ERROR] Failed to process CVE-2000-0482
java.lang.NullPointerException: Cannot invoke "org.apache.commons.dbcp2.BasicDataSource.getConnection()" because "this.connectionPool" is null
    at org.owasp.dependencycheck.data.nvdcve.DatabaseManager.getConnection (DatabaseManager.java:576)
    at org.owasp.dependencycheck.data.nvdcve.CveDB.updateOrInsertVulnerability (CveDB.java:1168)
    at org.owasp.dependencycheck.data.nvdcve.CveDB.updateVulnerability (CveDB.java:1093)
    at org.owasp.dependencycheck.data.update.nvd.api.NvdApiProcessor.updateCveDb (NvdApiProcessor.java:119)
    at org.owasp.dependencycheck.data.update.nvd.api.NvdApiProcessor.call (NvdApiProcessor.java:96)
    at org.owasp.dependencycheck.data.update.nvd.api.NvdApiProcessor.call (NvdApiProcessor.java:40)
    at java.util.concurrent.FutureTask.run (FutureTask.java:264)
    at java.util.concurrent.ThreadPoolExecutor.runWorker (ThreadPoolExecutor.java:1136)
    at java.util.concurrent.ThreadPoolExecutor$Worker.run (ThreadPoolExecutor.java:635)
    at java.lang.Thread.run (Thread.java:840)
[ERROR] Failed to process CVE-2000-0503
java.lang.NullPointerException: Cannot invoke "org.apache.commons.dbcp2.BasicDataSource.getConnection()" because "this.connectionPool" is null
    at org.owasp.dependencycheck.data.nvdcve.DatabaseManager.getConnection (DatabaseManager.java:576)
    at org.owasp.dependencycheck.data.nvdcve.CveDB.updateOrInsertVulnerability (CveDB.java:1168)
    at org.owasp.dependencycheck.data.nvdcve.CveDB.updateVulnerability (CveDB.java:1093)
    at org.owasp.dependencycheck.data.update.nvd.api.NvdApiProcessor.updateCveDb (NvdApiProcessor.java:119)
    at org.owasp.dependencycheck.data.update.nvd.api.NvdApiProcessor.call (NvdApiProcessor.java:96)
    at org.owasp.dependencycheck.data.update.nvd.api.NvdApiProcessor.call (NvdApiProcessor.java:40)
    at java.util.concurrent.FutureTask.run (FutureTask.java:264)
    at java.util.concurrent.ThreadPoolExecutor.runWorker (ThreadPoolExecutor.java:1136)
    at java.util.concurrent.ThreadPoolExecutor$Worker.run (ThreadPoolExecutor.java:635)
    at java.lang.Thread.run (Thread.java:840)
[ERROR] Failed to process CVE-2000-0516
java.lang.NullPointerException: Cannot invoke "org.apache.commons.dbcp2.BasicDataSource.getConnection()" because "this.connectionPool" is null
    at org.owasp.dependencycheck.data.nvdcve.DatabaseManager.getConnection (DatabaseManager.java:576)
    at org.owasp.dependencycheck.data.nvdcve.CveDB.updateOrInsertVulnerability (CveDB.java:1168)
    at org.owasp.dependencycheck.data.nvdcve.CveDB.updateVulnerability (CveDB.java:1093)
    at org.owasp.dependencycheck.data.update.nvd.api.NvdApiProcessor.updateCveDb (NvdApiProcessor.java:119)
    at org.owasp.dependencycheck.data.update.nvd.api.NvdApiProcessor.call (NvdApiProcessor.java:96)
    at org.owasp.dependencycheck.data.update.nvd.api.NvdApiProcessor.call (NvdApiProcessor.java:40)
    at java.util.concurrent.FutureTask.run (FutureTask.java:264)
    at java.util.concurrent.ThreadPoolExecutor.runWorker (ThreadPoolExecutor.java:1136)
    at java.util.concurrent.ThreadPoolExecutor$Worker.run (ThreadPoolExecutor.java:635)
    at java.lang.Thread.run (Thread.java:840)
[ERROR] Failed to process CVE-2000-0523
java.lang.NullPointerException: Cannot invoke "org.apache.commons.dbcp2.BasicDataSource.getConnection()" because "this.connectionPool" is null
    at org.owasp.dependencycheck.data.nvdcve.DatabaseManager.getConnection (DatabaseManager.java:576)
    at org.owasp.dependencycheck.data.nvdcve.CveDB.updateOrInsertVulnerability (CveDB.java:1168)
    at org.owasp.dependencycheck.data.nvdcve.CveDB.updateVulnerability (CveDB.java:1093)
    at org.owasp.dependencycheck.data.update.nvd.api.NvdApiProcessor.updateCveDb (NvdApiProcessor.java:119)
    at org.owasp.dependencycheck.data.update.nvd.api.NvdApiProcessor.call (NvdApiProcessor.java:96)
    at org.owasp.dependencycheck.data.update.nvd.api.NvdApiProcessor.call (NvdApiProcessor.java:40)
    at java.util.concurrent.FutureTask.run (FutureTask.java:264)
    at java.util.concurrent.ThreadPoolExecutor.runWorker (ThreadPoolExecutor.java:1136)
    at java.util.concurrent.ThreadPoolExecutor$Worker.run (ThreadPoolExecutor.java:635)
    at java.lang.Thread.run (Thread.java:840)
[ERROR] Failed to process CVE-2000-0552
java.lang.NullPointerException: Cannot invoke "org.apache.commons.dbcp2.BasicDataSource.getConnection()" because "this.connectionPool" is null
    at org.owasp.dependencycheck.data.nvdcve.DatabaseManager.getConnection (DatabaseManager.java:576)
    at org.owasp.dependencycheck.data.nvdcve.CveDB.updateOrInsertVulnerability (CveDB.java:1168)
    at org.owasp.dependencycheck.data.nvdcve.CveDB.updateVulnerability (CveDB.java:1093)
    at org.owasp.dependencycheck.data.update.nvd.api.NvdApiProcessor.updateCveDb (NvdApiProcessor.java:119)
    at org.owasp.dependencycheck.data.update.nvd.api.NvdApiProcessor.call (NvdApiProcessor.java:96)
    at org.owasp.dependencycheck.data.update.nvd.api.NvdApiProcessor.call (NvdApiProcessor.java:40)
    at java.util.concurrent.FutureTask.run (FutureTask.java:264)
    at java.util.concurrent.ThreadPoolExecutor.runWorker (ThreadPoolExecutor.java:1136)
    at java.util.concurrent.ThreadPoolExecutor$Worker.run (ThreadPoolExecutor.java:635)
    at java.lang.Thread.run (Thread.java:840)
[ERROR] Failed to process CVE-2000-0558
java.lang.NullPointerException: Cannot invoke "org.apache.commons.dbcp2.BasicDataSource.getConnection()" because "this.connectionPool" is null
    at org.owasp.dependencycheck.data.nvdcve.DatabaseManager.getConnection (DatabaseManager.java:576)
    at org.owasp.dependencycheck.data.nvdcve.CveDB.updateOrInsertVulnerability (CveDB.java:1168)
    at org.owasp.dependencycheck.data.nvdcve.CveDB.updateVulnerability (CveDB.java:1093)
    at org.owasp.dependencycheck.data.update.nvd.api.NvdApiProcessor.updateCveDb (NvdApiProcessor.java:119)
    at org.owasp.dependencycheck.data.update.nvd.api.NvdApiProcessor.call (NvdApiProcessor.java:96)
    at org.owasp.dependencycheck.data.update.nvd.api.NvdApiProcessor.call (NvdApiProcessor.java:40)
    at java.util.concurrent.FutureTask.run (FutureTask.java:264)
    at java.util.concurrent.ThreadPoolExecutor.runWorker (ThreadPoolExecutor.java:1136)
    at java.util.concurrent.ThreadPoolExecutor$Worker.run (ThreadPoolExecutor.java:635)
    at java.lang.Thread.run (Thread.java:840)
[WARNING] Attempt to (de-)serialize anonymous class org.jfrog.hudson.maven2.MavenDependenciesRecorder$1; see: https://jenkins.io/redirect/serialization-of-anonymous-classes/
[INFO] ------------------------------------------------------------------------
[INFO] Reactor Summary for pdfbox-reactor 4.0.0-SNAPSHOT:
[INFO] 
[INFO] Apache PDFBox parent ............................... FAILURE [ 56.770 s]
[INFO] Apache PDFBox io ................................... SKIPPED
[INFO] Apache FontBox ..................................... SKIPPED
[INFO] Apache XmpBox ...................................... SKIPPED
[INFO] Apache PDFBox ...................................... SKIPPED
[INFO] Apache PDFBox Debugger ............................. SKIPPED
[INFO] Apache PDFBox tools ................................ SKIPPED
[INFO] Apache PDFBox application .......................... SKIPPED
[INFO] Apache PDFBox Debugger application ................. SKIPPED
[INFO] Apache PDFBox examples ............................. SKIPPED
[INFO] pdfbox-reactor ..................................... SKIPPED
[INFO] ------------------------------------------------------------------------
[INFO] BUILD FAILURE
[INFO] ------------------------------------------------------------------------
[INFO] Total time:  01:20 min
[INFO] Finished at: 2026-06-22T11:02:19Z
[INFO] ------------------------------------------------------------------------
Waiting for Jenkins to finish collecting data
[ERROR] Failed to execute goal org.owasp:dependency-check-maven:12.2.2:check (default) on project pdfbox-parent: Fatal exception(s) analyzing Apache PDFBox parent: One or more exceptions occurred during analysis:
[ERROR] UpdateException: org.h2.jdbc.JdbcBatchUpdateException: General error: "org.h2.mvstore.MVStoreException: Reading from file sun.nio.ch.FileChannelImpl@13b23736 failed at 16361005 (length -1), read 0, remaining 384 [2.4.240/1]"; SQL statement:
[ERROR] SELECT cveID FROM knownExploited cveID WHERE cveID=? [50000-240]
[ERROR] caused by JdbcBatchUpdateException: General error: "org.h2.mvstore.MVStoreException: Reading from file sun.nio.ch.FileChannelImpl@13b23736 failed at 16361005 (length -1), read 0, remaining 384 [2.4.240/1]"; SQL statement:
[ERROR] SELECT cveID FROM knownExploited cveID WHERE cveID=? [50000-240]
[ERROR] NoDataException: No documents exist
[ERROR] -> [Help 1]
[ERROR] 
[ERROR] To see the full stack trace of the errors, re-run Maven with the -e switch.
[ERROR] Re-run Maven using the -X switch to enable full debug logging.
[ERROR] 
[ERROR] For more information about the errors and possible solutions, please read the following articles:
[ERROR] [Help 1] http://cwiki.apache.org/confluence/display/MAVEN/MojoExecutionException
[JENKINS] Archiving <https://ci-builds.apache.org/job/PDFBox/job/PDFBox-trunk/ws/xmpbox/pom.xml> to org.apache.pdfbox/xmpbox/4.0.0-SNAPSHOT/xmpbox-4.0.0-SNAPSHOT.pom
[JENKINS] Archiving <https://ci-builds.apache.org/job/PDFBox/job/PDFBox-trunk/ws/tools/pom.xml> to org.apache.pdfbox/pdfbox-tools/4.0.0-SNAPSHOT/pdfbox-tools-4.0.0-SNAPSHOT.pom
[JENKINS] Archiving <https://ci-builds.apache.org/job/PDFBox/job/PDFBox-trunk/ws/debugger/pom.xml> to org.apache.pdfbox/pdfbox-debugger/4.0.0-SNAPSHOT/pdfbox-debugger-4.0.0-SNAPSHOT.pom
[JENKINS] Archiving <https://ci-builds.apache.org/job/PDFBox/job/PDFBox-trunk/ws/app/pom.xml> to org.apache.pdfbox/pdfbox-app/4.0.0-SNAPSHOT/pdfbox-app-4.0.0-SNAPSHOT.pom
[JENKINS] Archiving <https://ci-builds.apache.org/job/PDFBox/job/PDFBox-trunk/ws/examples/pom.xml> to org.apache.pdfbox/pdfbox-examples/4.0.0-SNAPSHOT/pdfbox-examples-4.0.0-SNAPSHOT.pom
[JENKINS] Archiving <https://ci-builds.apache.org/job/PDFBox/job/PDFBox-trunk/ws/pom.xml> to org.apache.pdfbox/pdfbox-reactor/4.0.0-SNAPSHOT/pdfbox-reactor-4.0.0-SNAPSHOT.pom
[JENKINS] Archiving <https://ci-builds.apache.org/job/PDFBox/job/PDFBox-trunk/ws/parent/pom.xml> to org.apache.pdfbox/pdfbox-parent/4.0.0-SNAPSHOT/pdfbox-parent-4.0.0-SNAPSHOT.pom
[JENKINS] Archiving <https://ci-builds.apache.org/job/PDFBox/job/PDFBox-trunk/ws/pdfbox/pom.xml> to org.apache.pdfbox/pdfbox/4.0.0-SNAPSHOT/pdfbox-4.0.0-SNAPSHOT.pom
[JENKINS] Archiving <https://ci-builds.apache.org/job/PDFBox/job/PDFBox-trunk/ws/debugger-app/pom.xml> to org.apache.pdfbox/debugger-app/4.0.0-SNAPSHOT/debugger-app-4.0.0-SNAPSHOT.pom
[JENKINS] Archiving <https://ci-builds.apache.org/job/PDFBox/job/PDFBox-trunk/ws/io/pom.xml> to org.apache.pdfbox/pdfbox-io/4.0.0-SNAPSHOT/pdfbox-io-4.0.0-SNAPSHOT.pom
[JENKINS] Archiving <https://ci-builds.apache.org/job/PDFBox/job/PDFBox-trunk/ws/fontbox/pom.xml> to org.apache.pdfbox/fontbox/4.0.0-SNAPSHOT/fontbox-4.0.0-SNAPSHOT.pom
No mail will be sent out, as 'PDFBox » PDFBox-trunk » Apache XmpBox #3278' does not have a result yet. Please make sure you set a proper result in case of pipeline/build scripts.
No mail will be sent out, as 'PDFBox » PDFBox-trunk » Apache PDFBox tools #3278' does not have a result yet. Please make sure you set a proper result in case of pipeline/build scripts.
No mail will be sent out, as 'PDFBox » PDFBox-trunk » Apache PDFBox Debugger #3278' does not have a result yet. Please make sure you set a proper result in case of pipeline/build scripts.
No mail will be sent out, as 'PDFBox » PDFBox-trunk » Apache PDFBox application #3278' does not have a result yet. Please make sure you set a proper result in case of pipeline/build scripts.
No mail will be sent out, as 'PDFBox » PDFBox-trunk » Apache PDFBox examples #3278' does not have a result yet. Please make sure you set a proper result in case of pipeline/build scripts.
No mail will be sent out, as 'PDFBox » PDFBox-trunk » pdfbox-reactor #3278' does not have a result yet. Please make sure you set a proper result in case of pipeline/build scripts.
Sending e-mails to: dev@pdfbox.apache.org
No mail will be sent out, as 'PDFBox » PDFBox-trunk » Apache PDFBox #3278' does not have a result yet. Please make sure you set a proper result in case of pipeline/build scripts.
No mail will be sent out, as 'PDFBox » PDFBox-trunk » Apache PDFBox Debugger application #3278' does not have a result yet. Please make sure you set a proper result in case of pipeline/build scripts.
No mail will be sent out, as 'PDFBox » PDFBox-trunk » Apache PDFBox io #3278' does not have a result yet. Please make sure you set a proper result in case of pipeline/build scripts.
No mail will be sent out, as 'PDFBox » PDFBox-trunk » Apache FontBox #3278' does not have a result yet. Please make sure you set a proper result in case of pipeline/build scripts.
channel stopped
Archiving artifacts

---------------------------------------------------------------------
To unsubscribe, e-mail: dev-unsubscribe@pdfbox.apache.org
For additional commands, e-mail: dev-help@pdfbox.apache.org


Build failed in Jenkins: PDFBox » PDFBox-trunk #3277

Posted by Apache Jenkins Server <je...@builds.apache.org>.
See <https://ci-builds.apache.org/job/PDFBox/job/PDFBox-trunk/3277/display/redirect>

Changes:


------------------------------------------
[...truncated 4.70 MiB...]
    at org.owasp.dependencycheck.data.nvdcve.DatabaseManager.getConnection (DatabaseManager.java:576)
    at org.owasp.dependencycheck.data.nvdcve.CveDB.updateOrInsertVulnerability (CveDB.java:1168)
    at org.owasp.dependencycheck.data.nvdcve.CveDB.updateVulnerability (CveDB.java:1093)
    at org.owasp.dependencycheck.data.update.nvd.api.NvdApiProcessor.updateCveDb (NvdApiProcessor.java:119)
    at org.owasp.dependencycheck.data.update.nvd.api.NvdApiProcessor.call (NvdApiProcessor.java:96)
    at org.owasp.dependencycheck.data.update.nvd.api.NvdApiProcessor.call (NvdApiProcessor.java:40)
    at java.util.concurrent.FutureTask.run (FutureTask.java:264)
    at java.util.concurrent.ThreadPoolExecutor.runWorker (ThreadPoolExecutor.java:1136)
    at java.util.concurrent.ThreadPoolExecutor$Worker.run (ThreadPoolExecutor.java:635)
    at java.lang.Thread.run (Thread.java:840)
[ERROR] Failed to process CVE-2000-0492
java.lang.NullPointerException: Cannot invoke "org.apache.commons.dbcp2.BasicDataSource.getConnection()" because "this.connectionPool" is null
    at org.owasp.dependencycheck.data.nvdcve.DatabaseManager.getConnection (DatabaseManager.java:576)
    at org.owasp.dependencycheck.data.nvdcve.CveDB.updateOrInsertVulnerability (CveDB.java:1168)
    at org.owasp.dependencycheck.data.nvdcve.CveDB.updateVulnerability (CveDB.java:1093)
    at org.owasp.dependencycheck.data.update.nvd.api.NvdApiProcessor.updateCveDb (NvdApiProcessor.java:119)
    at org.owasp.dependencycheck.data.update.nvd.api.NvdApiProcessor.call (NvdApiProcessor.java:96)
    at org.owasp.dependencycheck.data.update.nvd.api.NvdApiProcessor.call (NvdApiProcessor.java:40)
    at java.util.concurrent.FutureTask.run (FutureTask.java:264)
    at java.util.concurrent.ThreadPoolExecutor.runWorker (ThreadPoolExecutor.java:1136)
    at java.util.concurrent.ThreadPoolExecutor$Worker.run (ThreadPoolExecutor.java:635)
    at java.lang.Thread.run (Thread.java:840)
[ERROR] Failed to process CVE-2000-0536
java.lang.NullPointerException: Cannot invoke "org.apache.commons.dbcp2.BasicDataSource.getConnection()" because "this.connectionPool" is null
    at org.owasp.dependencycheck.data.nvdcve.DatabaseManager.getConnection (DatabaseManager.java:576)
    at org.owasp.dependencycheck.data.nvdcve.CveDB.updateOrInsertVulnerability (CveDB.java:1168)
    at org.owasp.dependencycheck.data.nvdcve.CveDB.updateVulnerability (CveDB.java:1093)
    at org.owasp.dependencycheck.data.update.nvd.api.NvdApiProcessor.updateCveDb (NvdApiProcessor.java:119)
    at org.owasp.dependencycheck.data.update.nvd.api.NvdApiProcessor.call (NvdApiProcessor.java:96)
    at org.owasp.dependencycheck.data.update.nvd.api.NvdApiProcessor.call (NvdApiProcessor.java:40)
    at java.util.concurrent.FutureTask.run (FutureTask.java:264)
    at java.util.concurrent.ThreadPoolExecutor.runWorker (ThreadPoolExecutor.java:1136)
    at java.util.concurrent.ThreadPoolExecutor$Worker.run (ThreadPoolExecutor.java:635)
    at java.lang.Thread.run (Thread.java:840)
[ERROR] Failed to process CVE-2000-0518
java.lang.NullPointerException: Cannot invoke "org.apache.commons.dbcp2.BasicDataSource.getConnection()" because "this.connectionPool" is null
    at org.owasp.dependencycheck.data.nvdcve.DatabaseManager.getConnection (DatabaseManager.java:576)
    at org.owasp.dependencycheck.data.nvdcve.CveDB.updateOrInsertVulnerability (CveDB.java:1168)
    at org.owasp.dependencycheck.data.nvdcve.CveDB.updateVulnerability (CveDB.java:1093)
    at org.owasp.dependencycheck.data.update.nvd.api.NvdApiProcessor.updateCveDb (NvdApiProcessor.java:119)
    at org.owasp.dependencycheck.data.update.nvd.api.NvdApiProcessor.call (NvdApiProcessor.java:96)
    at org.owasp.dependencycheck.data.update.nvd.api.NvdApiProcessor.call (NvdApiProcessor.java:40)
    at java.util.concurrent.FutureTask.run (FutureTask.java:264)
    at java.util.concurrent.ThreadPoolExecutor.runWorker (ThreadPoolExecutor.java:1136)
    at java.util.concurrent.ThreadPoolExecutor$Worker.run (ThreadPoolExecutor.java:635)
    at java.lang.Thread.run (Thread.java:840)
[ERROR] Failed to process CVE-2000-0519
java.lang.NullPointerException: Cannot invoke "org.apache.commons.dbcp2.BasicDataSource.getConnection()" because "this.connectionPool" is null
    at org.owasp.dependencycheck.data.nvdcve.DatabaseManager.getConnection (DatabaseManager.java:576)
    at org.owasp.dependencycheck.data.nvdcve.CveDB.updateOrInsertVulnerability (CveDB.java:1168)
    at org.owasp.dependencycheck.data.nvdcve.CveDB.updateVulnerability (CveDB.java:1093)
    at org.owasp.dependencycheck.data.update.nvd.api.NvdApiProcessor.updateCveDb (NvdApiProcessor.java:119)
    at org.owasp.dependencycheck.data.update.nvd.api.NvdApiProcessor.call (NvdApiProcessor.java:96)
    at org.owasp.dependencycheck.data.update.nvd.api.NvdApiProcessor.call (NvdApiProcessor.java:40)
    at java.util.concurrent.FutureTask.run (FutureTask.java:264)
    at java.util.concurrent.ThreadPoolExecutor.runWorker (ThreadPoolExecutor.java:1136)
    at java.util.concurrent.ThreadPoolExecutor$Worker.run (ThreadPoolExecutor.java:635)
    at java.lang.Thread.run (Thread.java:840)
[ERROR] Failed to process CVE-2000-0521
java.lang.NullPointerException: Cannot invoke "org.apache.commons.dbcp2.BasicDataSource.getConnection()" because "this.connectionPool" is null
    at org.owasp.dependencycheck.data.nvdcve.DatabaseManager.getConnection (DatabaseManager.java:576)
    at org.owasp.dependencycheck.data.nvdcve.CveDB.updateOrInsertVulnerability (CveDB.java:1168)
    at org.owasp.dependencycheck.data.nvdcve.CveDB.updateVulnerability (CveDB.java:1093)
    at org.owasp.dependencycheck.data.update.nvd.api.NvdApiProcessor.updateCveDb (NvdApiProcessor.java:119)
    at org.owasp.dependencycheck.data.update.nvd.api.NvdApiProcessor.call (NvdApiProcessor.java:96)
    at org.owasp.dependencycheck.data.update.nvd.api.NvdApiProcessor.call (NvdApiProcessor.java:40)
    at java.util.concurrent.FutureTask.run (FutureTask.java:264)
    at java.util.concurrent.ThreadPoolExecutor.runWorker (ThreadPoolExecutor.java:1136)
    at java.util.concurrent.ThreadPoolExecutor$Worker.run (ThreadPoolExecutor.java:635)
    at java.lang.Thread.run (Thread.java:840)
[ERROR] Failed to process CVE-2000-0524
java.lang.NullPointerException: Cannot invoke "org.apache.commons.dbcp2.BasicDataSource.getConnection()" because "this.connectionPool" is null
    at org.owasp.dependencycheck.data.nvdcve.DatabaseManager.getConnection (DatabaseManager.java:576)
    at org.owasp.dependencycheck.data.nvdcve.CveDB.updateOrInsertVulnerability (CveDB.java:1168)
    at org.owasp.dependencycheck.data.nvdcve.CveDB.updateVulnerability (CveDB.java:1093)
    at org.owasp.dependencycheck.data.update.nvd.api.NvdApiProcessor.updateCveDb (NvdApiProcessor.java:119)
    at org.owasp.dependencycheck.data.update.nvd.api.NvdApiProcessor.call (NvdApiProcessor.java:96)
    at org.owasp.dependencycheck.data.update.nvd.api.NvdApiProcessor.call (NvdApiProcessor.java:40)
    at java.util.concurrent.FutureTask.run (FutureTask.java:264)
    at java.util.concurrent.ThreadPoolExecutor.runWorker (ThreadPoolExecutor.java:1136)
    at java.util.concurrent.ThreadPoolExecutor$Worker.run (ThreadPoolExecutor.java:635)
    at java.lang.Thread.run (Thread.java:840)
[ERROR] Failed to process CVE-2000-0537
java.lang.NullPointerException: Cannot invoke "org.apache.commons.dbcp2.BasicDataSource.getConnection()" because "this.connectionPool" is null
    at org.owasp.dependencycheck.data.nvdcve.DatabaseManager.getConnection (DatabaseManager.java:576)
    at org.owasp.dependencycheck.data.nvdcve.CveDB.updateOrInsertVulnerability (CveDB.java:1168)
    at org.owasp.dependencycheck.data.nvdcve.CveDB.updateVulnerability (CveDB.java:1093)
    at org.owasp.dependencycheck.data.update.nvd.api.NvdApiProcessor.updateCveDb (NvdApiProcessor.java:119)
    at org.owasp.dependencycheck.data.update.nvd.api.NvdApiProcessor.call (NvdApiProcessor.java:96)
    at org.owasp.dependencycheck.data.update.nvd.api.NvdApiProcessor.call (NvdApiProcessor.java:40)
    at java.util.concurrent.FutureTask.run (FutureTask.java:264)
    at java.util.concurrent.ThreadPoolExecutor.runWorker (ThreadPoolExecutor.java:1136)
    at java.util.concurrent.ThreadPoolExecutor$Worker.run (ThreadPoolExecutor.java:635)
    at java.lang.Thread.run (Thread.java:840)
[ERROR] Failed to process CVE-2000-0556
java.lang.NullPointerException: Cannot invoke "org.apache.commons.dbcp2.BasicDataSource.getConnection()" because "this.connectionPool" is null
    at org.owasp.dependencycheck.data.nvdcve.DatabaseManager.getConnection (DatabaseManager.java:576)
    at org.owasp.dependencycheck.data.nvdcve.CveDB.updateOrInsertVulnerability (CveDB.java:1168)
    at org.owasp.dependencycheck.data.nvdcve.CveDB.updateVulnerability (CveDB.java:1093)
    at org.owasp.dependencycheck.data.update.nvd.api.NvdApiProcessor.updateCveDb (NvdApiProcessor.java:119)
    at org.owasp.dependencycheck.data.update.nvd.api.NvdApiProcessor.call (NvdApiProcessor.java:96)
    at org.owasp.dependencycheck.data.update.nvd.api.NvdApiProcessor.call (NvdApiProcessor.java:40)
    at java.util.concurrent.FutureTask.run (FutureTask.java:264)
    at java.util.concurrent.ThreadPoolExecutor.runWorker (ThreadPoolExecutor.java:1136)
    at java.util.concurrent.ThreadPoolExecutor$Worker.run (ThreadPoolExecutor.java:635)
    at java.lang.Thread.run (Thread.java:840)
[ERROR] Failed to process CVE-2000-0557
java.lang.NullPointerException: Cannot invoke "org.apache.commons.dbcp2.BasicDataSource.getConnection()" because "this.connectionPool" is null
    at org.owasp.dependencycheck.data.nvdcve.DatabaseManager.getConnection (DatabaseManager.java:576)
    at org.owasp.dependencycheck.data.nvdcve.CveDB.updateOrInsertVulnerability (CveDB.java:1168)
    at org.owasp.dependencycheck.data.nvdcve.CveDB.updateVulnerability (CveDB.java:1093)
    at org.owasp.dependencycheck.data.update.nvd.api.NvdApiProcessor.updateCveDb (NvdApiProcessor.java:119)
    at org.owasp.dependencycheck.data.update.nvd.api.NvdApiProcessor.call (NvdApiProcessor.java:96)
    at org.owasp.dependencycheck.data.update.nvd.api.NvdApiProcessor.call (NvdApiProcessor.java:40)
    at java.util.concurrent.FutureTask.run (FutureTask.java:264)
    at java.util.concurrent.ThreadPoolExecutor.runWorker (ThreadPoolExecutor.java:1136)
    at java.util.concurrent.ThreadPoolExecutor$Worker.run (ThreadPoolExecutor.java:635)
    at java.lang.Thread.run (Thread.java:840)
[ERROR] Failed to process CVE-2000-0482
java.lang.NullPointerException: Cannot invoke "org.apache.commons.dbcp2.BasicDataSource.getConnection()" because "this.connectionPool" is null
    at org.owasp.dependencycheck.data.nvdcve.DatabaseManager.getConnection (DatabaseManager.java:576)
    at org.owasp.dependencycheck.data.nvdcve.CveDB.updateOrInsertVulnerability (CveDB.java:1168)
    at org.owasp.dependencycheck.data.nvdcve.CveDB.updateVulnerability (CveDB.java:1093)
    at org.owasp.dependencycheck.data.update.nvd.api.NvdApiProcessor.updateCveDb (NvdApiProcessor.java:119)
    at org.owasp.dependencycheck.data.update.nvd.api.NvdApiProcessor.call (NvdApiProcessor.java:96)
    at org.owasp.dependencycheck.data.update.nvd.api.NvdApiProcessor.call (NvdApiProcessor.java:40)
    at java.util.concurrent.FutureTask.run (FutureTask.java:264)
    at java.util.concurrent.ThreadPoolExecutor.runWorker (ThreadPoolExecutor.java:1136)
    at java.util.concurrent.ThreadPoolExecutor$Worker.run (ThreadPoolExecutor.java:635)
    at java.lang.Thread.run (Thread.java:840)
[ERROR] Failed to process CVE-2000-0503
java.lang.NullPointerException: Cannot invoke "org.apache.commons.dbcp2.BasicDataSource.getConnection()" because "this.connectionPool" is null
    at org.owasp.dependencycheck.data.nvdcve.DatabaseManager.getConnection (DatabaseManager.java:576)
    at org.owasp.dependencycheck.data.nvdcve.CveDB.updateOrInsertVulnerability (CveDB.java:1168)
    at org.owasp.dependencycheck.data.nvdcve.CveDB.updateVulnerability (CveDB.java:1093)
    at org.owasp.dependencycheck.data.update.nvd.api.NvdApiProcessor.updateCveDb (NvdApiProcessor.java:119)
    at org.owasp.dependencycheck.data.update.nvd.api.NvdApiProcessor.call (NvdApiProcessor.java:96)
    at org.owasp.dependencycheck.data.update.nvd.api.NvdApiProcessor.call (NvdApiProcessor.java:40)
    at java.util.concurrent.FutureTask.run (FutureTask.java:264)
    at java.util.concurrent.ThreadPoolExecutor.runWorker (ThreadPoolExecutor.java:1136)
    at java.util.concurrent.ThreadPoolExecutor$Worker.run (ThreadPoolExecutor.java:635)
    at java.lang.Thread.run (Thread.java:840)
[ERROR] Failed to process CVE-2000-0516
java.lang.NullPointerException: Cannot invoke "org.apache.commons.dbcp2.BasicDataSource.getConnection()" because "this.connectionPool" is null
    at org.owasp.dependencycheck.data.nvdcve.DatabaseManager.getConnection (DatabaseManager.java:576)
    at org.owasp.dependencycheck.data.nvdcve.CveDB.updateOrInsertVulnerability (CveDB.java:1168)
    at org.owasp.dependencycheck.data.nvdcve.CveDB.updateVulnerability (CveDB.java:1093)
    at org.owasp.dependencycheck.data.update.nvd.api.NvdApiProcessor.updateCveDb (NvdApiProcessor.java:119)
    at org.owasp.dependencycheck.data.update.nvd.api.NvdApiProcessor.call (NvdApiProcessor.java:96)
    at org.owasp.dependencycheck.data.update.nvd.api.NvdApiProcessor.call (NvdApiProcessor.java:40)
    at java.util.concurrent.FutureTask.run (FutureTask.java:264)
    at java.util.concurrent.ThreadPoolExecutor.runWorker (ThreadPoolExecutor.java:1136)
    at java.util.concurrent.ThreadPoolExecutor$Worker.run (ThreadPoolExecutor.java:635)
    at java.lang.Thread.run (Thread.java:840)
[ERROR] Failed to process CVE-2000-0523
java.lang.NullPointerException: Cannot invoke "org.apache.commons.dbcp2.BasicDataSource.getConnection()" because "this.connectionPool" is null
    at org.owasp.dependencycheck.data.nvdcve.DatabaseManager.getConnection (DatabaseManager.java:576)
    at org.owasp.dependencycheck.data.nvdcve.CveDB.updateOrInsertVulnerability (CveDB.java:1168)
    at org.owasp.dependencycheck.data.nvdcve.CveDB.updateVulnerability (CveDB.java:1093)
    at org.owasp.dependencycheck.data.update.nvd.api.NvdApiProcessor.updateCveDb (NvdApiProcessor.java:119)
    at org.owasp.dependencycheck.data.update.nvd.api.NvdApiProcessor.call (NvdApiProcessor.java:96)
    at org.owasp.dependencycheck.data.update.nvd.api.NvdApiProcessor.call (NvdApiProcessor.java:40)
    at java.util.concurrent.FutureTask.run (FutureTask.java:264)
    at java.util.concurrent.ThreadPoolExecutor.runWorker (ThreadPoolExecutor.java:1136)
    at java.util.concurrent.ThreadPoolExecutor$Worker.run (ThreadPoolExecutor.java:635)
    at java.lang.Thread.run (Thread.java:840)
[ERROR] Failed to process CVE-2000-0552
java.lang.NullPointerException: Cannot invoke "org.apache.commons.dbcp2.BasicDataSource.getConnection()" because "this.connectionPool" is null
    at org.owasp.dependencycheck.data.nvdcve.DatabaseManager.getConnection (DatabaseManager.java:576)
    at org.owasp.dependencycheck.data.nvdcve.CveDB.updateOrInsertVulnerability (CveDB.java:1168)
    at org.owasp.dependencycheck.data.nvdcve.CveDB.updateVulnerability (CveDB.java:1093)
    at org.owasp.dependencycheck.data.update.nvd.api.NvdApiProcessor.updateCveDb (NvdApiProcessor.java:119)
    at org.owasp.dependencycheck.data.update.nvd.api.NvdApiProcessor.call (NvdApiProcessor.java:96)
    at org.owasp.dependencycheck.data.update.nvd.api.NvdApiProcessor.call (NvdApiProcessor.java:40)
    at java.util.concurrent.FutureTask.run (FutureTask.java:264)
    at java.util.concurrent.ThreadPoolExecutor.runWorker (ThreadPoolExecutor.java:1136)
    at java.util.concurrent.ThreadPoolExecutor$Worker.run (ThreadPoolExecutor.java:635)
    at java.lang.Thread.run (Thread.java:840)
[ERROR] Failed to process CVE-2000-0558
java.lang.NullPointerException: Cannot invoke "org.apache.commons.dbcp2.BasicDataSource.getConnection()" because "this.connectionPool" is null
    at org.owasp.dependencycheck.data.nvdcve.DatabaseManager.getConnection (DatabaseManager.java:576)
    at org.owasp.dependencycheck.data.nvdcve.CveDB.updateOrInsertVulnerability (CveDB.java:1168)
    at org.owasp.dependencycheck.data.nvdcve.CveDB.updateVulnerability (CveDB.java:1093)
    at org.owasp.dependencycheck.data.update.nvd.api.NvdApiProcessor.updateCveDb (NvdApiProcessor.java:119)
    at org.owasp.dependencycheck.data.update.nvd.api.NvdApiProcessor.call (NvdApiProcessor.java:96)
    at org.owasp.dependencycheck.data.update.nvd.api.NvdApiProcessor.call (NvdApiProcessor.java:40)
    at java.util.concurrent.FutureTask.run (FutureTask.java:264)
    at java.util.concurrent.ThreadPoolExecutor.runWorker (ThreadPoolExecutor.java:1136)
    at java.util.concurrent.ThreadPoolExecutor$Worker.run (ThreadPoolExecutor.java:635)
    at java.lang.Thread.run (Thread.java:840)
[WARNING] Attempt to (de-)serialize anonymous class org.jfrog.hudson.maven2.MavenDependenciesRecorder$1; see: https://jenkins.io/redirect/serialization-of-anonymous-classes/
[INFO] ------------------------------------------------------------------------
[INFO] Reactor Summary for pdfbox-reactor 4.0.0-SNAPSHOT:
[INFO] 
[INFO] Apache PDFBox parent ............................... FAILURE [01:20 min]
[INFO] Apache PDFBox io ................................... SKIPPED
[INFO] Apache FontBox ..................................... SKIPPED
[INFO] Apache XmpBox ...................................... SKIPPED
[INFO] Apache PDFBox ...................................... SKIPPED
[INFO] Apache PDFBox Debugger ............................. SKIPPED
[INFO] Apache PDFBox tools ................................ SKIPPED
[INFO] Apache PDFBox application .......................... SKIPPED
[INFO] Apache PDFBox Debugger application ................. SKIPPED
[INFO] Apache PDFBox examples ............................. SKIPPED
[INFO] pdfbox-reactor ..................................... SKIPPED
[INFO] ------------------------------------------------------------------------
[INFO] BUILD FAILURE
[INFO] ------------------------------------------------------------------------
[INFO] Total time:  01:39 min
[INFO] Finished at: 2026-06-22T03:59:37Z
[INFO] ------------------------------------------------------------------------
Waiting for Jenkins to finish collecting data
[ERROR] Failed to execute goal org.owasp:dependency-check-maven:12.2.2:check (default) on project pdfbox-parent: Fatal exception(s) analyzing Apache PDFBox parent: One or more exceptions occurred during analysis:
[ERROR] UpdateException: org.h2.jdbc.JdbcBatchUpdateException: General error: "org.h2.mvstore.MVStoreException: Reading from file sun.nio.ch.FileChannelImpl@7799a526 failed at 16361005 (length -1), read 0, remaining 384 [2.4.240/1]"; SQL statement:
[ERROR] SELECT cveID FROM knownExploited cveID WHERE cveID=? [50000-240]
[ERROR] caused by JdbcBatchUpdateException: General error: "org.h2.mvstore.MVStoreException: Reading from file sun.nio.ch.FileChannelImpl@7799a526 failed at 16361005 (length -1), read 0, remaining 384 [2.4.240/1]"; SQL statement:
[ERROR] SELECT cveID FROM knownExploited cveID WHERE cveID=? [50000-240]
[ERROR] NoDataException: No documents exist
[ERROR] -> [Help 1]
[ERROR] 
[ERROR] To see the full stack trace of the errors, re-run Maven with the -e switch.
[ERROR] Re-run Maven using the -X switch to enable full debug logging.
[ERROR] 
[ERROR] For more information about the errors and possible solutions, please read the following articles:
[ERROR] [Help 1] http://cwiki.apache.org/confluence/display/MAVEN/MojoExecutionException
[JENKINS] Archiving <https://ci-builds.apache.org/job/PDFBox/job/PDFBox-trunk/ws/xmpbox/pom.xml> to org.apache.pdfbox/xmpbox/4.0.0-SNAPSHOT/xmpbox-4.0.0-SNAPSHOT.pom
[JENKINS] Archiving <https://ci-builds.apache.org/job/PDFBox/job/PDFBox-trunk/ws/tools/pom.xml> to org.apache.pdfbox/pdfbox-tools/4.0.0-SNAPSHOT/pdfbox-tools-4.0.0-SNAPSHOT.pom
[JENKINS] Archiving <https://ci-builds.apache.org/job/PDFBox/job/PDFBox-trunk/ws/debugger/pom.xml> to org.apache.pdfbox/pdfbox-debugger/4.0.0-SNAPSHOT/pdfbox-debugger-4.0.0-SNAPSHOT.pom
[JENKINS] Archiving <https://ci-builds.apache.org/job/PDFBox/job/PDFBox-trunk/ws/app/pom.xml> to org.apache.pdfbox/pdfbox-app/4.0.0-SNAPSHOT/pdfbox-app-4.0.0-SNAPSHOT.pom
[JENKINS] Archiving <https://ci-builds.apache.org/job/PDFBox/job/PDFBox-trunk/ws/examples/pom.xml> to org.apache.pdfbox/pdfbox-examples/4.0.0-SNAPSHOT/pdfbox-examples-4.0.0-SNAPSHOT.pom
[JENKINS] Archiving <https://ci-builds.apache.org/job/PDFBox/job/PDFBox-trunk/ws/pom.xml> to org.apache.pdfbox/pdfbox-reactor/4.0.0-SNAPSHOT/pdfbox-reactor-4.0.0-SNAPSHOT.pom
[JENKINS] Archiving <https://ci-builds.apache.org/job/PDFBox/job/PDFBox-trunk/ws/parent/pom.xml> to org.apache.pdfbox/pdfbox-parent/4.0.0-SNAPSHOT/pdfbox-parent-4.0.0-SNAPSHOT.pom
[JENKINS] Archiving <https://ci-builds.apache.org/job/PDFBox/job/PDFBox-trunk/ws/pdfbox/pom.xml> to org.apache.pdfbox/pdfbox/4.0.0-SNAPSHOT/pdfbox-4.0.0-SNAPSHOT.pom
[JENKINS] Archiving <https://ci-builds.apache.org/job/PDFBox/job/PDFBox-trunk/ws/debugger-app/pom.xml> to org.apache.pdfbox/debugger-app/4.0.0-SNAPSHOT/debugger-app-4.0.0-SNAPSHOT.pom
[JENKINS] Archiving <https://ci-builds.apache.org/job/PDFBox/job/PDFBox-trunk/ws/io/pom.xml> to org.apache.pdfbox/pdfbox-io/4.0.0-SNAPSHOT/pdfbox-io-4.0.0-SNAPSHOT.pom
[JENKINS] Archiving <https://ci-builds.apache.org/job/PDFBox/job/PDFBox-trunk/ws/fontbox/pom.xml> to org.apache.pdfbox/fontbox/4.0.0-SNAPSHOT/fontbox-4.0.0-SNAPSHOT.pom
No mail will be sent out, as 'PDFBox » PDFBox-trunk » Apache XmpBox #3277' does not have a result yet. Please make sure you set a proper result in case of pipeline/build scripts.
No mail will be sent out, as 'PDFBox » PDFBox-trunk » Apache PDFBox tools #3277' does not have a result yet. Please make sure you set a proper result in case of pipeline/build scripts.
No mail will be sent out, as 'PDFBox » PDFBox-trunk » Apache PDFBox Debugger #3277' does not have a result yet. Please make sure you set a proper result in case of pipeline/build scripts.
No mail will be sent out, as 'PDFBox » PDFBox-trunk » Apache PDFBox application #3277' does not have a result yet. Please make sure you set a proper result in case of pipeline/build scripts.
No mail will be sent out, as 'PDFBox » PDFBox-trunk » Apache PDFBox examples #3277' does not have a result yet. Please make sure you set a proper result in case of pipeline/build scripts.
No mail will be sent out, as 'PDFBox » PDFBox-trunk » pdfbox-reactor #3277' does not have a result yet. Please make sure you set a proper result in case of pipeline/build scripts.
Sending e-mails to: dev@pdfbox.apache.org
No mail will be sent out, as 'PDFBox » PDFBox-trunk » Apache PDFBox #3277' does not have a result yet. Please make sure you set a proper result in case of pipeline/build scripts.
No mail will be sent out, as 'PDFBox » PDFBox-trunk » Apache PDFBox Debugger application #3277' does not have a result yet. Please make sure you set a proper result in case of pipeline/build scripts.
No mail will be sent out, as 'PDFBox » PDFBox-trunk » Apache PDFBox io #3277' does not have a result yet. Please make sure you set a proper result in case of pipeline/build scripts.
No mail will be sent out, as 'PDFBox » PDFBox-trunk » Apache FontBox #3277' does not have a result yet. Please make sure you set a proper result in case of pipeline/build scripts.
channel stopped
Archiving artifacts

---------------------------------------------------------------------
To unsubscribe, e-mail: dev-unsubscribe@pdfbox.apache.org
For additional commands, e-mail: dev-help@pdfbox.apache.org


Build failed in Jenkins: PDFBox » PDFBox-trunk #3276

Posted by Apache Jenkins Server <je...@builds.apache.org>.
See <https://ci-builds.apache.org/job/PDFBox/job/PDFBox-trunk/3276/display/redirect?page=changes>

Changes:

[Tilman Hausherr] PDFBOX-5660: update byte-buddy


------------------------------------------
[...truncated 2.37 KiB...]
[INFO] 
[HUDSON] Collecting dependencies info
[HUDSON] Collecting dependencies info
[HUDSON] Collecting dependencies info
[INFO] Apache PDFBox parent                                               [pom]
[INFO] Apache PDFBox io                                                [bundle]
[INFO] Apache FontBox                                                  [bundle]
[INFO] Apache XmpBox                                                   [bundle]
[INFO] Apache PDFBox                                                   [bundle]
[INFO] Apache PDFBox Debugger                                             [jar]
[INFO] Apache PDFBox tools                                                [jar]
[INFO] Apache PDFBox application                                          [jar]
[INFO] Apache PDFBox Debugger application                                 [jar]
[INFO] Apache PDFBox examples                                             [jar]
[INFO] pdfbox-reactor                                                     [pom]
[INFO] 
[INFO] ------------------< org.apache.pdfbox:pdfbox-parent >-------------------
[INFO] Building Apache PDFBox parent 4.0.0-SNAPSHOT                      [1/11]
[INFO]   from parent/pom.xml
[INFO] --------------------------------[ pom ]---------------------------------
[INFO] 
[INFO] --- clean:3.5.0:clean (default-clean) @ pdfbox-parent ---
[INFO] 
[INFO] --- enforcer:3.6.3:enforce (default) @ pdfbox-parent ---
[INFO] Rule 0: org.apache.maven.enforcer.rules.version.RequireMavenVersion passed
[INFO] 
[INFO] --- enforcer:3.6.3:enforce (enforce-maven-version) @ pdfbox-parent ---
[INFO] Rule 0: org.apache.maven.enforcer.rules.version.RequireMavenVersion passed
[INFO] 
[INFO] --- enforcer:3.6.3:enforce (enforce-java-version) @ pdfbox-parent ---
[INFO] Rule 0: org.apache.maven.enforcer.rules.version.RequireJavaVersion passed
[INFO] 
[INFO] --- checkstyle:3.6.0:check (check) @ pdfbox-parent ---
[INFO] Starting audit...
Audit done.
[INFO] You have 0 Checkstyle violations.
[INFO] 
[INFO] --- jacoco:0.8.15:prepare-agent (default) @ pdfbox-parent ---
[INFO] surefireArgLine set to -javaagent:/home/jenkins/.m2/repository/org/jacoco/org.jacoco.agent/0.8.15/org.jacoco.agent-0.8.15-runtime.jar=destfile=<https://ci-builds.apache.org/job/PDFBox/job/PDFBox-trunk/ws/parent/target/jacoco.exec>
[INFO] 
[INFO] --- remote-resources:3.3.0:process (process-resource-bundles) @ pdfbox-parent ---
[INFO] Preparing remote bundle org.apache.apache.resources:apache-jar-resource-bundle:1.8
[INFO] Copying 3 resources from 1 bundle.
[INFO] 
[INFO] --- jacoco:0.8.15:report (report) @ pdfbox-parent ---
[INFO] Skipping JaCoCo execution due to missing execution data file.
[INFO] 
[INFO] --- source:3.4.0:jar-no-fork (attach-sources) @ pdfbox-parent ---
[INFO] Skipping source per configuration.
[INFO] 
[INFO] --- apache-rat:0.17:check (default) @ pdfbox-parent ---
[WARNING] Basedir is : <https://ci-builds.apache.org/job/PDFBox/job/PDFBox-trunk/ws/parent>
[INFO] Excluding patterns: release.properties, .github/workflows/codeql-analysis.yml
[INFO] Excluding MAVEN collection.
[INFO] Excluding ECLIPSE collection.
[INFO] Excluding IDEA collection.
[INFO] Processing exclude file from STANDARD_SCMS.
[INFO] Excluding STANDARD_SCMS collection.
[INFO] Excluding MISC collection.
[INFO] Excluding HIDDEN_DIR collection.
[INFO] RAT summary:
[INFO]   Approved:  2
[INFO]   Archives:  0
[INFO]   Binaries:  0
[INFO]   Document types:  2
[INFO]   Ignored:  1
[INFO]   License categories:  1
[INFO]   License names:  1
[INFO]   Notices:  0
[INFO]   Standards:  2
[INFO]   Unapproved:  0
[INFO]   Unknown:  0
[INFO] 
[INFO] --- dependency-check:12.2.2:check (default) @ pdfbox-parent ---
[WARNING] The parameter 'ossindexAnalyzerEnabled' is deprecated and should not be used anymore. Please use 'ossIndexAnalyzerEnabled' instead.
[INFO] Checking for updates
[WARNING] An NVD API Key was not provided - it is highly recommended to use an NVD API key as the update can take a VERY long time without an API Key
[WARNING] NVD API request failures are occurring; retrying request for the 15th time
[WARNING] NVD API request failures are occurring; retrying request for the 16th time
[WARNING] NVD API request failures are occurring; retrying request for the 17th time
[WARNING] NVD API request failures are occurring; retrying request for the 18th time
[WARNING] NVD API request failures are occurring; retrying request for the 19th time
[WARNING] NVD API request failures are occurring; retrying request for the 20th time
[WARNING] NVD API request failures are occurring; retrying request for the 21st time
[WARNING] NVD API request failures are occurring; retrying request for the 22nd time
[WARNING] NVD API request failures are occurring; retrying request for the 23rd time
[WARNING] NVD API request failures are occurring; retrying request for the 24th time
[WARNING] NVD API request failures are occurring; retrying request for the 25th time
[WARNING] NVD API request failures are occurring; retrying request for the 26th time
[WARNING] NVD API request failures are occurring; retrying request for the 27th time
[WARNING] NVD API request failures are occurring; retrying request for the 28th time
[WARNING] NVD API request failures are occurring; retrying request for the 29th time
[WARNING] NVD API request failures are occurring; retrying request for the 30th time
[WARNING] NVD API request failures are occurring; retrying request for the 31st time
[ERROR] Error updating the NVD Data
org.owasp.dependencycheck.data.update.exception.UpdateException: Error updating the NVD Data
    at org.owasp.dependencycheck.data.update.NvdApiDataSource.processApi (NvdApiDataSource.java:387)
    at org.owasp.dependencycheck.data.update.NvdApiDataSource.update (NvdApiDataSource.java:128)
    at org.owasp.dependencycheck.Engine.doUpdates (Engine.java:887)
    at org.owasp.dependencycheck.Engine.initializeAndUpdateDatabase (Engine.java:692)
    at org.owasp.dependencycheck.Engine.analyzeDependencies (Engine.java:619)
    at org.owasp.dependencycheck.maven.BaseDependencyCheckMojo.runCheck (BaseDependencyCheckMojo.java:2093)
    at org.owasp.dependencycheck.maven.BaseDependencyCheckMojo.execute (BaseDependencyCheckMojo.java:1291)
    at org.apache.maven.plugin.DefaultBuildPluginManager.executeMojo (DefaultBuildPluginManager.java:126)
    at org.apache.maven.lifecycle.internal.MojoExecutor.doExecute2 (MojoExecutor.java:328)
    at org.apache.maven.lifecycle.internal.MojoExecutor.doExecute (MojoExecutor.java:316)
    at org.apache.maven.lifecycle.internal.MojoExecutor.execute (MojoExecutor.java:212)
    at org.apache.maven.lifecycle.internal.MojoExecutor.execute (MojoExecutor.java:174)
    at org.apache.maven.lifecycle.internal.MojoExecutor.access$000 (MojoExecutor.java:75)
    at org.apache.maven.lifecycle.internal.MojoExecutor$1.run (MojoExecutor.java:162)
    at org.apache.maven.plugin.DefaultMojosExecutionStrategy.execute (DefaultMojosExecutionStrategy.java:39)
    at org.apache.maven.lifecycle.internal.MojoExecutor.execute (MojoExecutor.java:159)
    at org.apache.maven.lifecycle.internal.LifecycleModuleBuilder.buildProject (LifecycleModuleBuilder.java:105)
    at org.apache.maven.lifecycle.internal.LifecycleModuleBuilder.buildProject (LifecycleModuleBuilder.java:73)
    at org.apache.maven.lifecycle.internal.builder.singlethreaded.SingleThreadedBuilder.build (SingleThreadedBuilder.java:53)
    at org.apache.maven.lifecycle.internal.LifecycleStarter.execute (LifecycleStarter.java:118)
    at org.apache.maven.DefaultMaven.doExecute (DefaultMaven.java:261)
    at org.apache.maven.DefaultMaven.doExecute (DefaultMaven.java:173)
    at org.apache.maven.DefaultMaven.execute (DefaultMaven.java:101)
    at org.jvnet.hudson.maven3.launcher.Maven35Launcher.main (Maven35Launcher.java:138)
    at jdk.internal.reflect.NativeMethodAccessorImpl.invoke0 (Native Method)
    at jdk.internal.reflect.NativeMethodAccessorImpl.invoke (NativeMethodAccessorImpl.java:77)
    at jdk.internal.reflect.DelegatingMethodAccessorImpl.invoke (DelegatingMethodAccessorImpl.java:43)
    at java.lang.reflect.Method.invoke (Method.java:569)
    at org.codehaus.plexus.classworlds.launcher.Launcher.launchEnhanced (Launcher.java:255)
    at org.codehaus.plexus.classworlds.launcher.Launcher.launch (Launcher.java:201)
    at jenkins.maven3.agent.Maven35Main.launch (Maven35Main.java:179)
    at jdk.internal.reflect.NativeMethodAccessorImpl.invoke0 (Native Method)
    at jdk.internal.reflect.NativeMethodAccessorImpl.invoke (NativeMethodAccessorImpl.java:77)
    at jdk.internal.reflect.DelegatingMethodAccessorImpl.invoke (DelegatingMethodAccessorImpl.java:43)
    at java.lang.reflect.Method.invoke (Method.java:569)
    at hudson.maven.Maven3Builder.call (Maven3Builder.java:140)
    at hudson.maven.Maven3Builder.call (Maven3Builder.java:71)
    at hudson.remoting.UserRequest.perform (UserRequest.java:225)
    at hudson.remoting.UserRequest.perform (UserRequest.java:50)
    at hudson.remoting.Request$2.run (Request.java:391)
    at hudson.remoting.InterceptingExecutorService.lambda$wrap$0 (InterceptingExecutorService.java:81)
    at java.util.concurrent.FutureTask.run (FutureTask.java:264)
    at java.util.concurrent.ThreadPoolExecutor.runWorker (ThreadPoolExecutor.java:1136)
    at java.util.concurrent.ThreadPoolExecutor$Worker.run (ThreadPoolExecutor.java:635)
    at java.lang.Thread.run (Thread.java:840)
Caused by: io.github.jeremylong.openvulnerability.client.nvd.NvdApiException: NVD Returned Status Code: 429
    at io.github.jeremylong.openvulnerability.client.nvd.NvdCveClient._next (NvdCveClient.java:445)
    at io.github.jeremylong.openvulnerability.client.nvd.NvdCveClient.next (NvdCveClient.java:356)
    at org.owasp.dependencycheck.data.update.NvdApiDataSource.processApi (NvdApiDataSource.java:343)
    at org.owasp.dependencycheck.data.update.NvdApiDataSource.update (NvdApiDataSource.java:128)
    at org.owasp.dependencycheck.Engine.doUpdates (Engine.java:887)
    at org.owasp.dependencycheck.Engine.initializeAndUpdateDatabase (Engine.java:692)
    at org.owasp.dependencycheck.Engine.analyzeDependencies (Engine.java:619)
    at org.owasp.dependencycheck.maven.BaseDependencyCheckMojo.runCheck (BaseDependencyCheckMojo.java:2093)
    at org.owasp.dependencycheck.maven.BaseDependencyCheckMojo.execute (BaseDependencyCheckMojo.java:1291)
    at org.apache.maven.plugin.DefaultBuildPluginManager.executeMojo (DefaultBuildPluginManager.java:126)
    at org.apache.maven.lifecycle.internal.MojoExecutor.doExecute2 (MojoExecutor.java:328)
    at org.apache.maven.lifecycle.internal.MojoExecutor.doExecute (MojoExecutor.java:316)
    at org.apache.maven.lifecycle.internal.MojoExecutor.execute (MojoExecutor.java:212)
    at org.apache.maven.lifecycle.internal.MojoExecutor.execute (MojoExecutor.java:174)
    at org.apache.maven.lifecycle.internal.MojoExecutor.access$000 (MojoExecutor.java:75)
    at org.apache.maven.lifecycle.internal.MojoExecutor$1.run (MojoExecutor.java:162)
    at org.apache.maven.plugin.DefaultMojosExecutionStrategy.execute (DefaultMojosExecutionStrategy.java:39)
    at org.apache.maven.lifecycle.internal.MojoExecutor.execute (MojoExecutor.java:159)
    at org.apache.maven.lifecycle.internal.LifecycleModuleBuilder.buildProject (LifecycleModuleBuilder.java:105)
    at org.apache.maven.lifecycle.internal.LifecycleModuleBuilder.buildProject (LifecycleModuleBuilder.java:73)
    at org.apache.maven.lifecycle.internal.builder.singlethreaded.SingleThreadedBuilder.build (SingleThreadedBuilder.java:53)
    at org.apache.maven.lifecycle.internal.LifecycleStarter.execute (LifecycleStarter.java:118)
    at org.apache.maven.DefaultMaven.doExecute (DefaultMaven.java:261)
    at org.apache.maven.DefaultMaven.doExecute (DefaultMaven.java:173)
    at org.apache.maven.DefaultMaven.execute (DefaultMaven.java:101)
    at org.jvnet.hudson.maven3.launcher.Maven35Launcher.main (Maven35Launcher.java:138)
    at jdk.internal.reflect.NativeMethodAccessorImpl.invoke0 (Native Method)
    at jdk.internal.reflect.NativeMethodAccessorImpl.invoke (NativeMethodAccessorImpl.java:77)
    at jdk.internal.reflect.DelegatingMethodAccessorImpl.invoke (DelegatingMethodAccessorImpl.java:43)
    at java.lang.reflect.Method.invoke (Method.java:569)
    at org.codehaus.plexus.classworlds.launcher.Launcher.launchEnhanced (Launcher.java:255)
    at org.codehaus.plexus.classworlds.launcher.Launcher.launch (Launcher.java:201)
    at jenkins.maven3.agent.Maven35Main.launch (Maven35Main.java:179)
    at jdk.internal.reflect.NativeMethodAccessorImpl.invoke0 (Native Method)
    at jdk.internal.reflect.NativeMethodAccessorImpl.invoke (NativeMethodAccessorImpl.java:77)
    at jdk.internal.reflect.DelegatingMethodAccessorImpl.invoke (DelegatingMethodAccessorImpl.java:43)
    at java.lang.reflect.Method.invoke (Method.java:569)
    at hudson.maven.Maven3Builder.call (Maven3Builder.java:140)
    at hudson.maven.Maven3Builder.call (Maven3Builder.java:71)
    at hudson.remoting.UserRequest.perform (UserRequest.java:225)
    at hudson.remoting.UserRequest.perform (UserRequest.java:50)
    at hudson.remoting.Request$2.run (Request.java:391)
    at hudson.remoting.InterceptingExecutorService.lambda$wrap$0 (InterceptingExecutorService.java:81)
    at java.util.concurrent.FutureTask.run (FutureTask.java:264)
    at java.util.concurrent.ThreadPoolExecutor.runWorker (ThreadPoolExecutor.java:1136)
    at java.util.concurrent.ThreadPoolExecutor$Worker.run (ThreadPoolExecutor.java:635)
    at java.lang.Thread.run (Thread.java:840)
[INFO] Skipping Known Exploited Vulnerabilities update check since last check was within 24 hours.
[WARNING] Unable to update 1 or more Cached Web DataSource, using local data instead. Results may not include recent vulnerabilities.
[ERROR] Unable to continue dependency-check analysis.
[WARNING] Attempt to (de-)serialize anonymous class org.jfrog.hudson.maven2.MavenDependenciesRecorder$1; see: https://jenkins.io/redirect/serialization-of-anonymous-classes/
[INFO] ------------------------------------------------------------------------
[INFO] Reactor Summary for pdfbox-reactor 4.0.0-SNAPSHOT:
[INFO] 
[INFO] Apache PDFBox parent ............................... FAILURE [ 32.738 s]
[INFO] Apache PDFBox io ................................... SKIPPED
[INFO] Apache FontBox ..................................... SKIPPED
[INFO] Apache XmpBox ...................................... SKIPPED
[INFO] Apache PDFBox ...................................... SKIPPED
[INFO] Apache PDFBox Debugger ............................. SKIPPED
[INFO] Apache PDFBox tools ................................ SKIPPED
[INFO] Apache PDFBox application .......................... SKIPPED
[INFO] Apache PDFBox Debugger application ................. SKIPPED
[INFO] Apache PDFBox examples ............................. SKIPPED
[INFO] pdfbox-reactor ..................................... SKIPPED
[INFO] ------------------------------------------------------------------------
[INFO] BUILD FAILURE
[INFO] ------------------------------------------------------------------------
[INFO] Total time:  59.892 s
[INFO] Finished at: 2026-06-19T18:04:29Z
[INFO] ------------------------------------------------------------------------
Waiting for Jenkins to finish collecting data
[ERROR] Failed to execute goal org.owasp:dependency-check-maven:12.2.2:check (default) on project pdfbox-parent: Fatal exception(s) analyzing Apache PDFBox parent: One or more exceptions occurred during analysis:
[ERROR] UpdateException: Error updating the NVD Data
[ERROR] caused by NvdApiException: NVD Returned Status Code: 429
[ERROR] NoDataException: No documents exist
[ERROR] -> [Help 1]
[ERROR] 
[ERROR] To see the full stack trace of the errors, re-run Maven with the -e switch.
[ERROR] Re-run Maven using the -X switch to enable full debug logging.
[ERROR] 
[ERROR] For more information about the errors and possible solutions, please read the following articles:
[ERROR] [Help 1] http://cwiki.apache.org/confluence/display/MAVEN/MojoExecutionException
[JENKINS] Archiving <https://ci-builds.apache.org/job/PDFBox/job/PDFBox-trunk/ws/xmpbox/pom.xml> to org.apache.pdfbox/xmpbox/4.0.0-SNAPSHOT/xmpbox-4.0.0-SNAPSHOT.pom
[JENKINS] Archiving <https://ci-builds.apache.org/job/PDFBox/job/PDFBox-trunk/ws/tools/pom.xml> to org.apache.pdfbox/pdfbox-tools/4.0.0-SNAPSHOT/pdfbox-tools-4.0.0-SNAPSHOT.pom
[JENKINS] Archiving <https://ci-builds.apache.org/job/PDFBox/job/PDFBox-trunk/ws/debugger/pom.xml> to org.apache.pdfbox/pdfbox-debugger/4.0.0-SNAPSHOT/pdfbox-debugger-4.0.0-SNAPSHOT.pom
[JENKINS] Archiving <https://ci-builds.apache.org/job/PDFBox/job/PDFBox-trunk/ws/app/pom.xml> to org.apache.pdfbox/pdfbox-app/4.0.0-SNAPSHOT/pdfbox-app-4.0.0-SNAPSHOT.pom
[JENKINS] Archiving <https://ci-builds.apache.org/job/PDFBox/job/PDFBox-trunk/ws/examples/pom.xml> to org.apache.pdfbox/pdfbox-examples/4.0.0-SNAPSHOT/pdfbox-examples-4.0.0-SNAPSHOT.pom
[JENKINS] Archiving <https://ci-builds.apache.org/job/PDFBox/job/PDFBox-trunk/ws/pom.xml> to org.apache.pdfbox/pdfbox-reactor/4.0.0-SNAPSHOT/pdfbox-reactor-4.0.0-SNAPSHOT.pom
[JENKINS] Archiving <https://ci-builds.apache.org/job/PDFBox/job/PDFBox-trunk/ws/parent/pom.xml> to org.apache.pdfbox/pdfbox-parent/4.0.0-SNAPSHOT/pdfbox-parent-4.0.0-SNAPSHOT.pom
[JENKINS] Archiving <https://ci-builds.apache.org/job/PDFBox/job/PDFBox-trunk/ws/pdfbox/pom.xml> to org.apache.pdfbox/pdfbox/4.0.0-SNAPSHOT/pdfbox-4.0.0-SNAPSHOT.pom
[JENKINS] Archiving <https://ci-builds.apache.org/job/PDFBox/job/PDFBox-trunk/ws/debugger-app/pom.xml> to org.apache.pdfbox/debugger-app/4.0.0-SNAPSHOT/debugger-app-4.0.0-SNAPSHOT.pom
[JENKINS] Archiving <https://ci-builds.apache.org/job/PDFBox/job/PDFBox-trunk/ws/io/pom.xml> to org.apache.pdfbox/pdfbox-io/4.0.0-SNAPSHOT/pdfbox-io-4.0.0-SNAPSHOT.pom
[JENKINS] Archiving <https://ci-builds.apache.org/job/PDFBox/job/PDFBox-trunk/ws/fontbox/pom.xml> to org.apache.pdfbox/fontbox/4.0.0-SNAPSHOT/fontbox-4.0.0-SNAPSHOT.pom
No mail will be sent out, as 'PDFBox » PDFBox-trunk » Apache XmpBox #3276' does not have a result yet. Please make sure you set a proper result in case of pipeline/build scripts.
No mail will be sent out, as 'PDFBox » PDFBox-trunk » Apache PDFBox tools #3276' does not have a result yet. Please make sure you set a proper result in case of pipeline/build scripts.
No mail will be sent out, as 'PDFBox » PDFBox-trunk » Apache PDFBox Debugger #3276' does not have a result yet. Please make sure you set a proper result in case of pipeline/build scripts.
No mail will be sent out, as 'PDFBox » PDFBox-trunk » Apache PDFBox application #3276' does not have a result yet. Please make sure you set a proper result in case of pipeline/build scripts.
No mail will be sent out, as 'PDFBox » PDFBox-trunk » Apache PDFBox examples #3276' does not have a result yet. Please make sure you set a proper result in case of pipeline/build scripts.
No mail will be sent out, as 'PDFBox » PDFBox-trunk » pdfbox-reactor #3276' does not have a result yet. Please make sure you set a proper result in case of pipeline/build scripts.
Sending e-mails to: dev@pdfbox.apache.org
No mail will be sent out, as 'PDFBox » PDFBox-trunk » Apache PDFBox #3276' does not have a result yet. Please make sure you set a proper result in case of pipeline/build scripts.
No mail will be sent out, as 'PDFBox » PDFBox-trunk » Apache PDFBox Debugger application #3276' does not have a result yet. Please make sure you set a proper result in case of pipeline/build scripts.
No mail will be sent out, as 'PDFBox » PDFBox-trunk » Apache PDFBox io #3276' does not have a result yet. Please make sure you set a proper result in case of pipeline/build scripts.
No mail will be sent out, as 'PDFBox » PDFBox-trunk » Apache FontBox #3276' does not have a result yet. Please make sure you set a proper result in case of pipeline/build scripts.
channel stopped
Archiving artifacts

---------------------------------------------------------------------
To unsubscribe, e-mail: dev-unsubscribe@pdfbox.apache.org
For additional commands, e-mail: dev-help@pdfbox.apache.org