You are viewing a plain text version of this content. The canonical link for it is here.
Posted to yarn-dev@hadoop.apache.org by Apache Jenkins Server <je...@builds.apache.org> on 2014/06/28 02:05:12 UTC
Failed: YARN-2052 PreCommit Build #4127
Jira: https://issues.apache.org/jira/browse/YARN-2052
Build: https://builds.apache.org/job/PreCommit-YARN-Build/4127/
###################################################################################
########################## LAST 60 LINES OF THE CONSOLE ###########################
[...truncated 3122 lines...]
{color:green}+1 contrib tests{color}. The patch passed contrib unit tests.
Test results: https://builds.apache.org/job/PreCommit-YARN-Build/4127//testReport/
Console output: https://builds.apache.org/job/PreCommit-YARN-Build/4127//console
This message is automatically generated.
======================================================================
======================================================================
Adding comment to Jira.
======================================================================
======================================================================
Comment added.
3428c27044e48cd277656b8c398a7cdd96feecc9 logged out
======================================================================
======================================================================
Finished build.
======================================================================
======================================================================
Build step 'Execute shell' marked build as failure
Archiving artifacts
Sending artifact delta relative to PreCommit-YARN-Build #4125
Archived 22 artifacts
Archive block size is 32768
Received 219 blocks and 1491467 bytes
Compression is 82.8%
Took 2.5 sec
[description-setter] Could not determine description.
Recording test results
ERROR: Failed to archive test reports
java.io.IOException: remote file operation failed: /home/jenkins/jenkins-slave/workspace/PreCommit-YARN-Build at hudson.remoting.Channel@17c77c3d:hadoop4
at hudson.FilePath.act(FilePath.java:910)
at hudson.FilePath.act(FilePath.java:887)
at hudson.tasks.junit.JUnitParser.parse(JUnitParser.java:87)
at hudson.tasks.junit.JUnitResultArchiver.parse(JUnitResultArchiver.java:121)
at hudson.tasks.junit.JUnitResultArchiver.perform(JUnitResultArchiver.java:133)
at hudson.tasks.BuildStepMonitor$1.perform(BuildStepMonitor.java:20)
at hudson.model.AbstractBuild$AbstractBuildExecution.perform(AbstractBuild.java:804)
at hudson.model.AbstractBuild$AbstractBuildExecution.performAllBuildSteps(AbstractBuild.java:776)
at hudson.model.Build$BuildExecution.post2(Build.java:183)
at hudson.model.AbstractBuild$AbstractBuildExecution.post(AbstractBuild.java:725)
at hudson.model.Run.execute(Run.java:1701)
at hudson.model.FreeStyleBuild.run(FreeStyleBuild.java:43)
at hudson.model.ResourceController.execute(ResourceController.java:88)
at hudson.model.Executor.run(Executor.java:231)
Caused by: java.io.IOException: Remote call on hadoop4 failed
at hudson.remoting.Channel.call(Channel.java:731)
at hudson.FilePath.act(FilePath.java:903)
... 13 more
Caused by: java.lang.OutOfMemoryError: Java heap space
Email was triggered for: Failure
Sending email for trigger: Failure
###################################################################################
############################## FAILED TESTS (if any) ##############################
No tests ran.
Success: YARN-1366 PreCommit Build #4132
Posted by Apache Jenkins Server <je...@builds.apache.org>.
Jira: https://issues.apache.org/jira/browse/YARN-1366
Build: https://builds.apache.org/job/PreCommit-YARN-Build/4132/
###################################################################################
########################## LAST 60 LINES OF THE CONSOLE ###########################
[...truncated 2888 lines...]
{color:green}+1 overall{color}. Here are the results of testing the latest attachment
http://issues.apache.org/jira/secure/attachment/12653045/YARN-1366.7.patch
against trunk revision .
{color:green}+1 @author{color}. The patch does not contain any @author tags.
{color:green}+1 tests included{color}. The patch appears to include 3 new or modified test files.
{color:green}+1 javac{color}. The applied patch does not increase the total number of javac compiler warnings.
{color:green}+1 javadoc{color}. There were no new javadoc warning messages.
{color:green}+1 eclipse:eclipse{color}. The patch built with eclipse:eclipse.
{color:green}+1 findbugs{color}. The patch does not introduce any new Findbugs (version 1.3.9) warnings.
{color:green}+1 release audit{color}. The applied patch does not increase the total number of release audit warnings.
{color:green}+1 core tests{color}. The patch passed unit tests in hadoop-yarn-project/hadoop-yarn/hadoop-yarn-client.
{color:green}+1 contrib tests{color}. The patch passed contrib unit tests.
Test results: https://builds.apache.org/job/PreCommit-YARN-Build/4132//testReport/
Console output: https://builds.apache.org/job/PreCommit-YARN-Build/4132//console
This message is automatically generated.
======================================================================
======================================================================
Adding comment to Jira.
======================================================================
======================================================================
Comment added.
9a3aa64513730bf1184cf64c285ec41029deabeb logged out
======================================================================
======================================================================
Finished build.
======================================================================
======================================================================
Archiving artifacts
Sending artifact delta relative to PreCommit-YARN-Build #4125
Archived 17 artifacts
Archive block size is 32768
Received 216 blocks and 1037796 bytes
Compression is 87.2%
Took 0.74 sec
Description set: YARN-1366
Recording test results
Email was triggered for: Success
Sending email for trigger: Success
###################################################################################
############################## FAILED TESTS (if any) ##############################
All tests passed
Failed: YARN-2052 PreCommit Build #4131
Posted by Apache Jenkins Server <je...@builds.apache.org>.
Jira: https://issues.apache.org/jira/browse/YARN-2052
Build: https://builds.apache.org/job/PreCommit-YARN-Build/4131/
###################################################################################
########################## LAST 60 LINES OF THE CONSOLE ###########################
[...truncated 3123 lines...]
{color:green}+1 contrib tests{color}. The patch passed contrib unit tests.
Test results: https://builds.apache.org/job/PreCommit-YARN-Build/4131//testReport/
Console output: https://builds.apache.org/job/PreCommit-YARN-Build/4131//console
This message is automatically generated.
======================================================================
======================================================================
Adding comment to Jira.
======================================================================
======================================================================
Comment added.
ced8864236430517743508d01dd06a77a5435da5 logged out
======================================================================
======================================================================
Finished build.
======================================================================
======================================================================
Build step 'Execute shell' marked build as failure
Archiving artifacts
Sending artifact delta relative to PreCommit-YARN-Build #4125
Archived 22 artifacts
Archive block size is 32768
Received 212 blocks and 1751753 bytes
Compression is 79.9%
Took 0.88 sec
[description-setter] Could not determine description.
Recording test results
ERROR: Failed to archive test reports
java.io.IOException: remote file operation failed: /home/jenkins/jenkins-slave/workspace/PreCommit-YARN-Build at hudson.remoting.Channel@17c77c3d:hadoop4
at hudson.FilePath.act(FilePath.java:910)
at hudson.FilePath.act(FilePath.java:887)
at hudson.tasks.junit.JUnitParser.parse(JUnitParser.java:87)
at hudson.tasks.junit.JUnitResultArchiver.parse(JUnitResultArchiver.java:121)
at hudson.tasks.junit.JUnitResultArchiver.perform(JUnitResultArchiver.java:133)
at hudson.tasks.BuildStepMonitor$1.perform(BuildStepMonitor.java:20)
at hudson.model.AbstractBuild$AbstractBuildExecution.perform(AbstractBuild.java:804)
at hudson.model.AbstractBuild$AbstractBuildExecution.performAllBuildSteps(AbstractBuild.java:776)
at hudson.model.Build$BuildExecution.post2(Build.java:183)
at hudson.model.AbstractBuild$AbstractBuildExecution.post(AbstractBuild.java:725)
at hudson.model.Run.execute(Run.java:1701)
at hudson.model.FreeStyleBuild.run(FreeStyleBuild.java:43)
at hudson.model.ResourceController.execute(ResourceController.java:88)
at hudson.model.Executor.run(Executor.java:231)
Caused by: java.io.IOException: Remote call on hadoop4 failed
at hudson.remoting.Channel.call(Channel.java:731)
at hudson.FilePath.act(FilePath.java:903)
... 13 more
Caused by: java.lang.OutOfMemoryError: Java heap space
Email was triggered for: Failure
Sending email for trigger: Failure
###################################################################################
############################## FAILED TESTS (if any) ##############################
No tests ran.
Failed: YARN-1366 PreCommit Build #4130
Posted by Apache Jenkins Server <je...@builds.apache.org>.
Jira: https://issues.apache.org/jira/browse/YARN-1366
Build: https://builds.apache.org/job/PreCommit-YARN-Build/4130/
###################################################################################
########################## LAST 60 LINES OF THE CONSOLE ###########################
[...truncated 2899 lines...]
{color:red}-1 overall{color}. Here are the results of testing the latest attachment
http://issues.apache.org/jira/secure/attachment/12653008/YARN-1366.6.patch
against trunk revision .
{color:green}+1 @author{color}. The patch does not contain any @author tags.
{color:green}+1 tests included{color}. The patch appears to include 3 new or modified test files.
{color:green}+1 javac{color}. The applied patch does not increase the total number of javac compiler warnings.
{color:green}+1 javadoc{color}. There were no new javadoc warning messages.
{color:green}+1 eclipse:eclipse{color}. The patch built with eclipse:eclipse.
{color:green}+1 findbugs{color}. The patch does not introduce any new Findbugs (version 1.3.9) warnings.
{color:red}-1 release audit{color}. The applied patch generated 1 release audit warnings.
{color:green}+1 core tests{color}. The patch passed unit tests in hadoop-yarn-project/hadoop-yarn/hadoop-yarn-client.
{color:green}+1 contrib tests{color}. The patch passed contrib unit tests.
Test results: https://builds.apache.org/job/PreCommit-YARN-Build/4130//testReport/
Release audit warnings: https://builds.apache.org/job/PreCommit-YARN-Build/4130//artifact/trunk/patchprocess/patchReleaseAuditProblems.txt
Console output: https://builds.apache.org/job/PreCommit-YARN-Build/4130//console
This message is automatically generated.
======================================================================
======================================================================
Adding comment to Jira.
======================================================================
======================================================================
Comment added.
06315d066995901bf4f351218a184626e13003d4 logged out
======================================================================
======================================================================
Finished build.
======================================================================
======================================================================
Build step 'Execute shell' marked build as failure
Archiving artifacts
Sending artifact delta relative to PreCommit-YARN-Build #4125
Archived 18 artifacts
Archive block size is 32768
Received 202 blocks and 1048149 bytes
Compression is 86.3%
Took 2.5 sec
[description-setter] Could not determine description.
Recording test results
Email was triggered for: Failure
Sending email for trigger: Failure
###################################################################################
############################## FAILED TESTS (if any) ##############################
All tests passed
Failed: YARN-2052 PreCommit Build #4129
Posted by Apache Jenkins Server <je...@builds.apache.org>.
Jira: https://issues.apache.org/jira/browse/YARN-2052
Build: https://builds.apache.org/job/PreCommit-YARN-Build/4129/
###################################################################################
########################## LAST 60 LINES OF THE CONSOLE ###########################
[...truncated 3126 lines...]
{color:green}+1 contrib tests{color}. The patch passed contrib unit tests.
Test results: https://builds.apache.org/job/PreCommit-YARN-Build/4129//testReport/
Console output: https://builds.apache.org/job/PreCommit-YARN-Build/4129//console
This message is automatically generated.
======================================================================
======================================================================
Adding comment to Jira.
======================================================================
======================================================================
Comment added.
675a9f07779fc3574038768df523b0e364c804db logged out
======================================================================
======================================================================
Finished build.
======================================================================
======================================================================
Build step 'Execute shell' marked build as failure
Archiving artifacts
Sending artifact delta relative to PreCommit-YARN-Build #4125
Archived 22 artifacts
Archive block size is 32768
Received 36 blocks and 7504282 bytes
Compression is 13.6%
Took 4.4 sec
[description-setter] Could not determine description.
Recording test results
ERROR: Failed to archive test reports
java.io.IOException: remote file operation failed: /home/jenkins/jenkins-slave/workspace/PreCommit-YARN-Build at hudson.remoting.Channel@58a54ac6:hadoop7
at hudson.FilePath.act(FilePath.java:910)
at hudson.FilePath.act(FilePath.java:887)
at hudson.tasks.junit.JUnitParser.parse(JUnitParser.java:87)
at hudson.tasks.junit.JUnitResultArchiver.parse(JUnitResultArchiver.java:121)
at hudson.tasks.junit.JUnitResultArchiver.perform(JUnitResultArchiver.java:133)
at hudson.tasks.BuildStepMonitor$1.perform(BuildStepMonitor.java:20)
at hudson.model.AbstractBuild$AbstractBuildExecution.perform(AbstractBuild.java:804)
at hudson.model.AbstractBuild$AbstractBuildExecution.performAllBuildSteps(AbstractBuild.java:776)
at hudson.model.Build$BuildExecution.post2(Build.java:183)
at hudson.model.AbstractBuild$AbstractBuildExecution.post(AbstractBuild.java:725)
at hudson.model.Run.execute(Run.java:1701)
at hudson.model.FreeStyleBuild.run(FreeStyleBuild.java:43)
at hudson.model.ResourceController.execute(ResourceController.java:88)
at hudson.model.Executor.run(Executor.java:231)
Caused by: java.io.IOException: Remote call on hadoop7 failed
at hudson.remoting.Channel.call(Channel.java:731)
at hudson.FilePath.act(FilePath.java:903)
... 13 more
Caused by: java.lang.OutOfMemoryError: Java heap space
Email was triggered for: Failure
Sending email for trigger: Failure
###################################################################################
############################## FAILED TESTS (if any) ##############################
No tests ran.
Failed: YARN-614 PreCommit Build #4128
Posted by Apache Jenkins Server <je...@builds.apache.org>.
Jira: https://issues.apache.org/jira/browse/YARN-614
Build: https://builds.apache.org/job/PreCommit-YARN-Build/4128/
###################################################################################
########################## LAST 60 LINES OF THE CONSOLE ###########################
[...truncated 3047 lines...]
{color:green}+1 contrib tests{color}. The patch passed contrib unit tests.
Test results: https://builds.apache.org/job/PreCommit-YARN-Build/4128//testReport/
Console output: https://builds.apache.org/job/PreCommit-YARN-Build/4128//console
This message is automatically generated.
======================================================================
======================================================================
Adding comment to Jira.
======================================================================
======================================================================
Comment added.
512fd1a851d2734559c7b6ec6d5fb3acc3fbfc5c logged out
======================================================================
======================================================================
Finished build.
======================================================================
======================================================================
Build step 'Execute shell' marked build as failure
Archiving artifacts
Sending artifact delta relative to PreCommit-YARN-Build #4125
Archived 17 artifacts
Archive block size is 32768
Received 219 blocks and 1121718 bytes
Compression is 86.5%
Took 2.1 sec
[description-setter] Could not determine description.
Recording test results
ERROR: Failed to archive test reports
java.io.IOException: remote file operation failed: /home/jenkins/jenkins-slave/workspace/PreCommit-YARN-Build at hudson.remoting.Channel@17c77c3d:hadoop4
at hudson.FilePath.act(FilePath.java:910)
at hudson.FilePath.act(FilePath.java:887)
at hudson.tasks.junit.JUnitParser.parse(JUnitParser.java:87)
at hudson.tasks.junit.JUnitResultArchiver.parse(JUnitResultArchiver.java:121)
at hudson.tasks.junit.JUnitResultArchiver.perform(JUnitResultArchiver.java:133)
at hudson.tasks.BuildStepMonitor$1.perform(BuildStepMonitor.java:20)
at hudson.model.AbstractBuild$AbstractBuildExecution.perform(AbstractBuild.java:804)
at hudson.model.AbstractBuild$AbstractBuildExecution.performAllBuildSteps(AbstractBuild.java:776)
at hudson.model.Build$BuildExecution.post2(Build.java:183)
at hudson.model.AbstractBuild$AbstractBuildExecution.post(AbstractBuild.java:725)
at hudson.model.Run.execute(Run.java:1701)
at hudson.model.FreeStyleBuild.run(FreeStyleBuild.java:43)
at hudson.model.ResourceController.execute(ResourceController.java:88)
at hudson.model.Executor.run(Executor.java:231)
Caused by: java.io.IOException: Remote call on hadoop4 failed
at hudson.remoting.Channel.call(Channel.java:731)
at hudson.FilePath.act(FilePath.java:903)
... 13 more
Caused by: java.lang.OutOfMemoryError: Java heap space
Email was triggered for: Failure
Sending email for trigger: Failure
###################################################################################
############################## FAILED TESTS (if any) ##############################
No tests ran.