You are viewing a plain text version of this content. The canonical link for it is here.
Posted to builds@beam.apache.org by Apache Jenkins Server <je...@builds.apache.org> on 2019/03/05 00:14:49 UTC
Build failed in Jenkins: beam_PerformanceTests_XmlIOIT #1433
See <https://builds.apache.org/job/beam_PerformanceTests_XmlIOIT/1433/display/redirect?page=changes>
Changes:
[katarzyna.kucharczyk] [BEAM-5995] Created Jenkins DSL for Python Load Tests
[katarzyna.kucharczyk] [BEAM-5995] Updated Python load tests documentation with gradle run
[katarzyna.kucharczyk] [BEAM-5995] Changed build dir in test gradle for getting sdist package.
[katarzyna.kucharczyk] [BEAM-5995] Extracted enum for SDK. Getting runner dependency by given
[katarzyna.kucharczyk] [BEAM-5995] Used SDK enum to have only one function to run LoadTest task
[github] [BEAM-6768] BigQuery dynamic destinations for Python SDK Streaming
------------------------------------------
[...truncated 311.21 KB...]
Mar 05, 2019 12:10:22 AM org.apache.beam.runners.dataflow.util.MonitoringUtil$LoggingHandler process
INFO: 2019-03-05T00:10:17.432Z: Fusing consumer PAssert$0/CreateActual/GatherPanes/WithKeys/AddKeys/Map into PAssert$0/CreateActual/GatherPanes/Reify.Window/ParDo(Anonymous)
Mar 05, 2019 12:10:22 AM org.apache.beam.runners.dataflow.util.MonitoringUtil$LoggingHandler process
INFO: 2019-03-05T00:10:17.496Z: Fusing consumer View.AsSingleton/Combine.GloballyAsSingletonView/Combine.globally(Singleton)/Combine.perKey(Singleton)/GroupByKey+View.AsSingleton/Combine.GloballyAsSingletonView/Combine.globally(Singleton)/Combine.perKey(Singleton)/Combine.GroupedValues/Partial into View.AsSingleton/Combine.GloballyAsSingletonView/Combine.globally(Singleton)/WithKeys/AddKeys/Map
Mar 05, 2019 12:10:22 AM org.apache.beam.runners.dataflow.util.MonitoringUtil$LoggingHandler process
INFO: 2019-03-05T00:10:17.568Z: Fusing consumer PAssert$0/CreateActual/GatherPanes/Window.Into()/Window.Assign into PAssert$0/CreateActual/GatherPanes/WithKeys/AddKeys/Map
Mar 05, 2019 12:10:22 AM org.apache.beam.runners.dataflow.util.MonitoringUtil$LoggingHandler process
INFO: 2019-03-05T00:10:17.621Z: Fusing consumer Calculate hashcode/ProduceDefault into Calculate hashcode/CreateVoid/Read(CreateSource)
Mar 05, 2019 12:10:22 AM org.apache.beam.runners.dataflow.util.MonitoringUtil$LoggingHandler process
INFO: 2019-03-05T00:10:17.688Z: Fusing consumer PAssert$0/RunChecks into PAssert$0/WindowToken/Window.Assign
Mar 05, 2019 12:10:22 AM org.apache.beam.runners.dataflow.util.MonitoringUtil$LoggingHandler process
INFO: 2019-03-05T00:10:17.751Z: Fusing consumer PAssert$0/VerifyAssertions/ParDo(DefaultConclude) into PAssert$0/RunChecks
Mar 05, 2019 12:10:22 AM org.apache.beam.runners.dataflow.util.MonitoringUtil$LoggingHandler process
INFO: 2019-03-05T00:10:17.815Z: Fusing consumer PAssert$0/WindowToken/Window.Assign into PAssert$0/Create.Values/Read(CreateSource)
Mar 05, 2019 12:10:22 AM org.apache.beam.runners.dataflow.util.MonitoringUtil$LoggingHandler process
INFO: 2019-03-05T00:10:18.933Z: Executing operation Write xml files/WriteFiles/GatherTempFileResults/Reshuffle/GroupByKey/Create
Mar 05, 2019 12:10:22 AM org.apache.beam.runners.dataflow.util.MonitoringUtil$LoggingHandler process
INFO: 2019-03-05T00:10:19.037Z: Executing operation Write xml files/WriteFiles/GatherTempFileResults/Reshuffle.ViaRandomKey/Reshuffle/GroupByKey/Create
Mar 05, 2019 12:10:22 AM org.apache.beam.runners.dataflow.util.MonitoringUtil$LoggingHandler process
INFO: 2019-03-05T00:10:19.119Z: Executing operation Write xml files/WriteFiles/FinalizeTempFileBundles/Reshuffle.ViaRandomKey/Reshuffle/GroupByKey/Create
Mar 05, 2019 12:10:22 AM org.apache.beam.runners.dataflow.util.MonitoringUtil$LoggingHandler process
INFO: 2019-03-05T00:10:19.163Z: Starting 1 workers in us-central1-b...
Mar 05, 2019 12:10:22 AM org.apache.beam.runners.dataflow.util.MonitoringUtil$LoggingHandler process
INFO: 2019-03-05T00:10:19.210Z: Executing operation Find files/Reshuffle.ViaRandomKey/Reshuffle/GroupByKey/Create
Mar 05, 2019 12:10:22 AM org.apache.beam.runners.dataflow.util.MonitoringUtil$LoggingHandler process
INFO: 2019-03-05T00:10:19.290Z: Executing operation Read xml files/ReadAllViaFileBasedSource/Reshuffle/Reshuffle/GroupByKey/Create
Mar 05, 2019 12:10:22 AM org.apache.beam.runners.dataflow.util.MonitoringUtil$LoggingHandler process
INFO: 2019-03-05T00:10:19.384Z: Executing operation Write xml files/WriteFiles/WriteUnshardedBundlesToTempFiles/GroupUnwritten/Create
Mar 05, 2019 12:10:22 AM org.apache.beam.runners.dataflow.util.MonitoringUtil$LoggingHandler process
INFO: 2019-03-05T00:10:19.494Z: Executing operation Calculate hashcode/Combine.perKey(Hashing)/GroupByKey/Create
Mar 05, 2019 12:10:22 AM org.apache.beam.runners.dataflow.util.MonitoringUtil$LoggingHandler process
INFO: 2019-03-05T00:10:19.622Z: Executing operation PAssert$0/CreateActual/GatherPanes/GroupByKey/Create
Mar 05, 2019 12:10:22 AM org.apache.beam.runners.dataflow.util.MonitoringUtil$LoggingHandler process
INFO: 2019-03-05T00:10:19.735Z: Executing operation PAssert$0/CreateActual/View.AsSingleton/Combine.GloballyAsSingletonView/Combine.globally(Singleton)/Combine.perKey(Singleton)/GroupByKey/Create
Mar 05, 2019 12:10:22 AM org.apache.beam.runners.dataflow.util.MonitoringUtil$LoggingHandler process
INFO: 2019-03-05T00:10:19.824Z: Executing operation PAssert$0/CreateActual/View.AsSingleton/Combine.GloballyAsSingletonView/BatchViewOverrides.GroupByWindowHashAsKeyAndWindowAsSortKey/BatchViewOverrides.GroupByKeyAndSortValuesOnly/Create
Mar 05, 2019 12:10:22 AM org.apache.beam.runners.dataflow.util.MonitoringUtil$LoggingHandler process
INFO: 2019-03-05T00:10:19.901Z: Executing operation View.AsSingleton/Combine.GloballyAsSingletonView/Combine.globally(Singleton)/Combine.perKey(Singleton)/GroupByKey/Create
Mar 05, 2019 12:10:22 AM org.apache.beam.runners.dataflow.util.MonitoringUtil$LoggingHandler process
INFO: 2019-03-05T00:10:19.994Z: Executing operation View.AsSingleton/Combine.GloballyAsSingletonView/BatchViewOverrides.GroupByWindowHashAsKeyAndWindowAsSortKey/BatchViewOverrides.GroupByKeyAndSortValuesOnly/Create
Mar 05, 2019 12:10:22 AM org.apache.beam.runners.dataflow.util.MonitoringUtil$LoggingHandler process
INFO: 2019-03-05T00:10:21.634Z: Executing operation Generate sequence/Read(BoundedCountingSource)+Create xml records/Map+Write xml files/WriteFiles/WriteUnshardedBundlesToTempFiles/WriteUnshardedBundles+Write xml files/WriteFiles/GatherTempFileResults/Add void key/AddKeys/Map+Write xml files/WriteFiles/GatherTempFileResults/Reshuffle/Window.Into()/Window.Assign+Write xml files/WriteFiles/GatherTempFileResults/Reshuffle/GroupByKey/Reify+Write xml files/WriteFiles/GatherTempFileResults/Reshuffle/GroupByKey/Write+Write xml files/WriteFiles/WriteUnshardedBundlesToTempFiles/GroupUnwritten/Reify+Write xml files/WriteFiles/WriteUnshardedBundlesToTempFiles/GroupUnwritten/Write
Mar 05, 2019 12:10:39 AM org.apache.beam.runners.dataflow.util.MonitoringUtil$LoggingHandler process
INFO: 2019-03-05T00:10:38.833Z: Autoscaling: Raised the number of workers to 0 based on the rate of progress in the currently running step(s).
Mar 05, 2019 12:11:07 AM org.apache.beam.runners.dataflow.util.MonitoringUtil$LoggingHandler process
INFO: 2019-03-05T00:11:04.554Z: Workers have started successfully.
Mar 05, 2019 12:11:14 AM org.apache.beam.runners.dataflow.util.MonitoringUtil$LoggingHandler process
INFO: 2019-03-05T00:11:12.517Z: Autoscaling: Raised the number of workers to 1 based on the rate of progress in the currently running step(s).
Mar 05, 2019 12:11:14 AM org.apache.beam.runners.dataflow.util.MonitoringUtil$LoggingHandler process
INFO: 2019-03-05T00:11:12.572Z: Autoscaling: Would further reduce the number of workers but reached the minimum number allowed for the job.
Mar 05, 2019 12:11:37 AM org.apache.beam.runners.dataflow.util.MonitoringUtil$LoggingHandler process
INFO: 2019-03-05T00:11:35.882Z: Workers have started successfully.
Mar 05, 2019 12:13:49 AM org.apache.beam.runners.dataflow.util.MonitoringUtil$LoggingHandler process
INFO: 2019-03-05T00:13:47.755Z: Autoscaling: Resizing worker pool from 1 to 2.
Gradle Test Executor 1 finished executing tests.
> Task :beam-sdks-java-io-file-based-io-tests:integrationTest
org.apache.beam.sdk.io.xml.XmlIOIT > writeThenReadAll FAILED
java.lang.OutOfMemoryError: unable to create new native thread
at java.lang.Thread.start0(Native Method)
at java.lang.Thread.start(Thread.java:717)
at sun.security.ssl.SSLSocketImpl.readRecord(SSLSocketImpl.java:1097)
at sun.security.ssl.SSLSocketImpl.performInitialHandshake(SSLSocketImpl.java:1367)
at sun.security.ssl.SSLSocketImpl.startHandshake(SSLSocketImpl.java:1395)
at sun.security.ssl.SSLSocketImpl.startHandshake(SSLSocketImpl.java:1379)
at sun.net.www.protocol.https.HttpsClient.afterConnect(HttpsClient.java:559)
at sun.net.www.protocol.https.AbstractDelegateHttpsURLConnection.connect(AbstractDelegateHttpsURLConnection.java:185)
at sun.net.www.protocol.https.HttpsURLConnectionImpl.connect(HttpsURLConnectionImpl.java:162)
at com.google.api.client.http.javanet.NetHttpRequest.execute(NetHttpRequest.java:142)
at com.google.api.client.http.javanet.NetHttpRequest.execute(NetHttpRequest.java:84)
at com.google.api.client.http.HttpRequest.execute(HttpRequest.java:1011)
at com.google.api.client.googleapis.services.AbstractGoogleClientRequest.executeUnparsed(AbstractGoogleClientRequest.java:499)
at com.google.api.client.googleapis.services.AbstractGoogleClientRequest.executeUnparsed(AbstractGoogleClientRequest.java:432)
at com.google.api.client.googleapis.services.AbstractGoogleClientRequest.execute(AbstractGoogleClientRequest.java:549)
at org.apache.beam.runners.dataflow.DataflowClient.getJob(DataflowClient.java:101)
at org.apache.beam.runners.dataflow.DataflowPipelineJob.getJobWithRetries(DataflowPipelineJob.java:471)
at org.apache.beam.runners.dataflow.DataflowPipelineJob.getStateWithRetries(DataflowPipelineJob.java:447)
at org.apache.beam.runners.dataflow.DataflowPipelineJob.waitUntilFinish(DataflowPipelineJob.java:283)
at org.apache.beam.runners.dataflow.DataflowPipelineJob.waitUntilFinish(DataflowPipelineJob.java:218)
at org.apache.beam.runners.dataflow.TestDataflowRunner.waitForBatchJobTermination(TestDataflowRunner.java:189)
at org.apache.beam.runners.dataflow.TestDataflowRunner.run(TestDataflowRunner.java:118)
at org.apache.beam.runners.dataflow.TestDataflowRunner.run(TestDataflowRunner.java:90)
at org.apache.beam.runners.dataflow.TestDataflowRunner.run(TestDataflowRunner.java:55)
at org.apache.beam.sdk.Pipeline.run(Pipeline.java:313)
at org.apache.beam.sdk.testing.TestPipeline.run(TestPipeline.java:350)
at org.apache.beam.sdk.testing.TestPipeline.run(TestPipeline.java:331)
at org.apache.beam.sdk.io.xml.XmlIOIT.writeThenReadAll(XmlIOIT.java:147)
Finished generating test XML results (0.077 secs) into: <https://builds.apache.org/job/beam_PerformanceTests_XmlIOIT/ws/src/sdks/java/io/file-based-io-tests/build/test-results/integrationTest>
Generating HTML test report...
Finished generating test html results (0.132 secs) into: <https://builds.apache.org/job/beam_PerformanceTests_XmlIOIT/ws/src/sdks/java/io/file-based-io-tests/build/reports/tests/integrationTest>
> Task :beam-sdks-java-io-file-based-io-tests:integrationTest FAILED
:beam-sdks-java-io-file-based-io-tests:integrationTest (Thread[Execution worker for ':' Thread 6,5,main]) completed. Took 5 mins 37.843 secs.
Deprecated Gradle features were used in this build, making it incompatible with Gradle 6.0.
Use '--warning-mode all' to show the individual deprecation warnings.
See https://docs.gradle.org/5.2.1/userguide/command_line_interface.html#sec:command_line_warnings
89 actionable tasks: 1 executed, 88 up-to-date
Publishing build scan...
https://gradle.com/s/zetqeqr7iek7u
STDERR:
1 test completed, 1 failed
FAILURE: Build failed with an exception.
* What went wrong:
Execution failed for task ':beam-sdks-java-io-file-based-io-tests:integrationTest'.
> There were failing tests. See the report at: file://<https://builds.apache.org/job/beam_PerformanceTests_XmlIOIT/ws/src/sdks/java/io/file-based-io-tests/build/reports/tests/integrationTest/index.html>
* Try:
Run with --debug option to get more log output. Run with --scan to get full insights.
* Exception is:
org.gradle.api.tasks.TaskExecutionException: Execution failed for task ':beam-sdks-java-io-file-based-io-tests:integrationTest'.
at org.gradle.api.internal.tasks.execution.ExecuteActionsTaskExecuter$2.accept(ExecuteActionsTaskExecuter.java:121)
at org.gradle.api.internal.tasks.execution.ExecuteActionsTaskExecuter$2.accept(ExecuteActionsTaskExecuter.java:117)
at org.gradle.internal.Try$Failure.ifSuccessfulOrElse(Try.java:184)
at org.gradle.api.internal.tasks.execution.ExecuteActionsTaskExecuter.execute(ExecuteActionsTaskExecuter.java:110)
at org.gradle.api.internal.tasks.execution.ResolveIncrementalChangesTaskExecuter.execute(ResolveIncrementalChangesTaskExecuter.java:84)
at org.gradle.api.internal.tasks.execution.ResolveTaskOutputCachingStateExecuter.execute(ResolveTaskOutputCachingStateExecuter.java:91)
at org.gradle.api.internal.tasks.execution.FinishSnapshotTaskInputsBuildOperationTaskExecuter.execute(FinishSnapshotTaskInputsBuildOperationTaskExecuter.java:51)
at org.gradle.api.internal.tasks.execution.ResolveBuildCacheKeyExecuter.execute(ResolveBuildCacheKeyExecuter.java:102)
at org.gradle.api.internal.tasks.execution.ResolveBeforeExecutionStateTaskExecuter.execute(ResolveBeforeExecutionStateTaskExecuter.java:74)
at org.gradle.api.internal.tasks.execution.ValidatingTaskExecuter.execute(ValidatingTaskExecuter.java:58)
at org.gradle.api.internal.tasks.execution.SkipEmptySourceFilesTaskExecuter.execute(SkipEmptySourceFilesTaskExecuter.java:109)
at org.gradle.api.internal.tasks.execution.ResolveBeforeExecutionOutputsTaskExecuter.execute(ResolveBeforeExecutionOutputsTaskExecuter.java:67)
at org.gradle.api.internal.tasks.execution.StartSnapshotTaskInputsBuildOperationTaskExecuter.execute(StartSnapshotTaskInputsBuildOperationTaskExecuter.java:52)
at org.gradle.api.internal.tasks.execution.ResolveAfterPreviousExecutionStateTaskExecuter.execute(ResolveAfterPreviousExecutionStateTaskExecuter.java:46)
at org.gradle.api.internal.tasks.execution.CleanupStaleOutputsExecuter.execute(CleanupStaleOutputsExecuter.java:93)
at org.gradle.api.internal.tasks.execution.FinalizePropertiesTaskExecuter.execute(FinalizePropertiesTaskExecuter.java:45)
at org.gradle.api.internal.tasks.execution.ResolveTaskExecutionModeExecuter.execute(ResolveTaskExecutionModeExecuter.java:94)
at org.gradle.api.internal.tasks.execution.SkipTaskWithNoActionsExecuter.execute(SkipTaskWithNoActionsExecuter.java:57)
at org.gradle.api.internal.tasks.execution.SkipOnlyIfTaskExecuter.execute(SkipOnlyIfTaskExecuter.java:56)
at org.gradle.api.internal.tasks.execution.CatchExceptionTaskExecuter.execute(CatchExceptionTaskExecuter.java:36)
at org.gradle.api.internal.tasks.execution.EventFiringTaskExecuter$1.executeTask(EventFiringTaskExecuter.java:63)
at org.gradle.api.internal.tasks.execution.EventFiringTaskExecuter$1.call(EventFiringTaskExecuter.java:49)
at org.gradle.api.internal.tasks.execution.EventFiringTaskExecuter$1.call(EventFiringTaskExecuter.java:46)
at org.gradle.internal.operations.DefaultBuildOperationExecutor$CallableBuildOperationWorker.execute(DefaultBuildOperationExecutor.java:416)
at org.gradle.internal.operations.DefaultBuildOperationExecutor$CallableBuildOperationWorker.execute(DefaultBuildOperationExecutor.java:406)
at org.gradle.internal.operations.DefaultBuildOperationExecutor$1.execute(DefaultBuildOperationExecutor.java:165)
at org.gradle.internal.operations.DefaultBuildOperationExecutor.execute(DefaultBuildOperationExecutor.java:250)
at org.gradle.internal.operations.DefaultBuildOperationExecutor.execute(DefaultBuildOperationExecutor.java:158)
at org.gradle.internal.operations.DefaultBuildOperationExecutor.call(DefaultBuildOperationExecutor.java:102)
at org.gradle.internal.operations.DelegatingBuildOperationExecutor.call(DelegatingBuildOperationExecutor.java:36)
at org.gradle.api.internal.tasks.execution.EventFiringTaskExecuter.execute(EventFiringTaskExecuter.java:46)
at org.gradle.execution.plan.LocalTaskNodeExecutor.execute(LocalTaskNodeExecutor.java:43)
at org.gradle.execution.taskgraph.DefaultTaskExecutionGraph$InvokeNodeExecutorsAction.execute(DefaultTaskExecutionGraph.java:355)
at org.gradle.execution.taskgraph.DefaultTaskExecutionGraph$InvokeNodeExecutorsAction.execute(DefaultTaskExecutionGraph.java:343)
at org.gradle.execution.taskgraph.DefaultTaskExecutionGraph$BuildOperationAwareExecutionAction.execute(DefaultTaskExecutionGraph.java:336)
at org.gradle.execution.taskgraph.DefaultTaskExecutionGraph$BuildOperationAwareExecutionAction.execute(DefaultTaskExecutionGraph.java:322)
at org.gradle.execution.plan.DefaultPlanExecutor$ExecutorWorker$1.execute(DefaultPlanExecutor.java:134)
at org.gradle.execution.plan.DefaultPlanExecutor$ExecutorWorker$1.execute(DefaultPlanExecutor.java:129)
at org.gradle.execution.plan.DefaultPlanExecutor$ExecutorWorker.execute(DefaultPlanExecutor.java:202)
at org.gradle.execution.plan.DefaultPlanExecutor$ExecutorWorker.executeNextNode(DefaultPlanExecutor.java:193)
at org.gradle.execution.plan.DefaultPlanExecutor$ExecutorWorker.run(DefaultPlanExecutor.java:129)
at org.gradle.internal.concurrent.ExecutorPolicy$CatchAndRecordFailures.onExecute(ExecutorPolicy.java:63)
at org.gradle.internal.concurrent.ManagedExecutorImpl$1.run(ManagedExecutorImpl.java:46)
at org.gradle.internal.concurrent.ThreadFactoryImpl$ManagedThreadRunnable.run(ThreadFactoryImpl.java:55)
Caused by: org.gradle.api.GradleException: There were failing tests. See the report at: file://<https://builds.apache.org/job/beam_PerformanceTests_XmlIOIT/ws/src/sdks/java/io/file-based-io-tests/build/reports/tests/integrationTest/index.html>
at org.gradle.api.tasks.testing.AbstractTestTask.handleTestFailures(AbstractTestTask.java:626)
at org.gradle.api.tasks.testing.AbstractTestTask.executeTests(AbstractTestTask.java:498)
at org.gradle.api.tasks.testing.Test.executeTests(Test.java:587)
at org.gradle.internal.reflect.JavaMethod.invoke(JavaMethod.java:103)
at org.gradle.api.internal.project.taskfactory.StandardTaskAction.doExecute(StandardTaskAction.java:48)
at org.gradle.api.internal.project.taskfactory.StandardTaskAction.execute(StandardTaskAction.java:41)
at org.gradle.api.internal.project.taskfactory.StandardTaskAction.execute(StandardTaskAction.java:28)
at org.gradle.api.internal.AbstractTask$TaskActionWrapper.execute(AbstractTask.java:705)
at org.gradle.api.internal.AbstractTask$TaskActionWrapper.execute(AbstractTask.java:672)
at org.gradle.api.internal.tasks.execution.ExecuteActionsTaskExecuter$4.run(ExecuteActionsTaskExecuter.java:338)
at org.gradle.internal.operations.DefaultBuildOperationExecutor$RunnableBuildOperationWorker.execute(DefaultBuildOperationExecutor.java:402)
at org.gradle.internal.operations.DefaultBuildOperationExecutor$RunnableBuildOperationWorker.execute(DefaultBuildOperationExecutor.java:394)
at org.gradle.internal.operations.DefaultBuildOperationExecutor$1.execute(DefaultBuildOperationExecutor.java:165)
at org.gradle.internal.operations.DefaultBuildOperationExecutor.execute(DefaultBuildOperationExecutor.java:250)
at org.gradle.internal.operations.DefaultBuildOperationExecutor.execute(DefaultBuildOperationExecutor.java:158)
at org.gradle.internal.operations.DefaultBuildOperationExecutor.run(DefaultBuildOperationExecutor.java:92)
at org.gradle.internal.operations.DelegatingBuildOperationExecutor.run(DelegatingBuildOperationExecutor.java:31)
at org.gradle.api.internal.tasks.execution.ExecuteActionsTaskExecuter.executeAction(ExecuteActionsTaskExecuter.java:327)
at org.gradle.api.internal.tasks.execution.ExecuteActionsTaskExecuter.executeActions(ExecuteActionsTaskExecuter.java:312)
at org.gradle.api.internal.tasks.execution.ExecuteActionsTaskExecuter.access$200(ExecuteActionsTaskExecuter.java:75)
at org.gradle.api.internal.tasks.execution.ExecuteActionsTaskExecuter$TaskExecution.execute(ExecuteActionsTaskExecuter.java:158)
at org.gradle.internal.execution.impl.steps.ExecuteStep.execute(ExecuteStep.java:46)
at org.gradle.internal.execution.impl.steps.CancelExecutionStep.execute(CancelExecutionStep.java:34)
at org.gradle.internal.execution.impl.steps.TimeoutStep.executeWithoutTimeout(TimeoutStep.java:69)
at org.gradle.internal.execution.impl.steps.TimeoutStep.execute(TimeoutStep.java:49)
at org.gradle.internal.execution.impl.steps.CatchExceptionStep.execute(CatchExceptionStep.java:34)
at org.gradle.internal.execution.impl.steps.CreateOutputsStep.execute(CreateOutputsStep.java:49)
at org.gradle.internal.execution.impl.steps.SnapshotOutputStep.execute(SnapshotOutputStep.java:42)
at org.gradle.internal.execution.impl.steps.SnapshotOutputStep.execute(SnapshotOutputStep.java:28)
at org.gradle.internal.execution.impl.steps.CacheStep.executeWithoutCache(CacheStep.java:133)
at org.gradle.internal.execution.impl.steps.CacheStep.lambda$execute$5(CacheStep.java:83)
at org.gradle.internal.execution.impl.steps.CacheStep.execute(CacheStep.java:82)
at org.gradle.internal.execution.impl.steps.CacheStep.execute(CacheStep.java:37)
at org.gradle.internal.execution.impl.steps.PrepareCachingStep.execute(PrepareCachingStep.java:33)
at org.gradle.internal.execution.impl.steps.StoreSnapshotsStep.execute(StoreSnapshotsStep.java:38)
at org.gradle.internal.execution.impl.steps.StoreSnapshotsStep.execute(StoreSnapshotsStep.java:23)
at org.gradle.internal.execution.impl.steps.SkipUpToDateStep.executeBecause(SkipUpToDateStep.java:95)
at org.gradle.internal.execution.impl.steps.SkipUpToDateStep.lambda$execute$0(SkipUpToDateStep.java:88)
at org.gradle.internal.execution.impl.steps.SkipUpToDateStep.execute(SkipUpToDateStep.java:52)
at org.gradle.internal.execution.impl.steps.SkipUpToDateStep.execute(SkipUpToDateStep.java:36)
at org.gradle.internal.execution.impl.DefaultWorkExecutor.execute(DefaultWorkExecutor.java:34)
at org.gradle.api.internal.tasks.execution.ExecuteActionsTaskExecuter.execute(ExecuteActionsTaskExecuter.java:109)
... 40 more
* Get more help at https://help.gradle.org
BUILD FAILED in 5m 52s
2019-03-05 00:14:47,930 0fd588ca MainThread beam_integration_benchmark(1/1) ERROR Error during benchmark beam_integration_benchmark
Traceback (most recent call last):
File "<https://builds.apache.org/job/beam_PerformanceTests_XmlIOIT/ws/PerfKitBenchmarker/perfkitbenchmarker/pkb.py",> line 734, in RunBenchmark
DoRunPhase(spec, collector, detailed_timer)
File "<https://builds.apache.org/job/beam_PerformanceTests_XmlIOIT/ws/PerfKitBenchmarker/perfkitbenchmarker/pkb.py",> line 589, in DoRunPhase
samples = spec.BenchmarkRun(spec)
File "<https://builds.apache.org/job/beam_PerformanceTests_XmlIOIT/ws/PerfKitBenchmarker/perfkitbenchmarker/linux_benchmarks/beam_integration_benchmark.py",> line 160, in Run
job_type=job_type)
File "<https://builds.apache.org/job/beam_PerformanceTests_XmlIOIT/ws/PerfKitBenchmarker/perfkitbenchmarker/providers/gcp/gcp_dpb_dataflow.py",> line 90, in SubmitJob
assert retcode == 0, "Integration Test Failed."
AssertionError: Integration Test Failed.
2019-03-05 00:14:47,933 0fd588ca MainThread beam_integration_benchmark(1/1) INFO Cleaning up benchmark beam_integration_benchmark
2019-03-05 00:14:47,942 0fd588ca MainThread beam_integration_benchmark(1/1) ERROR Exception running benchmark
Traceback (most recent call last):
File "<https://builds.apache.org/job/beam_PerformanceTests_XmlIOIT/ws/PerfKitBenchmarker/perfkitbenchmarker/pkb.py",> line 874, in RunBenchmarkTask
RunBenchmark(spec, collector)
File "<https://builds.apache.org/job/beam_PerformanceTests_XmlIOIT/ws/PerfKitBenchmarker/perfkitbenchmarker/pkb.py",> line 734, in RunBenchmark
DoRunPhase(spec, collector, detailed_timer)
File "<https://builds.apache.org/job/beam_PerformanceTests_XmlIOIT/ws/PerfKitBenchmarker/perfkitbenchmarker/pkb.py",> line 589, in DoRunPhase
samples = spec.BenchmarkRun(spec)
File "<https://builds.apache.org/job/beam_PerformanceTests_XmlIOIT/ws/PerfKitBenchmarker/perfkitbenchmarker/linux_benchmarks/beam_integration_benchmark.py",> line 160, in Run
job_type=job_type)
File "<https://builds.apache.org/job/beam_PerformanceTests_XmlIOIT/ws/PerfKitBenchmarker/perfkitbenchmarker/providers/gcp/gcp_dpb_dataflow.py",> line 90, in SubmitJob
assert retcode == 0, "Integration Test Failed."
AssertionError: Integration Test Failed.
2019-03-05 00:14:47,943 0fd588ca MainThread beam_integration_benchmark(1/1) ERROR Benchmark 1/1 beam_integration_benchmark (UID: beam_integration_benchmark0) failed. Execution will continue.
2019-03-05 00:14:47,944 0fd588ca MainThread beam_integration_benchmark(1/1) INFO Benchmark run statuses:
---------------------------------------------------------------------------------
Name UID Status Failed Substatus
---------------------------------------------------------------------------------
beam_integration_benchmark beam_integration_benchmark0 FAILED
---------------------------------------------------------------------------------
Success rate: 0.00% (0/1)
2019-03-05 00:14:47,946 0fd588ca MainThread beam_integration_benchmark(1/1) INFO Complete logs can be found at: <https://builds.apache.org/job/beam_PerformanceTests_XmlIOIT/ws/runs/0fd588ca/pkb.log>
2019-03-05 00:14:47,946 0fd588ca MainThread beam_integration_benchmark(1/1) INFO Completion statuses can be found at: <https://builds.apache.org/job/beam_PerformanceTests_XmlIOIT/ws/runs/0fd588ca/completion_statuses.json>
Build step 'Execute shell' marked build as failure
---------------------------------------------------------------------
To unsubscribe, e-mail: builds-unsubscribe@beam.apache.org
For additional commands, e-mail: builds-help@beam.apache.org
Jenkins build is back to normal : beam_PerformanceTests_XmlIOIT
#1434
Posted by Apache Jenkins Server <je...@builds.apache.org>.
See <https://builds.apache.org/job/beam_PerformanceTests_XmlIOIT/1434/display/redirect>
---------------------------------------------------------------------
To unsubscribe, e-mail: builds-unsubscribe@beam.apache.org
For additional commands, e-mail: builds-help@beam.apache.org