You are viewing a plain text version of this content. The canonical link for it is here.
Posted to dev@zookeeper.apache.org by Apache Jenkins Server <je...@builds.apache.org> on 2019/07/31 21:31:30 UTC

Jenkins build became unstable: PreCommit-ZOOKEEPER-github-pr-build-maven #1022

See <https://builds.apache.org/job/PreCommit-ZOOKEEPER-github-pr-build-maven/1022/display/redirect>


Jenkins build is back to stable : PreCommit-ZOOKEEPER-github-pr-build-maven #1036

Posted by Apache Jenkins Server <je...@builds.apache.org>.
See <https://builds.apache.org/job/PreCommit-ZOOKEEPER-github-pr-build-maven/1036/display/redirect>


Jenkins build is still unstable: PreCommit-ZOOKEEPER-github-pr-build-maven #1035

Posted by Apache Jenkins Server <je...@builds.apache.org>.
See <https://builds.apache.org/job/PreCommit-ZOOKEEPER-github-pr-build-maven/1035/display/redirect>


Jenkins build is still unstable: PreCommit-ZOOKEEPER-github-pr-build-maven #1034

Posted by Apache Jenkins Server <je...@builds.apache.org>.
See <https://builds.apache.org/job/PreCommit-ZOOKEEPER-github-pr-build-maven/1034/display/redirect>


Jenkins build is unstable: PreCommit-ZOOKEEPER-github-pr-build-maven #1033

Posted by Apache Jenkins Server <je...@builds.apache.org>.
See <https://builds.apache.org/job/PreCommit-ZOOKEEPER-github-pr-build-maven/1033/display/redirect>


Build failed in Jenkins: PreCommit-ZOOKEEPER-github-pr-build-maven #1032

Posted by Apache Jenkins Server <je...@builds.apache.org>.
See <https://builds.apache.org/job/PreCommit-ZOOKEEPER-github-pr-build-maven/1032/display/redirect?page=changes>

Changes:

[lhan] ZOOKEEPER-3448: Introduce MessageTracker to assist debug leader and

[lhan] Addressing code review feedback.

------------------------------------------
[...truncated 915.11 KB...]
     [exec] ZooKeeper JMX enabled by default
     [exec] Using config: <https://builds.apache.org/job/PreCommit-ZOOKEEPER-github-pr-build-maven/ws/zookeeper-client/zookeeper-client-c/../../build/test/test-cppunit/conf/2.conf>
     [exec] Stopping zookeeper ... STOPPED
     [exec]  : elapsed 7905 : OK
     [exec] ZooKeeper JMX enabled by default
     [exec] Using config: <https://builds.apache.org/job/PreCommit-ZOOKEEPER-github-pr-build-maven/ws/zookeeper-client/zookeeper-client-c/../../build/test/test-cppunit/conf/0.conf>
     [exec] TestReconfigServer::testReconfigFailureWithoutServerSuperuserPasswordConfiguredStarting zookeeper ... STARTEDZooKeeper JMX enabled by default
     [exec] 
     [exec] Using config: <https://builds.apache.org/job/PreCommit-ZOOKEEPER-github-pr-build-maven/ws/zookeeper-client/zookeeper-client-c/../../build/test/test-cppunit/conf/1.conf>
     [exec] Starting zookeeper ... STARTEDZooKeeper JMX enabled by default
     [exec] 
     [exec] Using config: <https://builds.apache.org/job/PreCommit-ZOOKEEPER-github-pr-build-maven/ws/zookeeper-client/zookeeper-client-c/../../build/test/test-cppunit/conf/2.conf>
     [exec] Starting zookeeper ... STARTED
     [exec] ZooKeeper JMX enabled by default
     [exec] Using config: <https://builds.apache.org/job/PreCommit-ZOOKEEPER-github-pr-build-maven/ws/zookeeper-client/zookeeper-client-c/../../build/test/test-cppunit/conf/0.conf>
     [exec] ZooKeeper JMX enabled by default
     [exec] Using config: <https://builds.apache.org/job/PreCommit-ZOOKEEPER-github-pr-build-maven/ws/zookeeper-client/zookeeper-client-c/../../build/test/test-cppunit/conf/1.conf>
     [exec] ZooKeeper JMX enabled by default
     [exec] Using config: <https://builds.apache.org/job/PreCommit-ZOOKEEPER-github-pr-build-maven/ws/zookeeper-client/zookeeper-client-c/../../build/test/test-cppunit/conf/2.conf>
     [exec] ZooKeeper JMX enabled by default
     [exec] Using config: <https://builds.apache.org/job/PreCommit-ZOOKEEPER-github-pr-build-maven/ws/zookeeper-client/zookeeper-client-c/../../build/test/test-cppunit/conf/0.conf>
     [exec] Stopping zookeeper ... STOPPED
     [exec] Stopping zookeeper ... STOPPED
     [exec] Stopping zookeeper ... STOPPED
     [exec] ZooKeeper JMX enabled by default
     [exec] Using config: <https://builds.apache.org/job/PreCommit-ZOOKEEPER-github-pr-build-maven/ws/zookeeper-client/zookeeper-client-c/../../build/test/test-cppunit/conf/1.conf>
     [exec] ZooKeeper JMX enabled by default
     [exec] Using config: <https://builds.apache.org/job/PreCommit-ZOOKEEPER-github-pr-build-maven/ws/zookeeper-client/zookeeper-client-c/../../build/test/test-cppunit/conf/2.conf>
     [exec] ZooKeeper JMX enabled by default
     [exec] Using config: <https://builds.apache.org/job/PreCommit-ZOOKEEPER-github-pr-build-maven/ws/zookeeper-client/zookeeper-client-c/../../build/test/test-cppunit/conf/0.conf>
     [exec] Starting zookeeper ... STARTED
     [exec] ZooKeeper JMX enabled by default
     [exec] Using config: <https://builds.apache.org/job/PreCommit-ZOOKEEPER-github-pr-build-maven/ws/zookeeper-client/zookeeper-client-c/../../build/test/test-cppunit/conf/1.conf>
     [exec] Starting zookeeper ... STARTED
     [exec] ZooKeeper JMX enabled by default
     [exec] Using config: <https://builds.apache.org/job/PreCommit-ZOOKEEPER-github-pr-build-maven/ws/zookeeper-client/zookeeper-client-c/../../build/test/test-cppunit/conf/2.conf>
     [exec] Starting zookeeper ... STARTED
     [exec] ZooKeeper JMX enabled by default
     [exec] Using config: <https://builds.apache.org/job/PreCommit-ZOOKEEPER-github-pr-build-maven/ws/zookeeper-client/zookeeper-client-c/../../build/test/test-cppunit/conf/0.conf>
     [exec] ZooKeeper JMX enabled by default
     [exec] Using config: <https://builds.apache.org/job/PreCommit-ZOOKEEPER-github-pr-build-maven/ws/zookeeper-client/zookeeper-client-c/../../build/test/test-cppunit/conf/1.conf>
     [exec] ZooKeeper JMX enabled by default
     [exec] Using config: <https://builds.apache.org/job/PreCommit-ZOOKEEPER-github-pr-build-maven/ws/zookeeper-client/zookeeper-client-c/../../build/test/test-cppunit/conf/2.conf>
     [exec] ZooKeeper JMX enabled by default
     [exec] Using config: <https://builds.apache.org/job/PreCommit-ZOOKEEPER-github-pr-build-maven/ws/zookeeper-client/zookeeper-client-c/../../build/test/test-cppunit/conf/0.conf>
     [exec] ZooKeeper JMX enabled by default
     [exec] Using config: <https://builds.apache.org/job/PreCommit-ZOOKEEPER-github-pr-build-maven/ws/zookeeper-client/zookeeper-client-c/../../build/test/test-cppunit/conf/1.conf>
     [exec] ZooKeeper JMX enabled by default
     [exec] Using config: <https://builds.apache.org/job/PreCommit-ZOOKEEPER-github-pr-build-maven/ws/zookeeper-client/zookeeper-client-c/../../build/test/test-cppunit/conf/2.conf>
     [exec] ZooKeeper JMX enabled by default
     [exec] Using config: <https://builds.apache.org/job/PreCommit-ZOOKEEPER-github-pr-build-maven/ws/zookeeper-client/zookeeper-client-c/../../build/test/test-cppunit/conf/0.conf>
     [exec] ZooKeeper JMX enabled by default
     [exec] Using config: <https://builds.apache.org/job/PreCommit-ZOOKEEPER-github-pr-build-maven/ws/zookeeper-client/zookeeper-client-c/../../build/test/test-cppunit/conf/1.conf>
     [exec] ZooKeeper JMX enabled by default
     [exec] Using config: <https://builds.apache.org/job/PreCommit-ZOOKEEPER-github-pr-build-maven/ws/zookeeper-client/zookeeper-client-c/../../build/test/test-cppunit/conf/0.conf>
     [exec] Stopping zookeeper ... STOPPED
     [exec] Stopping zookeeper ... STOPPED
     [exec] Stopping zookeeper ... STOPPED
     [exec]  : elapsed 12290 : OK
     [exec] ZooKeeper JMX enabled by default
     [exec] Using config: <https://builds.apache.org/job/PreCommit-ZOOKEEPER-github-pr-build-maven/ws/zookeeper-client/zookeeper-client-c/../../build/test/test-cppunit/conf/1.conf>
     [exec] ZooKeeper JMX enabled by default
     [exec] Using config: <https://builds.apache.org/job/PreCommit-ZOOKEEPER-github-pr-build-maven/ws/zookeeper-client/zookeeper-client-c/../../build/test/test-cppunit/conf/2.conf>
     [exec] Zookeeper_clientretry::testRetry ZooKeeper server started ZooKeeper server started : elapsed 8471 : OK
     [exec] Zookeeper_operations::testAsyncWatcher1 : elapsed 55 : OK
     [exec] Zookeeper_operations::testAsyncGetOperation : elapsed 4 : OK
     [exec] Zookeeper_operations::testOperationsAndDisconnectConcurrently1 : elapsed 377 : OK
     [exec] Zookeeper_operations::testOperationsAndDisconnectConcurrently2 : elapsed 0 : OK
     [exec] Zookeeper_operations::testConcurrentOperations1 : elapsed 11061 : OK
     [exec] Zookeeper_multi::testCreate : elapsed 1027 : OK
     [exec] Zookeeper_multi::testCreateDelete : elapsed 1018 : OK
     [exec] Zookeeper_multi::testInvalidVersion : elapsed 1023 : OK
     [exec] Zookeeper_multi::testNestedCreate : elapsed 1018 : OK
     [exec] Zookeeper_multi::testSetData : elapsed 6040 : OK
     [exec] Zookeeper_multi::testUpdateConflict : elapsed 1028 : OK
     [exec] Zookeeper_multi::testDeleteUpdateConflict : elapsed 1008 : OK
     [exec] Zookeeper_multi::testAsyncMulti : elapsed 2000 : OK
     [exec] Zookeeper_multi::testMultiFail : elapsed 1027 : OK
     [exec] Zookeeper_multi::testCheck : elapsed 1295 : OK
     [exec] Zookeeper_multi::testWatch : elapsed 2029 : OK
     [exec] Zookeeper_multi::testSequentialNodeCreateInAsyncMulti : elapsed 2001 : OK
     [exec] Zookeeper_multi::testBigAsyncMulti : elapsed 3003 : OK
     [exec] Zookeeper_watchers::testDefaultSessionWatcher1 : elapsed 51 : OK
     [exec] Zookeeper_watchers::testDefaultSessionWatcher2 : elapsed 4 : OK
     [exec] Zookeeper_watchers::testObjectSessionWatcher1 : elapsed 53 : OK
     [exec] Zookeeper_watchers::testObjectSessionWatcher2 : elapsed 55 : OK
     [exec] Zookeeper_watchers::testNodeWatcher1 : elapsed 56 : OK
     [exec] Zookeeper_watchers::testChildWatcher1 : elapsed 53 : OK
     [exec] Zookeeper_watchers::testChildWatcher2 : elapsed 53 : OK
     [exec] Zookeeper_simpleSystem::testLogCallbackSetLog Message Received: [2019-08-02 06:24:16,212:14525(0x7fd121407740):ZOO_INFO@testLogCallbackSet@1010: testLogCallbackSet #0]
     [exec] Log Message Received: [2019-08-02 06:24:16,212:14525(0x7fd121407740):ZOO_INFO@testLogCallbackSet@1010: testLogCallbackSet #1]
     [exec] Log Message Received: [2019-08-02 06:24:16,212:14525(0x7fd121407740):ZOO_INFO@testLogCallbackSet@1010: testLogCallbackSet #2]
     [exec] Log Message Received: [2019-08-02 06:24:16,212:14525(0x7fd121407740):ZOO_INFO@testLogCallbackSet@1010: testLogCallbackSet #3]
     [exec] Log Message Received: [2019-08-02 06:24:16,212:14525(0x7fd121407740):ZOO_INFO@testLogCallbackSet@1010: testLogCallbackSet #4]
     [exec] Log Message Received: [2019-08-02 06:24:16,212:14525(0x7fd121407740):ZOO_INFO@testLogCallbackSet@1010: testLogCallbackSet #5]
     [exec] Log Message Received: [2019-08-02 06:24:16,212:14525(0x7fd121407740):ZOO_INFO@testLogCallbackSet@1010: testLogCallbackSet #6]
     [exec] Log Message Received: [2019-08-02 06:24:16,212:14525(0x7fd121407740):ZOO_INFO@testLogCallbackSet@1010: testLogCallbackSet #7]
     [exec] Log Message Received: [2019-08-02 06:24:16,212:14525(0x7fd121407740):ZOO_INFO@testLogCallbackSet@1010: testLogCallbackSet #8]
     [exec] Log Message Received: [2019-08-02 06:24:16,212:14525(0x7fd121407740):ZOO_INFO@testLogCallbackSet@1010: testLogCallbackSet #9]
     [exec] Log Message Received: [2019-08-02 06:24:16,213:14525(0x7fd121407740):ZOO_INFO@zookeeper_close@3258: Closing zookeeper sessionId=0x100bcc17eb4000e to 127.0.0.1:22181
     [exec] ]
     [exec]  : elapsed 1001 : OK
     [exec] Zookeeper_simpleSystem::testLogCallbackInitLog Message Received: [2019-08-02 06:24:16,213:14525(0x7fd121407740):ZOO_INFO@log_env@1101: Client environment:zookeeper.version=zookeeper C client 3.6.0]
     [exec] Log Message Received: [2019-08-02 06:24:16,213:14525(0x7fd121407740):ZOO_INFO@log_env@1105: Client environment:host.name=asf909.gq1.ygridcore.net]
     [exec] Log Message Received: [2019-08-02 06:24:16,213:14525(0x7fd121407740):ZOO_INFO@log_env@1112: Client environment:os.name=Linux]
     [exec] Log Message Received: [2019-08-02 06:24:16,213:14525(0x7fd121407740):ZOO_INFO@log_env@1113: Client environment:os.arch=4.15.0-52-generic]
     [exec] Log Message Received: [2019-08-02 06:24:16,213:14525(0x7fd121407740):ZOO_INFO@log_env@1114: Client environment:os.version=#56-Ubuntu SMP Tue Jun 4 22:49:08 UTC 2019]
     [exec] Log Message Received: [2019-08-02 06:24:16,213:14525(0x7fd121407740):ZOO_INFO@log_env@1122: Client environment:user.name=jenkins]
     [exec] Log Message Received: [2019-08-02 06:24:16,213:14525(0x7fd121407740):ZOO_INFO@log_env@1130: Client environment:user.home=/home/jenkins]
     [exec] Log Message Received: [2019-08-02 06:24:16,213:14525(0x7fd121407740):ZOO_INFO@log_env@1142: Client environment:user.dir=<https://builds.apache.org/job/PreCommit-ZOOKEEPER-github-pr-build-maven/ws/zookeeper-client/zookeeper-client-c/target/c]>
     [exec] Log Message Received: [2019-08-02 06:24:16,213:14525(0x7fd121407740):ZOO_INFO@zookeeper_init_internal@1188: Initiating client connection, host=127.0.0.1:22181 sessionTimeout=10000 watcher=0x5573a5f7bc20 sessionId=0 sessionPasswd=<null> context=0x7ffc24ac9f50 flags=0]
     [exec] Log Message Received: [2019-08-02 06:24:16,213:14525(0x7fd11ee64700):ZOO_INFO@check_events@2475: initiated connection to server 127.0.0.1:22181]
     [exec] Log Message Received: [2019-08-02 06:24:16,231:14525(0x7fd11ee64700):ZOO_INFO@check_events@2527: session establishment complete on server 127.0.0.1:22181, sessionId=0x100bcc17eb4000f, negotiated timeout=10000 ]
     [exec] Log Message Received: [2019-08-02 06:24:17,213:14525(0x7fd121407740):ZOO_INFO@testLogCallbackInit@1032: testLogCallbackInit #0]
     [exec] Log Message Received: [2019-08-02 06:24:17,213:14525(0x7fd121407740):ZOO_INFO@testLogCallbackInit@1032: testLogCallbackInit #1]
     [exec] Log Message Received: [2019-08-02 06:24:17,213:14525(0x7fd121407740):ZOO_INFO@testLogCallbackInit@1032: testLogCallbackInit #2]
     [exec] Log Message Received: [2019-08-02 06:24:17,213:14525(0x7fd121407740):ZOO_INFO@testLogCallbackInit@1032: testLogCallbackInit #3]
     [exec] Log Message Received: [2019-08-02 06:24:17,213:14525(0x7fd121407740):ZOO_INFO@testLogCallbackInit@1032: testLogCallbackInit #4]
     [exec] Log Message Received: [2019-08-02 06:24:17,213:14525(0x7fd121407740):ZOO_INFO@testLogCallbackInit@1032: testLogCallbackInit #5]
     [exec] Log Message Received: [2019-08-02 06:24:17,213:14525(0x7fd121407740):ZOO_INFO@testLogCallbackInit@1032: testLogCallbackInit #6]
     [exec] Log Message Received: [2019-08-02 06:24:17,213:14525(0x7fd121407740):ZOO_INFO@testLogCallbackInit@1032: testLogCallbackInit #7]
     [exec] Log Message Received: [2019-08-02 06:24:17,213:14525(0x7fd121407740):ZOO_INFO@testLogCallbackInit@1032: testLogCallbackInit #8]
     [exec] Log Message Received: [2019-08-02 06:24:17,213:14525(0x7fd121407740):ZOO_INFO@testLogCallbackInit@1032: testLogCallbackInit #9]
     [exec] Log Message Received: [2019-08-02 06:24:17,213:14525(0x7fd121407740):ZOO_INFO@zookeeper_close@3258: Closing zookeeper sessionId=0x100bcc17eb4000f to 127.0.0.1:22181
     [exec] ]
     [exec]  : elapsed 1000 : OK
     [exec] Zookeeper_simpleSystem::testLogCallbackClearLog Message Received: [2019-08-02 06:24:17,214:14525(0x7fd121407740):ZOO_INFO@log_env@1101: Client environment:zookeeper.version=zookeeper C client 3.6.0]
     [exec] Log Message Received: [2019-08-02 06:24:17,214:14525(0x7fd121407740):ZOO_INFO@log_env@1105: Client environment:host.name=asf909.gq1.ygridcore.net]
     [exec] Log Message Received: [2019-08-02 06:24:17,214:14525(0x7fd121407740):ZOO_INFO@log_env@1112: Client environment:os.name=Linux]
     [exec] Log Message Received: [2019-08-02 06:24:17,214:14525(0x7fd121407740):ZOO_INFO@log_env@1113: Client environment:os.arch=4.15.0-52-generic]
     [exec] Log Message Received: [2019-08-02 06:24:17,214:14525(0x7fd121407740):ZOO_INFO@log_env@1114: Client environment:os.version=#56-Ubuntu SMP Tue Jun 4 22:49:08 UTC 2019]
     [exec] Log Message Received: [2019-08-02 06:24:17,214:14525(0x7fd121407740):ZOO_INFO@log_env@1122: Client environment:user.name=jenkins]
     [exec] Log Message Received: [2019-08-02 06:24:17,214:14525(0x7fd121407740):ZOO_INFO@log_env@1130: Client environment:user.home=/home/jenkins]
     [exec] Log Message Received: [2019-08-02 06:24:17,214:14525(0x7fd121407740):ZOO_INFO@log_env@1142: Client environment:user.dir=<https://builds.apache.org/job/PreCommit-ZOOKEEPER-github-pr-build-maven/ws/zookeeper-client/zookeeper-client-c/target/c]>
     [exec] Log Message Received: [2019-08-02 06:24:17,214:14525(0x7fd121407740):ZOO_INFO@zookeeper_init_internal@1188: Initiating client connection, host=127.0.0.1:22181 sessionTimeout=10000 watcher=0x5573a5f7bc20 sessionId=0 sessionPasswd=<null> context=0x7ffc24ac9f50 flags=0]
     [exec] Log Message Received: [2019-08-02 06:24:17,214:14525(0x7fd11e663700):ZOO_INFO@check_events@2475: initiated connection to server 127.0.0.1:22181]
     [exec] Log Message Received: [2019-08-02 06:24:17,237:14525(0x7fd11e663700):ZOO_INFO@check_events@2527: session establishment complete on server 127.0.0.1:22181, sessionId=0x100bcc17eb40010, negotiated timeout=10000 ]
     [exec]  : elapsed 1000 : OK
     [exec] Zookeeper_simpleSystem::testAsyncWatcherAutoReset ZooKeeper server started : elapsed 10707 : OK
     [exec] Zookeeper_simpleSystem::testDeserializeString : elapsed 0 : OK
     [exec] Zookeeper_simpleSystem::testFirstServerDown : elapsed 1000 : OK
     [exec] Zookeeper_simpleSystem::testNonexistentHost : elapsed 1031 : OK
     [exec] Zookeeper_simpleSystem::testNullData : elapsed 1035 : OK
     [exec] Zookeeper_simpleSystem::testIPV6 : elapsed 1016 : OK
     [exec] Zookeeper_simpleSystem::testCreate : elapsed 1016 : OK
     [exec] Zookeeper_simpleSystem::testCreateContainer : elapsed 1009 : OK
     [exec] Zookeeper_simpleSystem::testCreateTtl : elapsed 2019 : OK
     [exec] Zookeeper_simpleSystem::testPath : elapsed 1214 : OK
     [exec] Zookeeper_simpleSystem::testPathValidation : elapsed 1142 : OK
     [exec] Zookeeper_simpleSystem::testPing : elapsed 18610 : OK
     [exec] Zookeeper_simpleSystem::testAcl : elapsed 1017 : OK
     [exec] Zookeeper_simpleSystem::testChroot : elapsed 4134 : OK
     [exec] Zookeeper_simpleSystem::testAuth : assertion : elapsed 15877
     [exec] Zookeeper_simpleSystem::testHangingClient : elapsed 1213 : OK
     [exec] Zookeeper_simpleSystem::testWatcherAutoResetWithGlobal ZooKeeper server started ZooKeeper server started ZooKeeper server started : elapsed 17307 : OK
     [exec] Zookeeper_simpleSystem::testWatcherAutoResetWithLocal ZooKeeper server started ZooKeeper server started ZooKeeper server started : elapsed 16412 : OK
     [exec] Zookeeper_simpleSystem::testGetChildren2 : elapsed 1171 : OK
     [exec] Zookeeper_simpleSystem::testLastZxid : elapsed 4531 : OK
     [exec] Zookeeper_simpleSystem::testRemoveWatchers ZooKeeper server started : elapsed 4929 : OK
     [exec] Zookeeper_readOnly::testReadOnly : elapsed 4207 : OK
     [exec] Zookeeper_logClientEnv::testLogClientEnv : elapsed 0 : OK
     [exec] Zookeeper_serverRequireClientSASL::testServerRequireClientSASL : elapsed 3275 : OK
     [exec] <https://builds.apache.org/job/PreCommit-ZOOKEEPER-github-pr-build-maven/ws/zookeeper-client/zookeeper-client-c/tests/TestClient.cc>:618: Assertion: assertion failed [Expression: count == 0]
     [exec] Failures !!!
     [exec] Run: 80   Failure total: 1   Failures: 1   Errors: 0
     [exec] FAIL: zktest-mt
     [exec] ==========================================
     [exec] 1 of 2 tests failed
     [exec] Please report to user@zookeeper.apache.org
     [exec] ==========================================
     [exec] Makefile:1817: recipe for target 'check-TESTS' failed
     [exec] make[1]: Leaving directory '<https://builds.apache.org/job/PreCommit-ZOOKEEPER-github-pr-build-maven/ws/zookeeper-client/zookeeper-client-c/target/c'>
     [exec] Makefile:2073: recipe for target 'check-am' failed
     [exec] make[1]: *** [check-TESTS] Error 1
     [exec] make: *** [check-am] Error 2
[INFO] ------------------------------------------------------------------------
[INFO] Reactor Summary for Apache ZooKeeper 3.6.0-SNAPSHOT:
[INFO] 
[INFO] Apache ZooKeeper ................................... SUCCESS [ 25.189 s]
[INFO] Apache ZooKeeper - Documentation ................... SUCCESS [  9.158 s]
[INFO] Apache ZooKeeper - Jute ............................ SUCCESS [01:42 min]
[INFO] Apache ZooKeeper - Server .......................... SUCCESS [27:29 min]
[INFO] Apache ZooKeeper - Metrics Providers ............... SUCCESS [  3.314 s]
[INFO] Apache ZooKeeper - Prometheus.io Metrics Provider .. SUCCESS [ 13.337 s]
[INFO] Apache ZooKeeper - Client .......................... SUCCESS [  3.078 s]
[INFO] Apache ZooKeeper - Client - C ...................... FAILURE [06:01 min]
[INFO] Apache ZooKeeper - Recipes ......................... SKIPPED
[INFO] Apache ZooKeeper - Recipes - Election .............. SKIPPED
[INFO] Apache ZooKeeper - Recipes - Lock .................. SKIPPED
[INFO] Apache ZooKeeper - Recipes - Queue ................. SKIPPED
[INFO] Apache ZooKeeper - Assembly ........................ SKIPPED
[INFO] Apache ZooKeeper - Contrib ......................... SKIPPED
[INFO] Apache ZooKeeper - Contrib - Loggraph .............. SKIPPED
[INFO] Apache ZooKeeper - Contrib - Rest .................. SKIPPED
[INFO] Apache ZooKeeper - Contrib - ZooInspector .......... SKIPPED
[INFO] ------------------------------------------------------------------------
[INFO] BUILD FAILURE
[INFO] ------------------------------------------------------------------------
[INFO] Total time:  36:58 min
[INFO] Finished at: 2019-08-02T06:26:31Z
[INFO] ------------------------------------------------------------------------
Waiting for Jenkins to finish collecting data
[ERROR] Failed to execute goal org.apache.maven.plugins:maven-antrun-plugin:1.8:run (test-cppunit) on project zookeeper-client-c: An Ant BuildException has occured: exec returned: 2
[ERROR] around Ant part ...<exec failonerror="true" dir="<https://builds.apache.org/job/PreCommit-ZOOKEEPER-github-pr-build-maven/ws/zookeeper-client/zookeeper-client-c/target/c"> executable="make">... @ 4:177 in <https://builds.apache.org/job/PreCommit-ZOOKEEPER-github-pr-build-maven/ws/zookeeper-client/zookeeper-client-c/target/antrun/build-main.xml>
[ERROR] -> [Help 1]
[ERROR] 
[ERROR] To see the full stack trace of the errors, re-run Maven with the -e switch.
[ERROR] Re-run Maven using the -X switch to enable full debug logging.
[ERROR] 
[ERROR] For more information about the errors and possible solutions, please read the following articles:
[ERROR] [Help 1] http://cwiki.apache.org/confluence/display/MAVEN/MojoExecutionException
[ERROR] 
[ERROR] After correcting the problems, you can resume the build with the command
[ERROR]   mvn <goals> -rf :zookeeper-client-c
[JENKINS] Archiving <https://builds.apache.org/job/PreCommit-ZOOKEEPER-github-pr-build-maven/ws/zookeeper-server/pom.xml> to org.apache.zookeeper/zookeeper/3.6.0-SNAPSHOT/zookeeper-3.6.0-SNAPSHOT.pom
[JENKINS] Archiving <https://builds.apache.org/job/PreCommit-ZOOKEEPER-github-pr-build-maven/ws/zookeeper-server/target/zookeeper-3.6.0-SNAPSHOT.jar> to org.apache.zookeeper/zookeeper/3.6.0-SNAPSHOT/zookeeper-3.6.0-SNAPSHOT.jar
[JENKINS] Archiving <https://builds.apache.org/job/PreCommit-ZOOKEEPER-github-pr-build-maven/ws/zookeeper-server/target/zookeeper-3.6.0-SNAPSHOT-tests.jar> to org.apache.zookeeper/zookeeper/3.6.0-SNAPSHOT/zookeeper-3.6.0-SNAPSHOT-tests.jar
[JENKINS] Archiving <https://builds.apache.org/job/PreCommit-ZOOKEEPER-github-pr-build-maven/ws/zookeeper-server/target/zookeeper-3.6.0-SNAPSHOT-sources.jar> to org.apache.zookeeper/zookeeper/3.6.0-SNAPSHOT/zookeeper-3.6.0-SNAPSHOT-sources.jar
[JENKINS] Archiving <https://builds.apache.org/job/PreCommit-ZOOKEEPER-github-pr-build-maven/ws/zookeeper-server/target/zookeeper-3.6.0-SNAPSHOT-javadoc.jar> to org.apache.zookeeper/zookeeper/3.6.0-SNAPSHOT/zookeeper-3.6.0-SNAPSHOT-javadoc.jar
[JENKINS] Archiving <https://builds.apache.org/job/PreCommit-ZOOKEEPER-github-pr-build-maven/ws/zookeeper-contrib/zookeeper-contrib-loggraph/pom.xml> to org.apache.zookeeper/zookeeper-contrib-loggraph/3.6.0-SNAPSHOT/zookeeper-contrib-loggraph-3.6.0-SNAPSHOT.pom
[JENKINS] Archiving <https://builds.apache.org/job/PreCommit-ZOOKEEPER-github-pr-build-maven/ws/zookeeper-metrics-providers/pom.xml> to org.apache.zookeeper/zookeeper-metrics-providers/3.6.0-SNAPSHOT/zookeeper-metrics-providers-3.6.0-SNAPSHOT.pom
[JENKINS] Archiving <https://builds.apache.org/job/PreCommit-ZOOKEEPER-github-pr-build-maven/ws/zookeeper-metrics-providers/zookeeper-prometheus-metrics/pom.xml> to org.apache.zookeeper/zookeeper-prometheus-metrics/3.6.0-SNAPSHOT/zookeeper-prometheus-metrics-3.6.0-SNAPSHOT.pom
[JENKINS] Archiving <https://builds.apache.org/job/PreCommit-ZOOKEEPER-github-pr-build-maven/ws/zookeeper-metrics-providers/zookeeper-prometheus-metrics/target/zookeeper-prometheus-metrics-3.6.0-SNAPSHOT.jar> to org.apache.zookeeper/zookeeper-prometheus-metrics/3.6.0-SNAPSHOT/zookeeper-prometheus-metrics-3.6.0-SNAPSHOT.jar
[JENKINS] Archiving <https://builds.apache.org/job/PreCommit-ZOOKEEPER-github-pr-build-maven/ws/zookeeper-metrics-providers/zookeeper-prometheus-metrics/target/zookeeper-prometheus-metrics-3.6.0-SNAPSHOT-tests.jar> to org.apache.zookeeper/zookeeper-prometheus-metrics/3.6.0-SNAPSHOT/zookeeper-prometheus-metrics-3.6.0-SNAPSHOT-tests.jar
[JENKINS] Archiving <https://builds.apache.org/job/PreCommit-ZOOKEEPER-github-pr-build-maven/ws/zookeeper-metrics-providers/zookeeper-prometheus-metrics/target/zookeeper-prometheus-metrics-3.6.0-SNAPSHOT-sources.jar> to org.apache.zookeeper/zookeeper-prometheus-metrics/3.6.0-SNAPSHOT/zookeeper-prometheus-metrics-3.6.0-SNAPSHOT-sources.jar
[JENKINS] Archiving <https://builds.apache.org/job/PreCommit-ZOOKEEPER-github-pr-build-maven/ws/zookeeper-metrics-providers/zookeeper-prometheus-metrics/target/zookeeper-prometheus-metrics-3.6.0-SNAPSHOT-javadoc.jar> to org.apache.zookeeper/zookeeper-prometheus-metrics/3.6.0-SNAPSHOT/zookeeper-prometheus-metrics-3.6.0-SNAPSHOT-javadoc.jar
[JENKINS] Archiving <https://builds.apache.org/job/PreCommit-ZOOKEEPER-github-pr-build-maven/ws/zookeeper-recipes/zookeeper-recipes-election/pom.xml> to org.apache.zookeeper/zookeeper-recipes-election/3.6.0-SNAPSHOT/zookeeper-recipes-election-3.6.0-SNAPSHOT.pom
[JENKINS] Archiving <https://builds.apache.org/job/PreCommit-ZOOKEEPER-github-pr-build-maven/ws/pom.xml> to org.apache.zookeeper/parent/3.6.0-SNAPSHOT/parent-3.6.0-SNAPSHOT.pom
[JENKINS] Archiving <https://builds.apache.org/job/PreCommit-ZOOKEEPER-github-pr-build-maven/ws/zookeeper-recipes/zookeeper-recipes-lock/pom.xml> to org.apache.zookeeper/zookeeper-recipes-lock/3.6.0-SNAPSHOT/zookeeper-recipes-lock-3.6.0-SNAPSHOT.pom
[JENKINS] Archiving <https://builds.apache.org/job/PreCommit-ZOOKEEPER-github-pr-build-maven/ws/zookeeper-contrib/pom.xml> to org.apache.zookeeper/zookeeper-contrib/3.6.0-SNAPSHOT/zookeeper-contrib-3.6.0-SNAPSHOT.pom
[JENKINS] Archiving <https://builds.apache.org/job/PreCommit-ZOOKEEPER-github-pr-build-maven/ws/zookeeper-client/pom.xml> to org.apache.zookeeper/zookeeper-client/3.6.0-SNAPSHOT/zookeeper-client-3.6.0-SNAPSHOT.pom
[JENKINS] Archiving <https://builds.apache.org/job/PreCommit-ZOOKEEPER-github-pr-build-maven/ws/zookeeper-jute/pom.xml> to org.apache.zookeeper/zookeeper-jute/3.6.0-SNAPSHOT/zookeeper-jute-3.6.0-SNAPSHOT.pom
[JENKINS] Archiving <https://builds.apache.org/job/PreCommit-ZOOKEEPER-github-pr-build-maven/ws/zookeeper-jute/target/zookeeper-jute-3.6.0-SNAPSHOT.jar> to org.apache.zookeeper/zookeeper-jute/3.6.0-SNAPSHOT/zookeeper-jute-3.6.0-SNAPSHOT.jar
[JENKINS] Archiving <https://builds.apache.org/job/PreCommit-ZOOKEEPER-github-pr-build-maven/ws/zookeeper-jute/target/zookeeper-jute-3.6.0-SNAPSHOT-tests.jar> to org.apache.zookeeper/zookeeper-jute/3.6.0-SNAPSHOT/zookeeper-jute-3.6.0-SNAPSHOT-tests.jar
[JENKINS] Archiving <https://builds.apache.org/job/PreCommit-ZOOKEEPER-github-pr-build-maven/ws/zookeeper-jute/target/zookeeper-jute-3.6.0-SNAPSHOT-sources.jar> to org.apache.zookeeper/zookeeper-jute/3.6.0-SNAPSHOT/zookeeper-jute-3.6.0-SNAPSHOT-sources.jar
[JENKINS] Archiving <https://builds.apache.org/job/PreCommit-ZOOKEEPER-github-pr-build-maven/ws/zookeeper-jute/target/zookeeper-jute-3.6.0-SNAPSHOT-javadoc.jar> to org.apache.zookeeper/zookeeper-jute/3.6.0-SNAPSHOT/zookeeper-jute-3.6.0-SNAPSHOT-javadoc.jar
[JENKINS] Archiving <https://builds.apache.org/job/PreCommit-ZOOKEEPER-github-pr-build-maven/ws/zookeeper-recipes/zookeeper-recipes-queue/pom.xml> to org.apache.zookeeper/zookeeper-recipes-queue/3.6.0-SNAPSHOT/zookeeper-recipes-queue-3.6.0-SNAPSHOT.pom
[JENKINS] Archiving <https://builds.apache.org/job/PreCommit-ZOOKEEPER-github-pr-build-maven/ws/zookeeper-docs/pom.xml> to org.apache.zookeeper/zookeeper-docs/3.6.0-SNAPSHOT/zookeeper-docs-3.6.0-SNAPSHOT.pom
[JENKINS] Archiving <https://builds.apache.org/job/PreCommit-ZOOKEEPER-github-pr-build-maven/ws/zookeeper-docs/target/zookeeper-docs-3.6.0-SNAPSHOT.jar> to org.apache.zookeeper/zookeeper-docs/3.6.0-SNAPSHOT/zookeeper-docs-3.6.0-SNAPSHOT.jar
[JENKINS] Archiving <https://builds.apache.org/job/PreCommit-ZOOKEEPER-github-pr-build-maven/ws/zookeeper-docs/target/zookeeper-docs-3.6.0-SNAPSHOT-tests.jar> to org.apache.zookeeper/zookeeper-docs/3.6.0-SNAPSHOT/zookeeper-docs-3.6.0-SNAPSHOT-tests.jar
[JENKINS] Archiving <https://builds.apache.org/job/PreCommit-ZOOKEEPER-github-pr-build-maven/ws/zookeeper-docs/target/zookeeper-docs-3.6.0-SNAPSHOT-sources.jar> to org.apache.zookeeper/zookeeper-docs/3.6.0-SNAPSHOT/zookeeper-docs-3.6.0-SNAPSHOT-sources.jar
[JENKINS] Archiving <https://builds.apache.org/job/PreCommit-ZOOKEEPER-github-pr-build-maven/ws/zookeeper-recipes/pom.xml> to org.apache.zookeeper/zookeeper-recipes/3.6.0-SNAPSHOT/zookeeper-recipes-3.6.0-SNAPSHOT.pom
[JENKINS] Archiving <https://builds.apache.org/job/PreCommit-ZOOKEEPER-github-pr-build-maven/ws/zookeeper-client/zookeeper-client-c/pom.xml> to org.apache.zookeeper/zookeeper-client-c/3.6.0-SNAPSHOT/zookeeper-client-c-3.6.0-SNAPSHOT.pom
[JENKINS] Archiving <https://builds.apache.org/job/PreCommit-ZOOKEEPER-github-pr-build-maven/ws/zookeeper-contrib/zookeeper-contrib-rest/pom.xml> to org.apache.zookeeper/zookeeper-contrib-rest/3.6.0-SNAPSHOT/zookeeper-contrib-rest-3.6.0-SNAPSHOT.pom
[JENKINS] Archiving <https://builds.apache.org/job/PreCommit-ZOOKEEPER-github-pr-build-maven/ws/zookeeper-assembly/pom.xml> to org.apache.zookeeper/zookeeper-assembly/3.6.0-SNAPSHOT/zookeeper-assembly-3.6.0-SNAPSHOT.pom
[JENKINS] Archiving <https://builds.apache.org/job/PreCommit-ZOOKEEPER-github-pr-build-maven/ws/zookeeper-contrib/zookeeper-contrib-zooinspector/pom.xml> to org.apache.zookeeper/zookeeper-contrib-zooinspector/3.6.0-SNAPSHOT/zookeeper-contrib-zooinspector-3.6.0-SNAPSHOT.pom
channel stopped
[SpotBugs] Skipping execution of recorder since overall result is 'FAILURE'
Putting comment on the pull request

Jenkins build is still unstable: PreCommit-ZOOKEEPER-github-pr-build-maven #1031

Posted by Apache Jenkins Server <je...@builds.apache.org>.
See <https://builds.apache.org/job/PreCommit-ZOOKEEPER-github-pr-build-maven/1031/display/redirect>


Jenkins build is still unstable: PreCommit-ZOOKEEPER-github-pr-build-maven #1030

Posted by Apache Jenkins Server <je...@builds.apache.org>.
See <https://builds.apache.org/job/PreCommit-ZOOKEEPER-github-pr-build-maven/1030/display/redirect>


Jenkins build is still unstable: PreCommit-ZOOKEEPER-github-pr-build-maven #1029

Posted by Apache Jenkins Server <je...@builds.apache.org>.
See <https://builds.apache.org/job/PreCommit-ZOOKEEPER-github-pr-build-maven/1029/display/redirect?page=changes>


Jenkins build is still unstable: PreCommit-ZOOKEEPER-github-pr-build-maven #1028

Posted by Apache Jenkins Server <je...@builds.apache.org>.
See <https://builds.apache.org/job/PreCommit-ZOOKEEPER-github-pr-build-maven/1028/display/redirect?page=changes>


Jenkins build is still unstable: PreCommit-ZOOKEEPER-github-pr-build-maven #1027

Posted by Apache Jenkins Server <je...@builds.apache.org>.
See <https://builds.apache.org/job/PreCommit-ZOOKEEPER-github-pr-build-maven/1027/display/redirect>


Jenkins build is unstable: PreCommit-ZOOKEEPER-github-pr-build-maven #1026

Posted by Apache Jenkins Server <je...@builds.apache.org>.
See <https://builds.apache.org/job/PreCommit-ZOOKEEPER-github-pr-build-maven/1026/display/redirect>


Build failed in Jenkins: PreCommit-ZOOKEEPER-github-pr-build-maven #1025

Posted by Apache Jenkins Server <je...@builds.apache.org>.
See <https://builds.apache.org/job/PreCommit-ZOOKEEPER-github-pr-build-maven/1025/display/redirect>

------------------------------------------
[...truncated 910.66 KB...]
     [exec]  : elapsed 7189 : OK
     [exec] ZooKeeper JMX enabled by default
     [exec] Using config: <https://builds.apache.org/job/PreCommit-ZOOKEEPER-github-pr-build-maven/ws/zookeeper-client/zookeeper-client-c/../../build/test/test-cppunit/conf/0.conf>
     [exec] ZooKeeper JMX enabled by default
     [exec] Using config: <https://builds.apache.org/job/PreCommit-ZOOKEEPER-github-pr-build-maven/ws/zookeeper-client/zookeeper-client-c/../../build/test/test-cppunit/conf/1.conf>
     [exec] TestReconfigServer::testReconfigFailureWithoutServerSuperuserPasswordConfiguredStarting zookeeper ... STARTED
     [exec] Starting zookeeper ... STARTED
     [exec] ZooKeeper JMX enabled by default
     [exec] Using config: <https://builds.apache.org/job/PreCommit-ZOOKEEPER-github-pr-build-maven/ws/zookeeper-client/zookeeper-client-c/../../build/test/test-cppunit/conf/2.conf>
     [exec] ZooKeeper JMX enabled by default
     [exec] Using config: <https://builds.apache.org/job/PreCommit-ZOOKEEPER-github-pr-build-maven/ws/zookeeper-client/zookeeper-client-c/../../build/test/test-cppunit/conf/0.conf>
     [exec] Starting zookeeper ... STARTED
     [exec] ZooKeeper JMX enabled by default
     [exec] Using config: <https://builds.apache.org/job/PreCommit-ZOOKEEPER-github-pr-build-maven/ws/zookeeper-client/zookeeper-client-c/../../build/test/test-cppunit/conf/1.conf>
     [exec] ZooKeeper JMX enabled by default
     [exec] Using config: <https://builds.apache.org/job/PreCommit-ZOOKEEPER-github-pr-build-maven/ws/zookeeper-client/zookeeper-client-c/../../build/test/test-cppunit/conf/2.conf>
     [exec] ZooKeeper JMX enabled by default
     [exec] Using config: <https://builds.apache.org/job/PreCommit-ZOOKEEPER-github-pr-build-maven/ws/zookeeper-client/zookeeper-client-c/../../build/test/test-cppunit/conf/0.conf>
     [exec] ZooKeeper JMX enabled by default
     [exec] Using config: <https://builds.apache.org/job/PreCommit-ZOOKEEPER-github-pr-build-maven/ws/zookeeper-client/zookeeper-client-c/../../build/test/test-cppunit/conf/1.conf>
     [exec] Stopping zookeeper ... STOPPED
     [exec] Stopping zookeeper ... STOPPED
     [exec] ZooKeeper JMX enabled by default
     [exec] Using config: <https://builds.apache.org/job/PreCommit-ZOOKEEPER-github-pr-build-maven/ws/zookeeper-client/zookeeper-client-c/../../build/test/test-cppunit/conf/2.conf>
     [exec] ZooKeeper JMX enabled by default
     [exec] Using config: <https://builds.apache.org/job/PreCommit-ZOOKEEPER-github-pr-build-maven/ws/zookeeper-client/zookeeper-client-c/../../build/test/test-cppunit/conf/0.conf>
     [exec] Stopping zookeeper ... STOPPED
     [exec] ZooKeeper JMX enabled by default
     [exec] Using config: <https://builds.apache.org/job/PreCommit-ZOOKEEPER-github-pr-build-maven/ws/zookeeper-client/zookeeper-client-c/../../build/test/test-cppunit/conf/1.conf>
     [exec] Starting zookeeper ... STARTED
     [exec] ZooKeeper JMX enabled by default
     [exec] Using config: <https://builds.apache.org/job/PreCommit-ZOOKEEPER-github-pr-build-maven/ws/zookeeper-client/zookeeper-client-c/../../build/test/test-cppunit/conf/2.conf>
     [exec] Starting zookeeper ... STARTED
     [exec] ZooKeeper JMX enabled by default
     [exec] Using config: <https://builds.apache.org/job/PreCommit-ZOOKEEPER-github-pr-build-maven/ws/zookeeper-client/zookeeper-client-c/../../build/test/test-cppunit/conf/0.conf>
     [exec] Starting zookeeper ... STARTED
     [exec] ZooKeeper JMX enabled by default
     [exec] Using config: <https://builds.apache.org/job/PreCommit-ZOOKEEPER-github-pr-build-maven/ws/zookeeper-client/zookeeper-client-c/../../build/test/test-cppunit/conf/1.conf>
     [exec] ZooKeeper JMX enabled by default
     [exec] Using config: <https://builds.apache.org/job/PreCommit-ZOOKEEPER-github-pr-build-maven/ws/zookeeper-client/zookeeper-client-c/../../build/test/test-cppunit/conf/2.conf>
     [exec] ZooKeeper JMX enabled by default
     [exec] Using config: <https://builds.apache.org/job/PreCommit-ZOOKEEPER-github-pr-build-maven/ws/zookeeper-client/zookeeper-client-c/../../build/test/test-cppunit/conf/0.conf>
     [exec] ZooKeeper JMX enabled by default
     [exec] Using config: <https://builds.apache.org/job/PreCommit-ZOOKEEPER-github-pr-build-maven/ws/zookeeper-client/zookeeper-client-c/../../build/test/test-cppunit/conf/1.conf>
     [exec] ZooKeeper JMX enabled by default
     [exec] Using config: <https://builds.apache.org/job/PreCommit-ZOOKEEPER-github-pr-build-maven/ws/zookeeper-client/zookeeper-client-c/../../build/test/test-cppunit/conf/2.conf>
     [exec] ZooKeeper JMX enabled by default
     [exec] Using config: <https://builds.apache.org/job/PreCommit-ZOOKEEPER-github-pr-build-maven/ws/zookeeper-client/zookeeper-client-c/../../build/test/test-cppunit/conf/0.conf>
     [exec] ZooKeeper JMX enabled by default
     [exec] Using config: <https://builds.apache.org/job/PreCommit-ZOOKEEPER-github-pr-build-maven/ws/zookeeper-client/zookeeper-client-c/../../build/test/test-cppunit/conf/1.conf>
     [exec] Stopping zookeeper ... STOPPED
     [exec] Stopping zookeeper ... STOPPED
     [exec] ZooKeeper JMX enabled by default
     [exec] Using config: <https://builds.apache.org/job/PreCommit-ZOOKEEPER-github-pr-build-maven/ws/zookeeper-client/zookeeper-client-c/../../build/test/test-cppunit/conf/0.conf>
     [exec] ZooKeeper JMX enabled by default
     [exec] Using config: <https://builds.apache.org/job/PreCommit-ZOOKEEPER-github-pr-build-maven/ws/zookeeper-client/zookeeper-client-c/../../build/test/test-cppunit/conf/1.conf>
     [exec] Stopping zookeeper ... STOPPED
     [exec]  : elapsed 11356 : OK
     [exec] ZooKeeper JMX enabled by default
     [exec] Using config: <https://builds.apache.org/job/PreCommit-ZOOKEEPER-github-pr-build-maven/ws/zookeeper-client/zookeeper-client-c/../../build/test/test-cppunit/conf/2.conf>
     [exec] Zookeeper_clientretry::testRetry ZooKeeper server started ZooKeeper server started : elapsed 7809 : OK
     [exec] Zookeeper_operations::testAsyncWatcher1 : elapsed 54 : OK
     [exec] Zookeeper_operations::testAsyncGetOperation : elapsed 4 : OK
     [exec] Zookeeper_operations::testOperationsAndDisconnectConcurrently1 : elapsed 397 : OK
     [exec] Zookeeper_operations::testOperationsAndDisconnectConcurrently2 : elapsed 0 : OK
     [exec] Zookeeper_operations::testConcurrentOperations1 : elapsed 20909 : OK
     [exec] Zookeeper_multi::testCreate : elapsed 1027 : OK
     [exec] Zookeeper_multi::testCreateDelete : elapsed 1009 : OK
     [exec] Zookeeper_multi::testInvalidVersion : elapsed 1005 : OK
     [exec] Zookeeper_multi::testNestedCreate : elapsed 1008 : OK
     [exec] Zookeeper_multi::testSetData : elapsed 6015 : OK
     [exec] Zookeeper_multi::testUpdateConflict : elapsed 1009 : OK
     [exec] Zookeeper_multi::testDeleteUpdateConflict : elapsed 1005 : OK
     [exec] Zookeeper_multi::testAsyncMulti : elapsed 2000 : OK
     [exec] Zookeeper_multi::testMultiFail : elapsed 1003 : OK
     [exec] Zookeeper_multi::testCheck : elapsed 1015 : OK
     [exec] Zookeeper_multi::testWatch : elapsed 2007 : OK
     [exec] Zookeeper_multi::testSequentialNodeCreateInAsyncMulti : assertion : elapsed 2001
     [exec] Zookeeper_multi::testBigAsyncMulti : assertion : elapsed 10002
     [exec] Zookeeper_watchers::testDefaultSessionWatcher1 : elapsed 53 : OK
     [exec] Zookeeper_watchers::testDefaultSessionWatcher2 : elapsed 4 : OK
     [exec] Zookeeper_watchers::testObjectSessionWatcher1 : elapsed 55 : OK
     [exec] Zookeeper_watchers::testObjectSessionWatcher2 : elapsed 57 : OK
     [exec] Zookeeper_watchers::testNodeWatcher1 : elapsed 57 : OK
     [exec] Zookeeper_watchers::testChildWatcher1 : elapsed 55 : OK
     [exec] Zookeeper_watchers::testChildWatcher2 : elapsed 55 : OK
     [exec] Zookeeper_simpleSystem::testLogCallbackSetLog Message Received: [2019-08-01 06:33:39,405:17273(0x7f60a7a80740):ZOO_INFO@testLogCallbackSet@1010: testLogCallbackSet #0]
     [exec] Log Message Received: [2019-08-01 06:33:39,405:17273(0x7f60a7a80740):ZOO_INFO@testLogCallbackSet@1010: testLogCallbackSet #1]
     [exec] Log Message Received: [2019-08-01 06:33:39,405:17273(0x7f60a7a80740):ZOO_INFO@testLogCallbackSet@1010: testLogCallbackSet #2]
     [exec] Log Message Received: [2019-08-01 06:33:39,405:17273(0x7f60a7a80740):ZOO_INFO@testLogCallbackSet@1010: testLogCallbackSet #3]
     [exec] Log Message Received: [2019-08-01 06:33:39,405:17273(0x7f60a7a80740):ZOO_INFO@testLogCallbackSet@1010: testLogCallbackSet #4]
     [exec] Log Message Received: [2019-08-01 06:33:39,405:17273(0x7f60a7a80740):ZOO_INFO@testLogCallbackSet@1010: testLogCallbackSet #5]
     [exec] Log Message Received: [2019-08-01 06:33:39,405:17273(0x7f60a7a80740):ZOO_INFO@testLogCallbackSet@1010: testLogCallbackSet #6]
     [exec] Log Message Received: [2019-08-01 06:33:39,405:17273(0x7f60a7a80740):ZOO_INFO@testLogCallbackSet@1010: testLogCallbackSet #7]
     [exec] Log Message Received: [2019-08-01 06:33:39,405:17273(0x7f60a7a80740):ZOO_INFO@testLogCallbackSet@1010: testLogCallbackSet #8]
     [exec] Log Message Received: [2019-08-01 06:33:39,405:17273(0x7f60a7a80740):ZOO_INFO@testLogCallbackSet@1010: testLogCallbackSet #9]
     [exec] Log Message Received: [2019-08-01 06:33:39,406:17273(0x7f60a7a80740):ZOO_INFO@zookeeper_close@3258: Closing zookeeper sessionId=0x1001eb6b3c8000f to 127.0.0.1:22181
     [exec] ]
     [exec]  : elapsed 1000 : OK
     [exec] Zookeeper_simpleSystem::testLogCallbackInitLog Message Received: [2019-08-01 06:33:39,406:17273(0x7f60a7a80740):ZOO_INFO@log_env@1101: Client environment:zookeeper.version=zookeeper C client 3.6.0]
     [exec] Log Message Received: [2019-08-01 06:33:39,406:17273(0x7f60a7a80740):ZOO_INFO@log_env@1105: Client environment:host.name=asf914.gq1.ygridcore.net]
     [exec] Log Message Received: [2019-08-01 06:33:39,406:17273(0x7f60a7a80740):ZOO_INFO@log_env@1112: Client environment:os.name=Linux]
     [exec] Log Message Received: [2019-08-01 06:33:39,406:17273(0x7f60a7a80740):ZOO_INFO@log_env@1113: Client environment:os.arch=4.4.0-157-generic]
     [exec] Log Message Received: [2019-08-01 06:33:39,406:17273(0x7f60a7a80740):ZOO_INFO@log_env@1114: Client environment:os.version=#185-Ubuntu SMP Tue Jul 23 09:17:01 UTC 2019]
     [exec] Log Message Received: [2019-08-01 06:33:39,406:17273(0x7f60a7a80740):ZOO_INFO@log_env@1122: Client environment:user.name=jenkins]
     [exec] Log Message Received: [2019-08-01 06:33:39,406:17273(0x7f60a7a80740):ZOO_INFO@log_env@1130: Client environment:user.home=/home/jenkins]
     [exec] Log Message Received: [2019-08-01 06:33:39,406:17273(0x7f60a7a80740):ZOO_INFO@log_env@1142: Client environment:user.dir=<https://builds.apache.org/job/PreCommit-ZOOKEEPER-github-pr-build-maven/ws/zookeeper-client/zookeeper-client-c/target/c]>
     [exec] Log Message Received: [2019-08-01 06:33:39,406:17273(0x7f60a7a80740):ZOO_INFO@zookeeper_init_internal@1188: Initiating client connection, host=127.0.0.1:22181 sessionTimeout=10000 watcher=0x45d060 sessionId=0 sessionPasswd=<null> context=0x7ffc6ab6f360 flags=0]
     [exec] Log Message Received: [2019-08-01 06:33:39,407:17273(0x7f60a4f73700):ZOO_INFO@check_events@2475: initiated connection to server 127.0.0.1:22181]
     [exec] Log Message Received: [2019-08-01 06:33:39,409:17273(0x7f60a4f73700):ZOO_INFO@check_events@2527: session establishment complete on server 127.0.0.1:22181, sessionId=0x1001eb6b3c80010, negotiated timeout=10000 ]
     [exec] Log Message Received: [2019-08-01 06:33:40,407:17273(0x7f60a7a80740):ZOO_INFO@testLogCallbackInit@1032: testLogCallbackInit #0]
     [exec] Log Message Received: [2019-08-01 06:33:40,407:17273(0x7f60a7a80740):ZOO_INFO@testLogCallbackInit@1032: testLogCallbackInit #1]
     [exec] Log Message Received: [2019-08-01 06:33:40,407:17273(0x7f60a7a80740):ZOO_INFO@testLogCallbackInit@1032: testLogCallbackInit #2]
     [exec] Log Message Received: [2019-08-01 06:33:40,407:17273(0x7f60a7a80740):ZOO_INFO@testLogCallbackInit@1032: testLogCallbackInit #3]
     [exec] Log Message Received: [2019-08-01 06:33:40,407:17273(0x7f60a7a80740):ZOO_INFO@testLogCallbackInit@1032: testLogCallbackInit #4]
     [exec] Log Message Received: [2019-08-01 06:33:40,407:17273(0x7f60a7a80740):ZOO_INFO@testLogCallbackInit@1032: testLogCallbackInit #5]
     [exec] Log Message Received: [2019-08-01 06:33:40,407:17273(0x7f60a7a80740):ZOO_INFO@testLogCallbackInit@1032: testLogCallbackInit #6]
     [exec] Log Message Received: [2019-08-01 06:33:40,407:17273(0x7f60a7a80740):ZOO_INFO@testLogCallbackInit@1032: testLogCallbackInit #7]
     [exec] Log Message Received: [2019-08-01 06:33:40,407:17273(0x7f60a7a80740):ZOO_INFO@testLogCallbackInit@1032: testLogCallbackInit #8]
     [exec] Log Message Received: [2019-08-01 06:33:40,407:17273(0x7f60a7a80740):ZOO_INFO@testLogCallbackInit@1032: testLogCallbackInit #9]
     [exec] Log Message Received: [2019-08-01 06:33:40,407:17273(0x7f60a7a80740):ZOO_INFO@zookeeper_close@3258: Closing zookeeper sessionId=0x1001eb6b3c80010 to 127.0.0.1:22181
     [exec] ]
     [exec]  : elapsed 1001 : OK
     [exec] Zookeeper_simpleSystem::testLogCallbackClearLog Message Received: [2019-08-01 06:33:40,407:17273(0x7f60a7a80740):ZOO_INFO@log_env@1101: Client environment:zookeeper.version=zookeeper C client 3.6.0]
     [exec] Log Message Received: [2019-08-01 06:33:40,407:17273(0x7f60a7a80740):ZOO_INFO@log_env@1105: Client environment:host.name=asf914.gq1.ygridcore.net]
     [exec] Log Message Received: [2019-08-01 06:33:40,407:17273(0x7f60a7a80740):ZOO_INFO@log_env@1112: Client environment:os.name=Linux]
     [exec] Log Message Received: [2019-08-01 06:33:40,407:17273(0x7f60a7a80740):ZOO_INFO@log_env@1113: Client environment:os.arch=4.4.0-157-generic]
     [exec] Log Message Received: [2019-08-01 06:33:40,407:17273(0x7f60a7a80740):ZOO_INFO@log_env@1114: Client environment:os.version=#185-Ubuntu SMP Tue Jul 23 09:17:01 UTC 2019]
     [exec] Log Message Received: [2019-08-01 06:33:40,407:17273(0x7f60a7a80740):ZOO_INFO@log_env@1122: Client environment:user.name=jenkins]
     [exec] Log Message Received: [2019-08-01 06:33:40,407:17273(0x7f60a7a80740):ZOO_INFO@log_env@1130: Client environment:user.home=/home/jenkins]
     [exec] Log Message Received: [2019-08-01 06:33:40,407:17273(0x7f60a7a80740):ZOO_INFO@log_env@1142: Client environment:user.dir=<https://builds.apache.org/job/PreCommit-ZOOKEEPER-github-pr-build-maven/ws/zookeeper-client/zookeeper-client-c/target/c]>
     [exec] Log Message Received: [2019-08-01 06:33:40,407:17273(0x7f60a7a80740):ZOO_INFO@zookeeper_init_internal@1188: Initiating client connection, host=127.0.0.1:22181 sessionTimeout=10000 watcher=0x45d060 sessionId=0 sessionPasswd=<null> context=0x7ffc6ab6f400 flags=0]
     [exec] Log Message Received: [2019-08-01 06:33:40,408:17273(0x7f609ffff700):ZOO_INFO@check_events@2475: initiated connection to server 127.0.0.1:22181]
     [exec] Log Message Received: [2019-08-01 06:33:40,410:17273(0x7f609ffff700):ZOO_INFO@check_events@2527: session establishment complete on server 127.0.0.1:22181, sessionId=0x1001eb6b3c80011, negotiated timeout=10000 ]
     [exec]  : elapsed 1000 : OK
     [exec] Zookeeper_simpleSystem::testAsyncWatcherAutoReset ZooKeeper server started : elapsed 11444 : OK
     [exec] Zookeeper_simpleSystem::testDeserializeString : elapsed 0 : OK
     [exec] Zookeeper_simpleSystem::testFirstServerDown : elapsed 1001 : OK
     [exec] Zookeeper_simpleSystem::testNonexistentHost : elapsed 1104 : OK
     [exec] Zookeeper_simpleSystem::testNullData : elapsed 1018 : OK
     [exec] Zookeeper_simpleSystem::testIPV6 : elapsed 1004 : OK
     [exec] Zookeeper_simpleSystem::testCreate : elapsed 1006 : OK
     [exec] Zookeeper_simpleSystem::testCreateContainer : elapsed 1004 : OK
     [exec] Zookeeper_simpleSystem::testCreateTtl : elapsed 2008 : OK
     [exec] Zookeeper_simpleSystem::testPath : elapsed 1010 : OK
     [exec] Zookeeper_simpleSystem::testPathValidation : elapsed 1026 : OK
     [exec] Zookeeper_simpleSystem::testPing : elapsed 17272 : OK
     [exec] Zookeeper_simpleSystem::testAcl : elapsed 1012 : OK
     [exec] Zookeeper_simpleSystem::testChroot : elapsed 3785 : OK
     [exec] Zookeeper_simpleSystem::testAuth ZooKeeper server started ZooKeeper server started : elapsed 31852 : OK
     [exec] Zookeeper_simpleSystem::testHangingClient : elapsed 1039 : OK
     [exec] Zookeeper_simpleSystem::testWatcherAutoResetWithGlobal ZooKeeper server started ZooKeeper server started ZooKeeper server started : elapsed 18864 : OK
     [exec] Zookeeper_simpleSystem::testWatcherAutoResetWithLocal ZooKeeper server started ZooKeeper server started ZooKeeper server started : elapsed 24605 : OK
     [exec] Zookeeper_simpleSystem::testGetChildren2 : elapsed 1026 : OK
     [exec] Zookeeper_simpleSystem::testLastZxid : elapsed 4515 : OK
     [exec] Zookeeper_simpleSystem::testRemoveWatchers ZooKeeper server started : elapsed 5883 : OK
     [exec] Zookeeper_readOnly::testReadOnly : elapsed 4070 : OK
     [exec] Zookeeper_logClientEnv::testLogClientEnv : elapsed 1 : OK
     [exec] Zookeeper_serverRequireClientSASL::testServerRequireClientSASL : elapsed 3076 : OK
     [exec] <https://builds.apache.org/job/PreCommit-ZOOKEEPER-github-pr-build-maven/ws/zookeeper-client/zookeeper-client-c/tests/TestMulti.cc>:755: Assertion: equality assertion failed [Expected: 0, Actual  : 40051536]
     [exec] <https://builds.apache.org/job/PreCommit-ZOOKEEPER-github-pr-build-maven/ws/zookeeper-client/zookeeper-client-c/tests/TestMulti.cc>:213: Assertion: equality assertion failed [Expected: 1, Actual  : 0]
     [exec] Failures !!!
     [exec] Run: 80   Failure total: 2   Failures: 2   Errors: 0
     [exec] FAIL: zktest-mt
     [exec] ==========================================
     [exec] 1 of 2 tests failed
     [exec] Please report to user@zookeeper.apache.org
     [exec] ==========================================
     [exec] Makefile:1815: recipe for target 'check-TESTS' failed
     [exec] make[1]: Leaving directory '<https://builds.apache.org/job/PreCommit-ZOOKEEPER-github-pr-build-maven/ws/zookeeper-client/zookeeper-client-c/target/c'>
     [exec] Makefile:2071: recipe for target 'check-am' failed
     [exec] make[1]: *** [check-TESTS] Error 1
     [exec] make: *** [check-am] Error 2
[INFO] ------------------------------------------------------------------------
[INFO] Reactor Summary for Apache ZooKeeper 3.6.0-SNAPSHOT:
[INFO] 
[INFO] Apache ZooKeeper ................................... SUCCESS [ 25.956 s]
[INFO] Apache ZooKeeper - Documentation ................... SUCCESS [  9.016 s]
[INFO] Apache ZooKeeper - Jute ............................ SUCCESS [01:34 min]
[INFO] Apache ZooKeeper - Server .......................... SUCCESS [17:29 min]
[INFO] Apache ZooKeeper - Metrics Providers ............... SUCCESS [  3.266 s]
[INFO] Apache ZooKeeper - Prometheus.io Metrics Provider .. SUCCESS [ 14.420 s]
[INFO] Apache ZooKeeper - Client .......................... SUCCESS [  3.109 s]
[INFO] Apache ZooKeeper - Client - C ...................... FAILURE [06:02 min]
[INFO] Apache ZooKeeper - Recipes ......................... SKIPPED
[INFO] Apache ZooKeeper - Recipes - Election .............. SKIPPED
[INFO] Apache ZooKeeper - Recipes - Lock .................. SKIPPED
[INFO] Apache ZooKeeper - Recipes - Queue ................. SKIPPED
[INFO] Apache ZooKeeper - Assembly ........................ SKIPPED
[INFO] Apache ZooKeeper - Contrib ......................... SKIPPED
[INFO] Apache ZooKeeper - Contrib - Loggraph .............. SKIPPED
[INFO] Apache ZooKeeper - Contrib - Rest .................. SKIPPED
[INFO] Apache ZooKeeper - Contrib - ZooInspector .......... SKIPPED
[INFO] ------------------------------------------------------------------------
[INFO] BUILD FAILURE
[INFO] ------------------------------------------------------------------------
[INFO] Total time:  26:56 min
[INFO] Finished at: 2019-08-01T06:36:22Z
[INFO] ------------------------------------------------------------------------
Waiting for Jenkins to finish collecting data
[ERROR] Failed to execute goal org.apache.maven.plugins:maven-antrun-plugin:1.8:run (test-cppunit) on project zookeeper-client-c: An Ant BuildException has occured: exec returned: 2
[ERROR] around Ant part ...<exec failonerror="true" dir="<https://builds.apache.org/job/PreCommit-ZOOKEEPER-github-pr-build-maven/ws/zookeeper-client/zookeeper-client-c/target/c"> executable="make">... @ 4:177 in <https://builds.apache.org/job/PreCommit-ZOOKEEPER-github-pr-build-maven/ws/zookeeper-client/zookeeper-client-c/target/antrun/build-main.xml>
[ERROR] -> [Help 1]
[ERROR] 
[ERROR] To see the full stack trace of the errors, re-run Maven with the -e switch.
[ERROR] Re-run Maven using the -X switch to enable full debug logging.
[ERROR] 
[ERROR] For more information about the errors and possible solutions, please read the following articles:
[ERROR] [Help 1] http://cwiki.apache.org/confluence/display/MAVEN/MojoExecutionException
[ERROR] 
[ERROR] After correcting the problems, you can resume the build with the command
[ERROR]   mvn <goals> -rf :zookeeper-client-c
[JENKINS] Archiving <https://builds.apache.org/job/PreCommit-ZOOKEEPER-github-pr-build-maven/ws/zookeeper-server/pom.xml> to org.apache.zookeeper/zookeeper/3.6.0-SNAPSHOT/zookeeper-3.6.0-SNAPSHOT.pom
[JENKINS] Archiving <https://builds.apache.org/job/PreCommit-ZOOKEEPER-github-pr-build-maven/ws/zookeeper-server/target/zookeeper-3.6.0-SNAPSHOT.jar> to org.apache.zookeeper/zookeeper/3.6.0-SNAPSHOT/zookeeper-3.6.0-SNAPSHOT.jar
[JENKINS] Archiving <https://builds.apache.org/job/PreCommit-ZOOKEEPER-github-pr-build-maven/ws/zookeeper-server/target/zookeeper-3.6.0-SNAPSHOT-tests.jar> to org.apache.zookeeper/zookeeper/3.6.0-SNAPSHOT/zookeeper-3.6.0-SNAPSHOT-tests.jar
[JENKINS] Archiving <https://builds.apache.org/job/PreCommit-ZOOKEEPER-github-pr-build-maven/ws/zookeeper-server/target/zookeeper-3.6.0-SNAPSHOT-sources.jar> to org.apache.zookeeper/zookeeper/3.6.0-SNAPSHOT/zookeeper-3.6.0-SNAPSHOT-sources.jar
[JENKINS] Archiving <https://builds.apache.org/job/PreCommit-ZOOKEEPER-github-pr-build-maven/ws/zookeeper-server/target/zookeeper-3.6.0-SNAPSHOT-javadoc.jar> to org.apache.zookeeper/zookeeper/3.6.0-SNAPSHOT/zookeeper-3.6.0-SNAPSHOT-javadoc.jar
[JENKINS] Archiving <https://builds.apache.org/job/PreCommit-ZOOKEEPER-github-pr-build-maven/ws/zookeeper-contrib/zookeeper-contrib-loggraph/pom.xml> to org.apache.zookeeper/zookeeper-contrib-loggraph/3.6.0-SNAPSHOT/zookeeper-contrib-loggraph-3.6.0-SNAPSHOT.pom
[JENKINS] Archiving <https://builds.apache.org/job/PreCommit-ZOOKEEPER-github-pr-build-maven/ws/zookeeper-metrics-providers/pom.xml> to org.apache.zookeeper/zookeeper-metrics-providers/3.6.0-SNAPSHOT/zookeeper-metrics-providers-3.6.0-SNAPSHOT.pom
[JENKINS] Archiving <https://builds.apache.org/job/PreCommit-ZOOKEEPER-github-pr-build-maven/ws/zookeeper-metrics-providers/zookeeper-prometheus-metrics/pom.xml> to org.apache.zookeeper/zookeeper-prometheus-metrics/3.6.0-SNAPSHOT/zookeeper-prometheus-metrics-3.6.0-SNAPSHOT.pom
[JENKINS] Archiving <https://builds.apache.org/job/PreCommit-ZOOKEEPER-github-pr-build-maven/ws/zookeeper-metrics-providers/zookeeper-prometheus-metrics/target/zookeeper-prometheus-metrics-3.6.0-SNAPSHOT.jar> to org.apache.zookeeper/zookeeper-prometheus-metrics/3.6.0-SNAPSHOT/zookeeper-prometheus-metrics-3.6.0-SNAPSHOT.jar
[JENKINS] Archiving <https://builds.apache.org/job/PreCommit-ZOOKEEPER-github-pr-build-maven/ws/zookeeper-metrics-providers/zookeeper-prometheus-metrics/target/zookeeper-prometheus-metrics-3.6.0-SNAPSHOT-tests.jar> to org.apache.zookeeper/zookeeper-prometheus-metrics/3.6.0-SNAPSHOT/zookeeper-prometheus-metrics-3.6.0-SNAPSHOT-tests.jar
[JENKINS] Archiving <https://builds.apache.org/job/PreCommit-ZOOKEEPER-github-pr-build-maven/ws/zookeeper-metrics-providers/zookeeper-prometheus-metrics/target/zookeeper-prometheus-metrics-3.6.0-SNAPSHOT-sources.jar> to org.apache.zookeeper/zookeeper-prometheus-metrics/3.6.0-SNAPSHOT/zookeeper-prometheus-metrics-3.6.0-SNAPSHOT-sources.jar
[JENKINS] Archiving <https://builds.apache.org/job/PreCommit-ZOOKEEPER-github-pr-build-maven/ws/zookeeper-metrics-providers/zookeeper-prometheus-metrics/target/zookeeper-prometheus-metrics-3.6.0-SNAPSHOT-javadoc.jar> to org.apache.zookeeper/zookeeper-prometheus-metrics/3.6.0-SNAPSHOT/zookeeper-prometheus-metrics-3.6.0-SNAPSHOT-javadoc.jar
[JENKINS] Archiving <https://builds.apache.org/job/PreCommit-ZOOKEEPER-github-pr-build-maven/ws/zookeeper-recipes/zookeeper-recipes-election/pom.xml> to org.apache.zookeeper/zookeeper-recipes-election/3.6.0-SNAPSHOT/zookeeper-recipes-election-3.6.0-SNAPSHOT.pom
[JENKINS] Archiving <https://builds.apache.org/job/PreCommit-ZOOKEEPER-github-pr-build-maven/ws/pom.xml> to org.apache.zookeeper/parent/3.6.0-SNAPSHOT/parent-3.6.0-SNAPSHOT.pom
[JENKINS] Archiving <https://builds.apache.org/job/PreCommit-ZOOKEEPER-github-pr-build-maven/ws/zookeeper-recipes/zookeeper-recipes-lock/pom.xml> to org.apache.zookeeper/zookeeper-recipes-lock/3.6.0-SNAPSHOT/zookeeper-recipes-lock-3.6.0-SNAPSHOT.pom
[JENKINS] Archiving <https://builds.apache.org/job/PreCommit-ZOOKEEPER-github-pr-build-maven/ws/zookeeper-contrib/pom.xml> to org.apache.zookeeper/zookeeper-contrib/3.6.0-SNAPSHOT/zookeeper-contrib-3.6.0-SNAPSHOT.pom
[JENKINS] Archiving <https://builds.apache.org/job/PreCommit-ZOOKEEPER-github-pr-build-maven/ws/zookeeper-client/pom.xml> to org.apache.zookeeper/zookeeper-client/3.6.0-SNAPSHOT/zookeeper-client-3.6.0-SNAPSHOT.pom
[JENKINS] Archiving <https://builds.apache.org/job/PreCommit-ZOOKEEPER-github-pr-build-maven/ws/zookeeper-jute/pom.xml> to org.apache.zookeeper/zookeeper-jute/3.6.0-SNAPSHOT/zookeeper-jute-3.6.0-SNAPSHOT.pom
[JENKINS] Archiving <https://builds.apache.org/job/PreCommit-ZOOKEEPER-github-pr-build-maven/ws/zookeeper-jute/target/zookeeper-jute-3.6.0-SNAPSHOT.jar> to org.apache.zookeeper/zookeeper-jute/3.6.0-SNAPSHOT/zookeeper-jute-3.6.0-SNAPSHOT.jar
[JENKINS] Archiving <https://builds.apache.org/job/PreCommit-ZOOKEEPER-github-pr-build-maven/ws/zookeeper-jute/target/zookeeper-jute-3.6.0-SNAPSHOT-tests.jar> to org.apache.zookeeper/zookeeper-jute/3.6.0-SNAPSHOT/zookeeper-jute-3.6.0-SNAPSHOT-tests.jar
[JENKINS] Archiving <https://builds.apache.org/job/PreCommit-ZOOKEEPER-github-pr-build-maven/ws/zookeeper-jute/target/zookeeper-jute-3.6.0-SNAPSHOT-sources.jar> to org.apache.zookeeper/zookeeper-jute/3.6.0-SNAPSHOT/zookeeper-jute-3.6.0-SNAPSHOT-sources.jar
[JENKINS] Archiving <https://builds.apache.org/job/PreCommit-ZOOKEEPER-github-pr-build-maven/ws/zookeeper-jute/target/zookeeper-jute-3.6.0-SNAPSHOT-javadoc.jar> to org.apache.zookeeper/zookeeper-jute/3.6.0-SNAPSHOT/zookeeper-jute-3.6.0-SNAPSHOT-javadoc.jar
[JENKINS] Archiving <https://builds.apache.org/job/PreCommit-ZOOKEEPER-github-pr-build-maven/ws/zookeeper-recipes/zookeeper-recipes-queue/pom.xml> to org.apache.zookeeper/zookeeper-recipes-queue/3.6.0-SNAPSHOT/zookeeper-recipes-queue-3.6.0-SNAPSHOT.pom
[JENKINS] Archiving <https://builds.apache.org/job/PreCommit-ZOOKEEPER-github-pr-build-maven/ws/zookeeper-docs/pom.xml> to org.apache.zookeeper/zookeeper-docs/3.6.0-SNAPSHOT/zookeeper-docs-3.6.0-SNAPSHOT.pom
[JENKINS] Archiving <https://builds.apache.org/job/PreCommit-ZOOKEEPER-github-pr-build-maven/ws/zookeeper-docs/target/zookeeper-docs-3.6.0-SNAPSHOT.jar> to org.apache.zookeeper/zookeeper-docs/3.6.0-SNAPSHOT/zookeeper-docs-3.6.0-SNAPSHOT.jar
[JENKINS] Archiving <https://builds.apache.org/job/PreCommit-ZOOKEEPER-github-pr-build-maven/ws/zookeeper-docs/target/zookeeper-docs-3.6.0-SNAPSHOT-tests.jar> to org.apache.zookeeper/zookeeper-docs/3.6.0-SNAPSHOT/zookeeper-docs-3.6.0-SNAPSHOT-tests.jar
[JENKINS] Archiving <https://builds.apache.org/job/PreCommit-ZOOKEEPER-github-pr-build-maven/ws/zookeeper-docs/target/zookeeper-docs-3.6.0-SNAPSHOT-sources.jar> to org.apache.zookeeper/zookeeper-docs/3.6.0-SNAPSHOT/zookeeper-docs-3.6.0-SNAPSHOT-sources.jar
[JENKINS] Archiving <https://builds.apache.org/job/PreCommit-ZOOKEEPER-github-pr-build-maven/ws/zookeeper-recipes/pom.xml> to org.apache.zookeeper/zookeeper-recipes/3.6.0-SNAPSHOT/zookeeper-recipes-3.6.0-SNAPSHOT.pom
[JENKINS] Archiving <https://builds.apache.org/job/PreCommit-ZOOKEEPER-github-pr-build-maven/ws/zookeeper-client/zookeeper-client-c/pom.xml> to org.apache.zookeeper/zookeeper-client-c/3.6.0-SNAPSHOT/zookeeper-client-c-3.6.0-SNAPSHOT.pom
[JENKINS] Archiving <https://builds.apache.org/job/PreCommit-ZOOKEEPER-github-pr-build-maven/ws/zookeeper-contrib/zookeeper-contrib-rest/pom.xml> to org.apache.zookeeper/zookeeper-contrib-rest/3.6.0-SNAPSHOT/zookeeper-contrib-rest-3.6.0-SNAPSHOT.pom
[JENKINS] Archiving <https://builds.apache.org/job/PreCommit-ZOOKEEPER-github-pr-build-maven/ws/zookeeper-assembly/pom.xml> to org.apache.zookeeper/zookeeper-assembly/3.6.0-SNAPSHOT/zookeeper-assembly-3.6.0-SNAPSHOT.pom
[JENKINS] Archiving <https://builds.apache.org/job/PreCommit-ZOOKEEPER-github-pr-build-maven/ws/zookeeper-contrib/zookeeper-contrib-zooinspector/pom.xml> to org.apache.zookeeper/zookeeper-contrib-zooinspector/3.6.0-SNAPSHOT/zookeeper-contrib-zooinspector-3.6.0-SNAPSHOT.pom
channel stopped
[SpotBugs] Skipping execution of recorder since overall result is 'FAILURE'
Setting status of 765e37a605efbee160c349c66da1211aa1b90add to FAILURE with url https://builds.apache.org/job/PreCommit-ZOOKEEPER-github-pr-build-maven/1025/ and message: 'FAILURE
 '
Using context: JenkinsMaven

Jenkins build is still unstable: PreCommit-ZOOKEEPER-github-pr-build-maven #1024

Posted by Apache Jenkins Server <je...@builds.apache.org>.
See <https://builds.apache.org/job/PreCommit-ZOOKEEPER-github-pr-build-maven/1024/display/redirect?page=changes>


Jenkins build is still unstable: PreCommit-ZOOKEEPER-github-pr-build-maven #1023

Posted by Apache Jenkins Server <je...@builds.apache.org>.
See <https://builds.apache.org/job/PreCommit-ZOOKEEPER-github-pr-build-maven/1023/display/redirect?page=changes>